{"text_format":"1","workbook":"xlsx","n_sheets":3,"sheets":["Notice","Saisie","Synthèse"],"not_rendered":{"charts":0,"images":3,"macros":1,"external_links":0,"defined_names":3,"comments":2,"pivot_tables":1},"unopened":[],"bounds":{"document_bytes":16777216,"sheet_cells":100000,"rows_first":2000,"rows_last":500,"rows_between":2000,"halvings":0,"cell_chars":16384,"cell_head_chars":4096},"cells_cut":0,"cells_raw":0,"read":"whole","date_system":"1900"}

{"sheet":"Notice","index":0,"n_rows":0,"n_cols":0,"rows_kept":0,"cut":false,"hidden":false,"merged":[]}

{"sheet":"Saisie","index":1,"n_rows":1334,"n_cols":53,"rows_kept":1334,"cut":false,"hidden":false,"merged":[[10,4,10,6],[10,10,10,24],[11,4,11,12],[11,13,12,21],[11,22,12,26],[10,7,10,9],[11,29,12,31],[11,32,12,33],[12,4,12,6],[12,7,12,9],[12,10,12,12],[11,27,12,28]]}
[null,null,"Plages de codes possibles",null,1,1,1,1,1,1,1,1,1,1,1,1,1,1,1,1,1,1,1,1,1,1,1,1,1,1,1,1,1,1]
[null,null,null,null,3,3,3,2,2,2,9,9,9,2,9,9,9,9,9,9,9,9,2,9,9,2,9,3,3,9,2,2,9,9]
[null,null,null,null,8,8,8,3,3,3,0,0,0,3,0,0,0,0,0,0,0,0,9,0,0,9,0,8,8,0,3,9,0,0]
[null,null,null,null,9,9,9,9,9,9,null,null,null,9,null,null,null,null,null,null,null,null,0,null,null,0,null,9,9,null,9,0]
[null,null,null,null,0,0,0,0,0,0,null,null,null,0,null,null,null,null,null,null,null,null,null,null,null,null,null,0,0,null,0]
[]
[]
[]
[null,null,null,null,"EVALUATIONS DEPARTEMENTALES D'ACCOMPAGNEMENT DE L'APPRENTISSAGE DE LA LECTURE "]
[null,null,null,null,"CP  - Janvier 2016"]
[null,null,null,null,"Circonscription :"]
[null,null,null,null,"LIRE : Lire seul, à haute voix, un texte comprenant des mots connus et inconnus\n- Compétences d'assemblage -",null,null,null,null,null,null,null,null,"LIRE : Lire seul, à haute voix, un texte comprenant des mots connus et inconnus\n- Connaissance des mots d'usage fréquent et fluidité -",null,null,null,null,null,null,null,null,"LIRE : dégager le thème d'un paragraphe, d'un texte court\n- Compétences de traitement global et de traitement local d'un texte -",null,null,null,null,"ÉCRIRE : Écrire de manière autonome un texte de cinq à dix lignes",null,"ÉCRIRE : Copier un texte court sans erreur dans une écriture cursive lisible",null,null,"GRAMMAIRE : Identifier les phrase d'un texte en s'appuyant sur la ponctuation",null,"A","B","C","D","E","F","G","H","I","A","B","C","D","E","F","G","H","I"]
[null,null,null,null,"Compétences de base",null,null,"Compétences expertes",null,null,"Représentation syllabique",null,null,null,null,null,null,null,null,null,null,null,null,null,null,null,null,null,null,null,null,null,null,null,{"$f":"AVERAGE(AI15:AI344)","v":{"$error":"#DIV/0!"}},{"$f":"AVERAGE(AJ15:AJ344)","v":{"$error":"#DIV/0!"}},{"$error":"#DIV/0!"},{"$error":"#DIV/0!"},{"$error":"#DIV/0!"},{"$error":"#DIV/0!"},{"$error":"#DIV/0!"},{"$error":"#DIV/0!"},{"$error":"#DIV/0!"}]
["ECOLE","CLASSE","NOM Prénom","Date de naiss.","L1A","L1B","L1C","L1D","L1E","L1F","L2A","L2B","L2C","L3","L4A","L4B","L4C","L4D","L4E","L4F","L4G","L4H","L5A","L5B","L5C","L5D","L5E","E1A","E1B","E2A","E2B","E2C","G1A","G1B","Lire : identification des mots\nCompétences de base","Lire : identification des mots\nCompétences expertes","Lire : identification des mots\nReprésentation syllabique","Lire : identification des mots\nMots d'usage fréquent et fluidité","Lire : comprendre","Écrire : Encodage","Ecrire : Copie","Grammaire","Général"]
[null,null,null,null,null,null,null,null,null,null,null,null,null,null,null,null,null,null,null,null,null,null,null,null,null,null,null,null,null,null,null,null,null,null,{"$f":"IF(COUNTA(E15:G15)>0,(COUNTIF(E15:G15,\"=0\")*0+COUNTIF(E15:G15,\"=1\")*100+COUNTIF(E15:G15,\"=2\")*80+COUNTIF(E15:G15,\"=3\")*50+COUNTIF(E15:G15,\"=8\")*20+COUNTIF(E15:G15,\"=9\")*0)/COUNTA(E15:G15)/100,\"N/A\")","v":"N/A"},{"$f":"IF(COUNTA(H15:J15)>0,(COUNTIF(H15:J15,\"=0\")*0+COUNTIF(H15:J15,\"=1\")*100+COUNTIF(H15:J15,\"=2\")*80+COUNTIF(H15:J15,\"=3\")*50+COUNTIF(H15:J15,\"=8\")*20+COUNTIF(H15:J15,\"=9\")*0)/COUNTA(H15:J15)/100,\"N/A\")","v":"N/A"},{"$f":"IF(COUNTA(K15:M15)>0,(COUNTIF(K15:M15,\"=0\")*0+COUNTIF(K15:M15,\"=1\")*100+COUNTIF(K15:M15,\"=2\")*80+COUNTIF(K15:M15,\"=3\")*50+COUNTIF(K15:M15,\"=8\")*20+COUNTIF(K15:M15,\"=9\")*0)/COUNTA(K15:M15)/100,\"N/A\")","v":"N/A"},{"$f":"IF(COUNTA(N15:V15)>0,(COUNTIF(N15:V15,\"=0\")*0+COUNTIF(N15:V15,\"=1\")*100+COUNTIF(N15:V15,\"=2\")*80+COUNTIF(N15:V15,\"=3\")*50+COUNTIF(N15:V15,\"=8\")*20+COUNTIF(N15:V15,\"=9\")*0)/COUNTA(N15:V15)/100,\"N/A\")","v":"N/A"},{"$f":"IF(COUNTA(W15:AA15)>0,(COUNTIF(W15:AA15,\"=0\")*0+COUNTIF(W15:AA15,\"=1\")*100+COUNTIF(W15:AA15,\"=2\")*80+COUNTIF(W15:AA15,\"=3\")*50+COUNTIF(W15:AA15,\"=8\")*20+COUNTIF(W15:AA15,\"=9\")*0)/COUNTA(W15:AA15)/100,\"N/A\")","v":"N/A"},{"$f":"IF(COUNTA(AB15:AC15)>0,(COUNTIF(AB15:AC15,\"=0\")*0+COUNTIF(AB15:AC15,\"=1\")*100+COUNTIF(AB15:AC15,\"=2\")*80+COUNTIF(AB15:AC15,\"=3\")*50+COUNTIF(AB15:AC15,\"=8\")*20+COUNTIF(AB15:AC15,\"=9\")*0)/COUNTA(AB15:AC15)/100,\"N/A\")","v":"N/A"},{"$f":"IF(COUNTA((AD15:AF15))>0,(COUNTIF((AD15:AF15),\"=0\")*0+COUNTIF((AD15:AF15),\"=1\")*100+COUNTIF((AD15:AF15),\"=2\")*80+COUNTIF((AD15:AF15),\"=3\")*50+COUNTIF((AD15:AF15),\"=8\")*20+COUNTIF((AD15:AF15),\"=9\")*0)/COUNTA((AD15:AF15))/100,\"N/A\")","v":"N/A"},{"$f":"IF(COUNTA(AG15:AH15)>0,(COUNTIF(AG15:AH15,\"=0\")*0+COUNTIF(AG15:AH15,\"=1\")*100+COUNTIF(AG15:AH15,\"=2\")*80+COUNTIF(AG15:AH15,\"=3\")*50+COUNTIF(AG15:AH15,\"=8\")*20+COUNTIF(AG15:AH15,\"=9\")*0)/COUNTA(AG15:AH15)/100,\"N/A\")","v":"N/A"},{"$f":"IF(AND(COUNTA(E15:AH15)<>0,B15<>\"\"),AVERAGE(AL15:AP15,AI15),\"N/A\")","v":"N/A"},{"$f":"IF(AI15=\"N/A\",1,\"\")","v":1},1,{"$f":"IF(AK15=\"N/A\",1,\"\")","v":1},{"$f":"IF(AL15=\"N/A\",1,\"\")","v":1},{"$f":"IF(AM15=\"N/A\",1,\"\")","v":1},{"$f":"IF(AN15=\"N/A\",1,\"\")","v":1},{"$f":"IF(AO15=\"N/A\",1,\"\")","v":1},{"$f":"IF(AP15=\"N/A\",1,\"\")","v":1},1]
[null,null,null,null,null,null,null,null,null,null,null,null,null,null,null,null,null,null,null,null,null,null,null,null,null,null,null,null,null,null,null,null,null,null,"N/A","N/A","N/A","N/A","N/A","N/A","N/A","N/A","N/A",1,1,1,1,1,1,1,1,1,{"$f":"COUNTA(#REF!)","v":1}]
[null,null,null,null,null,null,null,null,null,null,null,null,null,null,null,null,null,null,null,null,null,null,null,null,null,null,null,null,null,null,null,null,null,null,"N/A","N/A","N/A","N/A","N/A","N/A","N/A","N/A","N/A",1,1,1,1,1,1,1,1,1,{"$f":"IF(#REF!<>\"\",#REF!,\"\")","v":{"$error":"#REF!"}}]
[null,null,null,null,null,null,null,null,null,null,null,null,null,null,null,null,null,null,null,null,null,null,null,null,null,null,null,null,null,null,null,null,null,null,"N/A","N/A","N/A","N/A","N/A","N/A","N/A","N/A","N/A",1,1,1,1,1,1,1,1,1,{"$f":"IF(#REF!<>\"\",#REF!,\"\")","v":{"$error":"#REF!"}}]
[null,null,null,null,null,null,null,null,null,null,null,null,null,null,null,null,null,null,null,null,null,null,null,null,null,null,null,null,null,null,null,null,null,null,"N/A","N/A","N/A","N/A","N/A","N/A","N/A","N/A","N/A",1,1,1,1,1,1,1,1,1,{"$f":"IF(#REF!<>\"\",#REF!,\"\")","v":{"$error":"#REF!"}}]
[null,null,null,null,null,null,null,null,null,null,null,null,null,null,null,null,null,null,null,null,null,null,null,null,null,null,null,null,null,null,null,null,null,null,"N/A","N/A","N/A","N/A","N/A","N/A","N/A","N/A","N/A",1,1,1,1,1,1,1,1,1,{"$f":"IF(#REF!<>\"\",#REF!,\"\")","v":{"$error":"#REF!"}}]
[null,null,null,null,null,null,null,null,null,null,null,null,null,null,null,null,null,null,null,null,null,null,null,null,null,null,null,null,null,null,null,null,null,null,"N/A","N/A","N/A","N/A","N/A","N/A","N/A","N/A","N/A",1,1,1,1,1,1,1,1,1,{"$f":"IF(#REF!<>\"\",#REF!,\"\")","v":{"$error":"#REF!"}}]
[null,null,null,null,null,null,null,null,null,null,null,null,null,null,null,null,null,null,null,null,null,null,null,null,null,null,null,null,null,null,null,null,null,null,"N/A","N/A","N/A","N/A","N/A","N/A","N/A","N/A","N/A",1,1,1,1,1,1,1,1,1,{"$f":"IF(#REF!<>\"\",#REF!,\"\")","v":{"$error":"#REF!"}}]
[null,null,null,null,null,null,null,null,null,null,null,null,null,null,null,null,null,null,null,null,null,null,null,null,null,null,null,null,null,null,null,null,null,null,"N/A","N/A","N/A","N/A","N/A","N/A","N/A","N/A","N/A",1,1,1,1,1,1,1,1,1,{"$f":"IF(#REF!<>\"\",#REF!,\"\")","v":{"$error":"#REF!"}}]
[null,null,null,null,null,null,null,null,null,null,null,null,null,null,null,null,null,null,null,null,null,null,null,null,null,null,null,null,null,null,null,null,null,null,"N/A","N/A","N/A","N/A","N/A","N/A","N/A","N/A","N/A",1,1,1,1,1,1,1,1,1,{"$f":"IF(#REF!<>\"\",#REF!,\"\")","v":{"$error":"#REF!"}}]
[null,null,null,null,null,null,null,null,null,null,null,null,null,null,null,null,null,null,null,null,null,null,null,null,null,null,null,null,null,null,null,null,null,null,"N/A","N/A","N/A","N/A","N/A","N/A","N/A","N/A","N/A",1,1,1,1,1,1,1,1,1,{"$f":"IF(#REF!<>\"\",#REF!,\"\")","v":{"$error":"#REF!"}}]
[null,null,null,null,null,null,null,null,null,null,null,null,null,null,null,null,null,null,null,null,null,null,null,null,null,null,null,null,null,null,null,null,null,null,"N/A","N/A","N/A","N/A","N/A","N/A","N/A","N/A","N/A",1,1,1,1,1,1,1,1,1,{"$f":"IF(#REF!<>\"\",#REF!,\"\")","v":{"$error":"#REF!"}}]
[null,null,null,null,null,null,null,null,null,null,null,null,null,null,null,null,null,null,null,null,null,null,null,null,null,null,null,null,null,null,null,null,null,null,"N/A","N/A","N/A","N/A","N/A","N/A","N/A","N/A","N/A",1,1,1,1,1,1,1,1,1,{"$f":"IF(#REF!<>\"\",#REF!,\"\")","v":{"$error":"#REF!"}}]
[null,null,null,null,null,null,null,null,null,null,null,null,null,null,null,null,null,null,null,null,null,null,null,null,null,null,null,null,null,null,null,null,null,null,"N/A","N/A","N/A","N/A","N/A","N/A","N/A","N/A","N/A",1,1,1,1,1,1,1,1,1]
[null,null,null,null,null,null,null,null,null,null,null,null,null,null,null,null,null,null,null,null,null,null,null,null,null,null,null,null,null,null,null,null,null,null,"N/A","N/A","N/A","N/A","N/A","N/A","N/A","N/A","N/A",1,1,1,1,1,1,1,1,1]
[null,null,null,null,null,null,null,null,null,null,null,null,null,null,null,null,null,null,null,null,null,null,null,null,null,null,null,null,null,null,null,null,null,null,"N/A","N/A","N/A","N/A","N/A","N/A","N/A","N/A","N/A",1,1,1,1,1,1,1,1,1]
[null,null,null,null,null,null,null,null,null,null,null,null,null,null,null,null,null,null,null,null,null,null,null,null,null,null,null,null,null,null,null,null,null,null,"N/A","N/A","N/A","N/A","N/A","N/A","N/A","N/A","N/A",1,1,1,1,1,1,1,1,1]
[null,null,null,null,null,null,null,null,null,null,null,null,null,null,null,null,null,null,null,null,null,null,null,null,null,null,null,null,null,null,null,null,null,null,"N/A","N/A","N/A","N/A","N/A","N/A","N/A","N/A","N/A",1,1,1,1,1,1,1,1,1]
[null,null,null,null,null,null,null,null,null,null,null,null,null,null,null,null,null,null,null,null,null,null,null,null,null,null,null,null,null,null,null,null,null,null,"N/A","N/A","N/A","N/A","N/A","N/A","N/A","N/A","N/A",1,1,1,1,1,1,1,1,1]
[null,null,null,null,null,null,null,null,null,null,null,null,null,null,null,null,null,null,null,null,null,null,null,null,null,null,null,null,null,null,null,null,null,null,"N/A","N/A","N/A","N/A","N/A","N/A","N/A","N/A","N/A",1,1,1,1,1,1,1,1,1]
[null,null,null,null,null,null,null,null,null,null,null,null,null,null,null,null,null,null,null,null,null,null,null,null,null,null,null,null,null,null,null,null,null,null,"N/A","N/A","N/A","N/A","N/A","N/A","N/A","N/A","N/A",1,1,1,1,1,1,1,1,1]
[null,null,null,null,null,null,null,null,null,null,null,null,null,null,null,null,null,null,null,null,null,null,null,null,null,null,null,null,null,null,null,null,null,null,"N/A","N/A","N/A","N/A","N/A","N/A","N/A","N/A","N/A",1,1,1,1,1,1,1,1,1]
[null,null,null,null,null,null,null,null,null,null,null,null,null,null,null,null,null,null,null,null,null,null,null,null,null,null,null,null,null,null,null,null,null,null,"N/A","N/A","N/A","N/A","N/A","N/A","N/A","N/A","N/A",1,1,1,1,1,1,1,1,1]
[null,null,null,null,null,null,null,null,null,null,null,null,null,null,null,null,null,null,null,null,null,null,null,null,null,null,null,null,null,null,null,null,null,null,"N/A","N/A","N/A","N/A","N/A","N/A","N/A","N/A","N/A",1,1,1,1,1,1,1,1,1]
[null,null,null,null,null,null,null,null,null,null,null,null,null,null,null,null,null,null,null,null,null,null,null,null,null,null,null,null,null,null,null,null,null,null,"N/A","N/A","N/A","N/A","N/A","N/A","N/A","N/A","N/A",1,1,1,1,1,1,1,1,1]
[null,null,null,null,null,null,null,null,null,null,null,null,null,null,null,null,null,null,null,null,null,null,null,null,null,null,null,null,null,null,null,null,null,null,"N/A","N/A","N/A","N/A","N/A","N/A","N/A","N/A","N/A",1,1,1,1,1,1,1,1,1]
[null,null,null,null,null,null,null,null,null,null,null,null,null,null,null,null,null,null,null,null,null,null,null,null,null,null,null,null,null,null,null,null,null,null,"N/A","N/A","N/A","N/A","N/A","N/A","N/A","N/A","N/A",1,1,1,1,1,1,1,1,1]
[null,null,null,null,null,null,null,null,null,null,null,null,null,null,null,null,null,null,null,null,null,null,null,null,null,null,null,null,null,null,null,null,null,null,"N/A","N/A","N/A","N/A","N/A","N/A","N/A","N/A","N/A",1,1,1,1,1,1,1,1,1]
[null,null,null,null,null,null,null,null,null,null,null,null,null,null,null,null,null,null,null,null,null,null,null,null,null,null,null,null,null,null,null,null,null,null,"N/A","N/A","N/A","N/A","N/A","N/A","N/A","N/A","N/A",1,1,1,1,1,1,1,1,1]
[null,null,null,null,null,null,null,null,null,null,null,null,null,null,null,null,null,null,null,null,null,null,null,null,null,null,null,null,null,null,null,null,null,null,"N/A","N/A","N/A","N/A","N/A","N/A","N/A","N/A","N/A",1,1,1,1,1,1,1,1,1]
[null,null,null,null,null,null,null,null,null,null,null,null,null,null,null,null,null,null,null,null,null,null,null,null,null,null,null,null,null,null,null,null,null,null,"N/A","N/A","N/A","N/A","N/A","N/A","N/A","N/A","N/A",1,1,1,1,1,1,1,1,1]
[null,null,null,null,null,null,null,null,null,null,null,null,null,null,null,null,null,null,null,null,null,null,null,null,null,null,null,null,null,null,null,null,null,null,"N/A","N/A","N/A","N/A","N/A","N/A","N/A","N/A","N/A",1,1,1,1,1,1,1,1,1]
[null,null,null,null,null,null,null,null,null,null,null,null,null,null,null,null,null,null,null,null,null,null,null,null,null,null,null,null,null,null,null,null,null,null,{"$f":"IF(COUNTA(E47:G47)>0,(COUNTIF(E47:G47,\"=0\")*0+COUNTIF(E47:G47,\"=1\")*100+COUNTIF(E47:G47,\"=2\")*80+COUNTIF(E47:G47,\"=3\")*50+COUNTIF(E47:G47,\"=8\")*20+COUNTIF(E47:G47,\"=9\")*0)/COUNTA(E47:G47)/100,\"N/A\")","v":"N/A"},{"$f":"IF(COUNTA(H47:J47)>0,(COUNTIF(H47:J47,\"=0\")*0+COUNTIF(H47:J47,\"=1\")*100+COUNTIF(H47:J47,\"=2\")*80+COUNTIF(H47:J47,\"=3\")*50+COUNTIF(H47:J47,\"=8\")*20+COUNTIF(H47:J47,\"=9\")*0)/COUNTA(H47:J47)/100,\"N/A\")","v":"N/A"},{"$f":"IF(COUNTA(K47:M47)>0,(COUNTIF(K47:M47,\"=0\")*0+COUNTIF(K47:M47,\"=1\")*100+COUNTIF(K47:M47,\"=2\")*80+COUNTIF(K47:M47,\"=3\")*50+COUNTIF(K47:M47,\"=8\")*20+COUNTIF(K47:M47,\"=9\")*0)/COUNTA(K47:M47)/100,\"N/A\")","v":"N/A"},{"$f":"IF(COUNTA(N47:V47)>0,(COUNTIF(N47:V47,\"=0\")*0+COUNTIF(N47:V47,\"=1\")*100+COUNTIF(N47:V47,\"=2\")*80+COUNTIF(N47:V47,\"=3\")*50+COUNTIF(N47:V47,\"=8\")*20+COUNTIF(N47:V47,\"=9\")*0)/COUNTA(N47:V47)/100,\"N/A\")","v":"N/A"},{"$f":"IF(COUNTA(W47:AA47)>0,(COUNTIF(W47:AA47,\"=0\")*0+COUNTIF(W47:AA47,\"=1\")*100+COUNTIF(W47:AA47,\"=2\")*80+COUNTIF(W47:AA47,\"=3\")*50+COUNTIF(W47:AA47,\"=8\")*20+COUNTIF(W47:AA47,\"=9\")*0)/COUNTA(W47:AA47)/100,\"N/A\")","v":"N/A"},{"$f":"IF(COUNTA(AB47:AC47)>0,(COUNTIF(AB47:AC47,\"=0\")*0+COUNTIF(AB47:AC47,\"=1\")*100+COUNTIF(AB47:AC47,\"=2\")*80+COUNTIF(AB47:AC47,\"=3\")*50+COUNTIF(AB47:AC47,\"=8\")*20+COUNTIF(AB47:AC47,\"=9\")*0)/COUNTA(AB47:AC47)/100,\"N/A\")","v":"N/A"},{"$f":"IF(COUNTA((AD47:AF47))>0,(COUNTIF((AD47:AF47),\"=0\")*0+COUNTIF((AD47:AF47),\"=1\")*100+COUNTIF((AD47:AF47),\"=2\")*80+COUNTIF((AD47:AF47),\"=3\")*50+COUNTIF((AD47:AF47),\"=8\")*20+COUNTIF((AD47:AF47),\"=9\")*0)/COUNTA((AD47:AF47))/100,\"N/A\")","v":"N/A"},{"$f":"IF(COUNTA(AG47:AH47)>0,(COUNTIF(AG47:AH47,\"=0\")*0+COUNTIF(AG47:AH47,\"=1\")*100+COUNTIF(AG47:AH47,\"=2\")*80+COUNTIF(AG47:AH47,\"=3\")*50+COUNTIF(AG47:AH47,\"=8\")*20+COUNTIF(AG47:AH47,\"=9\")*0)/COUNTA(AG47:AH47)/100,\"N/A\")","v":"N/A"},{"$f":"IF(AND(COUNTA(E47:AH47)<>0,B47<>\"\"),AVERAGE(AL47:AP47,AI47),\"N/A\")","v":"N/A"},{"$f":"IF(AI47=\"N/A\",1,\"\")","v":1},1,1,1,1,1,1,1,1]
[null,null,null,null,null,null,null,null,null,null,null,null,null,null,null,null,null,null,null,null,null,null,null,null,null,null,null,null,null,null,null,null,null,null,"N/A","N/A","N/A","N/A","N/A","N/A","N/A","N/A","N/A",1,1,1,1,1,1,1,1,1]
[null,null,null,null,null,null,null,null,null,null,null,null,null,null,null,null,null,null,null,null,null,null,null,null,null,null,null,null,null,null,null,null,null,null,"N/A","N/A","N/A","N/A","N/A","N/A","N/A","N/A","N/A",1,1,1,1,1,1,1,1,1]
[null,null,null,null,null,null,null,null,null,null,null,null,null,null,null,null,null,null,null,null,null,null,null,null,null,null,null,null,null,null,null,null,null,null,"N/A","N/A","N/A","N/A","N/A","N/A","N/A","N/A","N/A",1,1,1,1,1,1,1,1,1]
[null,null,null,null,null,null,null,null,null,null,null,null,null,null,null,null,null,null,null,null,null,null,null,null,null,null,null,null,null,null,null,null,null,null,"N/A","N/A","N/A","N/A","N/A","N/A","N/A","N/A","N/A",1,1,1,1,1,1,1,1,1]
[null,null,null,null,null,null,null,null,null,null,null,null,null,null,null,null,null,null,null,null,null,null,null,null,null,null,null,null,null,null,null,null,null,null,"N/A","N/A","N/A","N/A","N/A","N/A","N/A","N/A","N/A",1,1,1,1,1,1,1,1,1]
[null,null,null,null,null,null,null,null,null,null,null,null,null,null,null,null,null,null,null,null,null,null,null,null,null,null,null,null,null,null,null,null,null,null,"N/A","N/A","N/A","N/A","N/A","N/A","N/A","N/A","N/A",1,1,1,1,1,1,1,1,1]
[null,null,null,null,null,null,null,null,null,null,null,null,null,null,null,null,null,null,null,null,null,null,null,null,null,null,null,null,null,null,null,null,null,null,"N/A","N/A","N/A","N/A","N/A","N/A","N/A","N/A","N/A",1,1,1,1,1,1,1,1,1]
[null,null,null,null,null,null,null,null,null,null,null,null,null,null,null,null,null,null,null,null,null,null,null,null,null,null,null,null,null,null,null,null,null,null,"N/A","N/A","N/A","N/A","N/A","N/A","N/A","N/A","N/A",1,1,1,1,1,1,1,1,1]
[null,null,null,null,null,null,null,null,null,null,null,null,null,null,null,null,null,null,null,null,null,null,null,null,null,null,null,null,null,null,null,null,null,null,"N/A","N/A","N/A","N/A","N/A","N/A","N/A","N/A","N/A",1,1,1,1,1,1,1,1,1]
[null,null,null,null,null,null,null,null,null,null,null,null,null,null,null,null,null,null,null,null,null,null,null,null,null,null,null,null,null,null,null,null,null,null,"N/A","N/A","N/A","N/A","N/A","N/A","N/A","N/A","N/A",1,1,1,1,1,1,1,1,1]
[null,null,null,null,null,null,null,null,null,null,null,null,null,null,null,null,null,null,null,null,null,null,null,null,null,null,null,null,null,null,null,null,null,null,"N/A","N/A","N/A","N/A","N/A","N/A","N/A","N/A","N/A",1,1,1,1,1,1,1,1,1]
[null,null,null,null,null,null,null,null,null,null,null,null,null,null,null,null,null,null,null,null,null,null,null,null,null,null,null,null,null,null,null,null,null,null,"N/A","N/A","N/A","N/A","N/A","N/A","N/A","N/A","N/A",1,1,1,1,1,1,1,1,1]
[null,null,null,null,null,null,null,null,null,null,null,null,null,null,null,null,null,null,null,null,null,null,null,null,null,null,null,null,null,null,null,null,null,null,"N/A","N/A","N/A","N/A","N/A","N/A","N/A","N/A","N/A",1,1,1,1,1,1,1,1,1]
[null,null,null,null,null,null,null,null,null,null,null,null,null,null,null,null,null,null,null,null,null,null,null,null,null,null,null,null,null,null,null,null,null,null,"N/A","N/A","N/A","N/A","N/A","N/A","N/A","N/A","N/A",1,1,1,1,1,1,1,1,1]
[null,null,null,null,null,null,null,null,null,null,null,null,null,null,null,null,null,null,null,null,null,null,null,null,null,null,null,null,null,null,null,null,null,null,"N/A","N/A","N/A","N/A","N/A","N/A","N/A","N/A","N/A",1,1,1,1,1,1,1,1,1]
[null,null,null,null,null,null,null,null,null,null,null,null,null,null,null,null,null,null,null,null,null,null,null,null,null,null,null,null,null,null,null,null,null,null,"N/A","N/A","N/A","N/A","N/A","N/A","N/A","N/A","N/A",1,1,1,1,1,1,1,{"$f":"IF(AP63=\"N/A\",1,\"\")","v":1},1]
[null,null,null,null,null,null,null,null,null,null,null,null,null,null,null,null,null,null,null,null,null,null,null,null,null,null,null,null,null,null,null,null,null,null,"N/A","N/A","N/A","N/A","N/A","N/A","N/A","N/A","N/A",{"$f":"IF(AI64=\"N/A\",1,\"\")","v":1},1,1,1,1,1,1,1,1]
[null,null,null,null,null,null,null,null,null,null,null,null,null,null,null,null,null,null,null,null,null,null,null,null,null,null,null,null,null,null,null,null,null,null,"N/A","N/A","N/A","N/A","N/A","N/A","N/A","N/A","N/A",1,1,1,1,1,1,1,1,1]
[null,null,null,null,null,null,null,null,null,null,null,null,null,null,null,null,null,null,null,null,null,null,null,null,null,null,null,null,null,null,null,null,null,null,"N/A","N/A","N/A","N/A","N/A","N/A","N/A","N/A","N/A",1,1,1,1,1,1,1,1,1]
[null,null,null,null,null,null,null,null,null,null,null,null,null,null,null,null,null,null,null,null,null,null,null,null,null,null,null,null,null,null,null,null,null,null,"N/A","N/A","N/A","N/A","N/A","N/A","N/A","N/A","N/A",1,1,1,1,1,1,1,1,1]
[null,null,null,null,null,null,null,null,null,null,null,null,null,null,null,null,null,null,null,null,null,null,null,null,null,null,null,null,null,null,null,null,null,null,"N/A","N/A","N/A","N/A","N/A","N/A","N/A","N/A","N/A",1,1,1,1,1,1,1,1,1]
[null,null,null,null,null,null,null,null,null,null,null,null,null,null,null,null,null,null,null,null,null,null,null,null,null,null,null,null,null,null,null,null,null,null,"N/A","N/A","N/A","N/A","N/A","N/A","N/A","N/A","N/A",1,1,1,1,1,1,1,1,1]
[null,null,null,null,null,null,null,null,null,null,null,null,null,null,null,null,null,null,null,null,null,null,null,null,null,null,null,null,null,null,null,null,null,null,"N/A","N/A","N/A","N/A","N/A","N/A","N/A","N/A","N/A",1,1,1,1,1,1,1,1,1]
[null,null,null,null,null,null,null,null,null,null,null,null,null,null,null,null,null,null,null,null,null,null,null,null,null,null,null,null,null,null,null,null,null,null,"N/A","N/A","N/A","N/A","N/A","N/A","N/A","N/A","N/A",1,1,1,1,1,1,1,1,1]
[null,null,null,null,null,null,null,null,null,null,null,null,null,null,null,null,null,null,null,null,null,null,null,null,null,null,null,null,null,null,null,null,null,null,"N/A","N/A","N/A","N/A","N/A","N/A","N/A","N/A","N/A",1,1,1,1,1,1,1,1,1]
[null,null,null,null,null,null,null,null,null,null,null,null,null,null,null,null,null,null,null,null,null,null,null,null,null,null,null,null,null,null,null,null,null,null,"N/A","N/A","N/A","N/A","N/A","N/A","N/A","N/A","N/A",1,1,1,1,1,1,1,1,1]
[null,null,null,null,null,null,null,null,null,null,null,null,null,null,null,null,null,null,null,null,null,null,null,null,null,null,null,null,null,null,null,null,null,null,"N/A","N/A","N/A","N/A","N/A","N/A","N/A","N/A","N/A",1,1,1,1,1,1,1,1,1]
[null,null,null,null,null,null,null,null,null,null,null,null,null,null,null,null,null,null,null,null,null,null,null,null,null,null,null,null,null,null,null,null,null,null,"N/A","N/A","N/A","N/A","N/A","N/A","N/A","N/A","N/A",1,1,1,1,1,1,1,1,1]
[null,null,null,null,null,null,null,null,null,null,null,null,null,null,null,null,null,null,null,null,null,null,null,null,null,null,null,null,null,null,null,null,null,null,"N/A","N/A","N/A","N/A","N/A","N/A","N/A","N/A","N/A",1,1,1,1,1,1,1,1,1]
[null,null,null,null,null,null,null,null,null,null,null,null,null,null,null,null,null,null,null,null,null,null,null,null,null,null,null,null,null,null,null,null,null,null,"N/A","N/A","N/A","N/A","N/A","N/A","N/A","N/A","N/A",1,1,1,1,1,1,1,1,1]
[null,null,null,null,null,null,null,null,null,null,null,null,null,null,null,null,null,null,null,null,null,null,null,null,null,null,null,null,null,null,null,null,null,null,"N/A","N/A","N/A","N/A","N/A","N/A","N/A","N/A","N/A",1,1,1,1,1,1,1,1,1]
[null,null,null,null,null,null,null,null,null,null,null,null,null,null,null,null,null,null,null,null,null,null,null,null,null,null,null,null,null,null,null,null,null,null,"N/A","N/A","N/A","N/A","N/A","N/A","N/A","N/A",{"$f":"IF(AND(COUNTA(E79:AH79)<>0,B79<>\"\"),AVERAGE(AL79:AP79,AI79),\"N/A\")","v":"N/A"},1,1,1,1,1,1,1,1,1]
[null,null,null,null,null,null,null,null,null,null,null,null,null,null,null,null,null,null,null,null,null,null,null,null,null,null,null,null,null,null,null,null,null,null,{"$f":"IF(COUNTA(E80:G80)>0,(COUNTIF(E80:G80,\"=0\")*0+COUNTIF(E80:G80,\"=1\")*100+COUNTIF(E80:G80,\"=2\")*80+COUNTIF(E80:G80,\"=3\")*50+COUNTIF(E80:G80,\"=8\")*20+COUNTIF(E80:G80,\"=9\")*0)/COUNTA(E80:G80)/100,\"N/A\")","v":"N/A"},{"$f":"IF(COUNTA(H80:J80)>0,(COUNTIF(H80:J80,\"=0\")*0+COUNTIF(H80:J80,\"=1\")*100+COUNTIF(H80:J80,\"=2\")*80+COUNTIF(H80:J80,\"=3\")*50+COUNTIF(H80:J80,\"=8\")*20+COUNTIF(H80:J80,\"=9\")*0)/COUNTA(H80:J80)/100,\"N/A\")","v":"N/A"},{"$f":"IF(COUNTA(K80:M80)>0,(COUNTIF(K80:M80,\"=0\")*0+COUNTIF(K80:M80,\"=1\")*100+COUNTIF(K80:M80,\"=2\")*80+COUNTIF(K80:M80,\"=3\")*50+COUNTIF(K80:M80,\"=8\")*20+COUNTIF(K80:M80,\"=9\")*0)/COUNTA(K80:M80)/100,\"N/A\")","v":"N/A"},{"$f":"IF(COUNTA(N80:V80)>0,(COUNTIF(N80:V80,\"=0\")*0+COUNTIF(N80:V80,\"=1\")*100+COUNTIF(N80:V80,\"=2\")*80+COUNTIF(N80:V80,\"=3\")*50+COUNTIF(N80:V80,\"=8\")*20+COUNTIF(N80:V80,\"=9\")*0)/COUNTA(N80:V80)/100,\"N/A\")","v":"N/A"},{"$f":"IF(COUNTA(W80:AA80)>0,(COUNTIF(W80:AA80,\"=0\")*0+COUNTIF(W80:AA80,\"=1\")*100+COUNTIF(W80:AA80,\"=2\")*80+COUNTIF(W80:AA80,\"=3\")*50+COUNTIF(W80:AA80,\"=8\")*20+COUNTIF(W80:AA80,\"=9\")*0)/COUNTA(W80:AA80)/100,\"N/A\")","v":"N/A"},{"$f":"IF(COUNTA(AB80:AC80)>0,(COUNTIF(AB80:AC80,\"=0\")*0+COUNTIF(AB80:AC80,\"=1\")*100+COUNTIF(AB80:AC80,\"=2\")*80+COUNTIF(AB80:AC80,\"=3\")*50+COUNTIF(AB80:AC80,\"=8\")*20+COUNTIF(AB80:AC80,\"=9\")*0)/COUNTA(AB80:AC80)/100,\"N/A\")","v":"N/A"},{"$f":"IF(COUNTA((AD80:AF80))>0,(COUNTIF((AD80:AF80),\"=0\")*0+COUNTIF((AD80:AF80),\"=1\")*100+COUNTIF((AD80:AF80),\"=2\")*80+COUNTIF((AD80:AF80),\"=3\")*50+COUNTIF((AD80:AF80),\"=8\")*20+COUNTIF((AD80:AF80),\"=9\")*0)/COUNTA((AD80:AF80))/100,\"N/A\")","v":"N/A"},{"$f":"IF(COUNTA(AG80:AH80)>0,(COUNTIF(AG80:AH80,\"=0\")*0+COUNTIF(AG80:AH80,\"=1\")*100+COUNTIF(AG80:AH80,\"=2\")*80+COUNTIF(AG80:AH80,\"=3\")*50+COUNTIF(AG80:AH80,\"=8\")*20+COUNTIF(AG80:AH80,\"=9\")*0)/COUNTA(AG80:AH80)/100,\"N/A\")","v":"N/A"},{"$f":"IF(AND(COUNTA(E80:AH80)<>0,B80<>\"\"),AVERAGE(AL80:AP80,AI80),\"N/A\")","v":"N/A"},1,1,1,1,1,1,1,1,1]
[null,null,null,null,null,null,null,null,null,null,null,null,null,null,null,null,null,null,null,null,null,null,null,null,null,null,null,null,null,null,null,null,null,null,"N/A","N/A","N/A","N/A","N/A","N/A","N/A","N/A","N/A",1,1,1,1,1,1,1,1,1]
[null,null,null,null,null,null,null,null,null,null,null,null,null,null,null,null,null,null,null,null,null,null,null,null,null,null,null,null,null,null,null,null,null,null,"N/A","N/A","N/A","N/A","N/A","N/A","N/A","N/A","N/A",1,1,1,1,1,1,1,1,1]
[null,null,null,null,null,null,null,null,null,null,null,null,null,null,null,null,null,null,null,null,null,null,null,null,null,null,null,null,null,null,null,null,null,null,"N/A","N/A","N/A","N/A","N/A","N/A","N/A","N/A","N/A",1,1,1,1,1,1,1,1,1]
[null,null,null,null,null,null,null,null,null,null,null,null,null,null,null,null,null,null,null,null,null,null,null,null,null,null,null,null,null,null,null,null,null,null,"N/A","N/A","N/A","N/A","N/A","N/A","N/A","N/A","N/A",1,1,1,1,1,1,1,1,1]
[null,null,null,null,null,null,null,null,null,null,null,null,null,null,null,null,null,null,null,null,null,null,null,null,null,null,null,null,null,null,null,null,null,null,"N/A","N/A","N/A","N/A","N/A","N/A","N/A","N/A","N/A",1,1,1,1,1,1,1,1,1]
[null,null,null,null,null,null,null,null,null,null,null,null,null,null,null,null,null,null,null,null,null,null,null,null,null,null,null,null,null,null,null,null,null,null,"N/A","N/A","N/A","N/A","N/A","N/A","N/A","N/A","N/A",1,1,1,1,1,1,1,1,1]
[null,null,null,null,null,null,null,null,null,null,null,null,null,null,null,null,null,null,null,null,null,null,null,null,null,null,null,null,null,null,null,null,null,null,"N/A","N/A","N/A","N/A","N/A","N/A","N/A","N/A","N/A",1,1,1,1,1,1,1,1,1]
[null,null,null,null,null,null,null,null,null,null,null,null,null,null,null,null,null,null,null,null,null,null,null,null,null,null,null,null,null,null,null,null,null,null,"N/A","N/A","N/A","N/A","N/A","N/A","N/A","N/A","N/A",1,1,1,1,1,1,1,1,1]
[null,null,null,null,null,null,null,null,null,null,null,null,null,null,null,null,null,null,null,null,null,null,null,null,null,null,null,null,null,null,null,null,null,null,"N/A","N/A","N/A","N/A","N/A","N/A","N/A","N/A","N/A",1,1,1,1,1,1,1,1,1]
[null,null,null,null,null,null,null,null,null,null,null,null,null,null,null,null,null,null,null,null,null,null,null,null,null,null,null,null,null,null,null,null,null,null,"N/A","N/A","N/A","N/A","N/A","N/A","N/A","N/A","N/A",1,1,1,1,1,1,1,1,1]
[null,null,null,null,null,null,null,null,null,null,null,null,null,null,null,null,null,null,null,null,null,null,null,null,null,null,null,null,null,null,null,null,null,null,"N/A","N/A","N/A","N/A","N/A","N/A","N/A","N/A","N/A",1,1,1,1,1,1,1,1,1]
[null,null,null,null,null,null,null,null,null,null,null,null,null,null,null,null,null,null,null,null,null,null,null,null,null,null,null,null,null,null,null,null,null,null,"N/A","N/A","N/A","N/A","N/A","N/A","N/A","N/A","N/A",1,1,1,{"$f":"IF(AL92=\"N/A\",1,\"\")","v":1},1,1,1,1,1]
[null,null,null,null,null,null,null,null,null,null,null,null,null,null,null,null,null,null,null,null,null,null,null,null,null,null,null,null,null,null,null,null,null,null,"N/A","N/A","N/A","N/A","N/A","N/A","N/A","N/A","N/A",{"$f":"IF(AI93=\"N/A\",1,\"\")","v":1},1,1,1,1,1,1,1,1]
[null,null,null,null,null,null,null,null,null,null,null,null,null,null,null,null,null,null,null,null,null,null,null,null,null,null,null,null,null,null,null,null,null,null,"N/A","N/A","N/A","N/A","N/A","N/A","N/A","N/A","N/A",1,1,1,1,1,1,1,1,1]
[null,null,null,null,null,null,null,null,null,null,null,null,null,null,null,null,null,null,null,null,null,null,null,null,null,null,null,null,null,null,null,null,null,null,"N/A","N/A","N/A","N/A","N/A","N/A","N/A","N/A","N/A",1,1,1,1,1,1,1,1,1]
[null,null,null,null,null,null,null,null,null,null,null,null,null,null,null,null,null,null,null,null,null,null,null,null,null,null,null,null,null,null,null,null,null,null,"N/A","N/A","N/A","N/A","N/A","N/A","N/A","N/A","N/A",1,1,1,1,1,1,1,1,1]
[null,null,null,null,null,null,null,null,null,null,null,null,null,null,null,null,null,null,null,null,null,null,null,null,null,null,null,null,null,null,null,null,null,null,"N/A","N/A","N/A","N/A","N/A","N/A","N/A","N/A","N/A",1,1,1,1,1,1,1,1,1]
[null,null,null,null,null,null,null,null,null,null,null,null,null,null,null,null,null,null,null,null,null,null,null,null,null,null,null,null,null,null,null,null,null,null,"N/A","N/A","N/A","N/A","N/A","N/A","N/A","N/A","N/A",1,1,1,1,1,1,1,1,1]
[null,null,null,null,null,null,null,null,null,null,null,null,null,null,null,null,null,null,null,null,null,null,null,null,null,null,null,null,null,null,null,null,null,null,"N/A","N/A","N/A","N/A","N/A","N/A","N/A","N/A","N/A",1,1,1,1,1,1,1,1,1]
[null,null,null,null,null,null,null,null,null,null,null,null,null,null,null,null,null,null,null,null,null,null,null,null,null,null,null,null,null,null,null,null,null,null,"N/A","N/A","N/A","N/A","N/A","N/A","N/A","N/A","N/A",1,1,1,1,1,1,1,1,1]
[null,null,null,null,null,null,null,null,null,null,null,null,null,null,null,null,null,null,null,null,null,null,null,null,null,null,null,null,null,null,null,null,null,null,"N/A","N/A","N/A","N/A","N/A","N/A","N/A","N/A","N/A",1,1,1,1,1,1,1,1,1]
[null,null,null,null,null,null,null,null,null,null,null,null,null,null,null,null,null,null,null,null,null,null,null,null,null,null,null,null,null,null,null,null,null,null,"N/A","N/A","N/A","N/A","N/A","N/A","N/A","N/A","N/A",1,1,1,1,1,1,1,1,1]
[null,null,null,null,null,null,null,null,null,null,null,null,null,null,null,null,null,null,null,null,null,null,null,null,null,null,null,null,null,null,null,null,null,null,"N/A","N/A","N/A","N/A","N/A","N/A","N/A","N/A","N/A",1,1,1,1,1,1,1,1,1]
[null,null,null,null,null,null,null,null,null,null,null,null,null,null,null,null,null,null,null,null,null,null,null,null,null,null,null,null,null,null,null,null,null,null,"N/A","N/A","N/A","N/A","N/A","N/A","N/A","N/A","N/A",1,1,1,1,1,1,1,1,1]
[null,null,null,null,null,null,null,null,null,null,null,null,null,null,null,null,null,null,null,null,null,null,null,null,null,null,null,null,null,null,null,null,null,null,"N/A","N/A","N/A","N/A","N/A","N/A","N/A","N/A","N/A",1,1,1,1,1,1,1,1,1]
[null,null,null,null,null,null,null,null,null,null,null,null,null,null,null,null,null,null,null,null,null,null,null,null,null,null,null,null,null,null,null,null,null,null,"N/A","N/A","N/A","N/A","N/A","N/A","N/A","N/A","N/A",1,1,1,1,1,1,1,1,1]
[null,null,null,null,null,null,null,null,null,null,null,null,null,null,null,null,null,null,null,null,null,null,null,null,null,null,null,null,null,null,null,null,null,null,"N/A","N/A","N/A","N/A","N/A","N/A","N/A","N/A","N/A",1,1,1,1,1,1,1,1,1]
[null,null,null,null,null,null,null,null,null,null,null,null,null,null,null,null,null,null,null,null,null,null,null,null,null,null,null,null,null,null,null,null,null,null,"N/A","N/A","N/A","N/A","N/A","N/A","N/A","N/A","N/A",1,1,1,1,1,1,1,1,1]
[null,null,null,null,null,null,null,null,null,null,null,null,null,null,null,null,null,null,null,null,null,null,null,null,null,null,null,null,null,null,null,null,null,null,"N/A","N/A","N/A","N/A","N/A","N/A","N/A","N/A","N/A",1,1,1,1,1,1,1,1,1]
[null,null,null,null,null,null,null,null,null,null,null,null,null,null,null,null,null,null,null,null,null,null,null,null,null,null,null,null,null,null,null,null,null,null,"N/A","N/A","N/A","N/A","N/A","N/A","N/A","N/A","N/A",1,1,1,1,1,1,1,1,1]
[null,null,null,null,null,null,null,null,null,null,null,null,null,null,null,null,null,null,null,null,null,null,null,null,null,null,null,null,null,null,null,null,null,null,"N/A","N/A","N/A","N/A","N/A","N/A","N/A","N/A","N/A",1,1,1,1,1,1,1,1,1]
[null,null,null,null,null,null,null,null,null,null,null,null,null,null,null,null,null,null,null,null,null,null,null,null,null,null,null,null,null,null,null,null,null,null,"N/A","N/A","N/A","N/A","N/A","N/A","N/A","N/A","N/A",1,1,1,1,1,1,1,1,1]
[null,null,null,null,null,null,null,null,null,null,null,null,null,null,null,null,null,null,null,null,null,null,null,null,null,null,null,null,null,null,null,null,null,null,"N/A","N/A","N/A","N/A","N/A","N/A","N/A","N/A","N/A",1,1,1,1,1,1,1,1,1]
[null,null,null,null,null,null,null,null,null,null,null,null,null,null,null,null,null,null,null,null,null,null,null,null,null,null,null,null,null,null,null,null,null,null,"N/A","N/A","N/A","N/A","N/A","N/A","N/A","N/A","N/A",1,1,1,1,1,1,1,1,1]
[null,null,null,null,null,null,null,null,null,null,null,null,null,null,null,null,null,null,null,null,null,null,null,null,null,null,null,null,null,null,null,null,null,null,"N/A","N/A","N/A","N/A","N/A","N/A","N/A","N/A","N/A",1,1,1,1,1,1,1,1,1]
[null,null,null,null,null,null,null,null,null,null,null,null,null,null,null,null,null,null,null,null,null,null,null,null,null,null,null,null,null,null,null,null,null,null,"N/A","N/A","N/A","N/A","N/A","N/A","N/A","N/A","N/A",1,1,1,1,1,1,1,1,1]
[null,null,null,null,null,null,null,null,null,null,null,null,null,null,null,null,null,null,null,null,null,null,null,null,null,null,null,null,null,null,null,null,null,null,"N/A","N/A","N/A","N/A","N/A","N/A","N/A","N/A","N/A",1,1,1,1,1,1,1,1,1]
[null,null,null,null,null,null,null,null,null,null,null,null,null,null,null,null,null,null,null,null,null,null,null,null,null,null,null,null,null,null,null,null,null,null,"N/A","N/A","N/A","N/A","N/A","N/A","N/A","N/A","N/A",1,1,1,1,1,1,1,1,1]
[null,null,null,null,null,null,null,null,null,null,null,null,null,null,null,null,null,null,null,null,null,null,null,null,null,null,null,null,null,null,null,null,null,null,"N/A","N/A","N/A","N/A","N/A","N/A","N/A","N/A","N/A",1,1,1,1,1,1,1,1,1]
[null,null,null,null,null,null,null,null,null,null,null,null,null,null,null,null,null,null,null,null,null,null,null,null,null,null,null,null,null,null,null,null,null,null,"N/A","N/A","N/A","N/A","N/A","N/A","N/A","N/A","N/A",1,1,1,1,1,1,1,1,1]
[null,null,null,null,null,null,null,null,null,null,null,null,null,null,null,null,null,null,null,null,null,null,null,null,null,null,null,null,null,null,null,null,null,null,"N/A","N/A","N/A","N/A","N/A","N/A","N/A","N/A","N/A",1,1,1,1,1,1,1,1,1]
[null,null,null,null,null,null,null,null,null,null,null,null,null,null,null,null,null,null,null,null,null,null,null,null,null,null,null,null,null,null,null,null,null,null,"N/A","N/A","N/A","N/A","N/A","N/A","N/A","N/A","N/A",1,1,1,1,1,1,1,1,1]
[null,null,null,null,null,null,null,null,null,null,null,null,null,null,null,null,null,null,null,null,null,null,null,null,null,null,null,null,null,null,null,null,null,null,"N/A","N/A","N/A","N/A","N/A","N/A","N/A","N/A","N/A",1,1,1,1,1,1,1,1,1]
[null,null,null,null,null,null,null,null,null,null,null,null,null,null,null,null,null,null,null,null,null,null,null,null,null,null,null,null,null,null,null,null,null,null,"N/A","N/A","N/A","N/A","N/A","N/A","N/A","N/A","N/A",1,1,1,1,1,1,1,1,1]
[null,null,null,null,null,null,null,null,null,null,null,null,null,null,null,null,null,null,null,null,null,null,null,null,null,null,null,null,null,null,null,null,null,null,"N/A","N/A","N/A","N/A","N/A","N/A","N/A","N/A","N/A",{"$f":"IF(AI125=\"N/A\",1,\"\")","v":1},1,1,1,1,1,1,1,1]
[null,null,null,null,null,null,null,null,null,null,null,null,null,null,null,null,null,null,null,null,null,null,null,null,null,null,null,null,null,null,null,null,null,null,"N/A","N/A","N/A","N/A","N/A","N/A","N/A","N/A","N/A",1,1,1,1,1,1,1,1,1]
[null,null,null,null,null,null,null,null,null,null,null,null,null,null,null,null,null,null,null,null,null,null,null,null,null,null,null,null,null,null,null,null,null,null,"N/A","N/A","N/A","N/A","N/A","N/A","N/A","N/A","N/A",1,1,1,1,1,1,1,1,1]
[null,null,null,null,null,null,null,null,null,null,null,null,null,null,null,null,null,null,null,null,null,null,null,null,null,null,null,null,null,null,null,null,null,null,"N/A","N/A","N/A","N/A","N/A","N/A","N/A","N/A","N/A",1,1,1,1,1,1,1,1,1]
[null,null,null,null,null,null,null,null,null,null,null,null,null,null,null,null,null,null,null,null,null,null,null,null,null,null,null,null,null,null,null,null,null,null,"N/A","N/A","N/A","N/A","N/A","N/A","N/A","N/A","N/A",1,1,1,1,1,1,1,1,1]
[null,null,null,null,null,null,null,null,null,null,null,null,null,null,null,null,null,null,null,null,null,null,null,null,null,null,null,null,null,null,null,null,null,null,"N/A","N/A","N/A","N/A","N/A","N/A","N/A","N/A","N/A",1,1,1,1,1,1,1,1,1]
[null,null,null,null,null,null,null,null,null,null,null,null,null,null,null,null,null,null,null,null,null,null,null,null,null,null,null,null,null,null,null,null,null,null,"N/A","N/A","N/A","N/A","N/A","N/A","N/A","N/A","N/A",1,1,1,1,1,1,1,1,1]
[null,null,null,null,null,null,null,null,null,null,null,null,null,null,null,null,null,null,null,null,null,null,null,null,null,null,null,null,null,null,null,null,null,null,"N/A","N/A","N/A","N/A","N/A","N/A","N/A","N/A","N/A",1,1,1,1,1,1,1,1,1]
[null,null,null,null,null,null,null,null,null,null,null,null,null,null,null,null,null,null,null,null,null,null,null,null,null,null,null,null,null,null,null,null,null,null,"N/A","N/A","N/A","N/A","N/A","N/A","N/A","N/A","N/A",1,1,1,1,1,1,1,1,1]
[null,null,null,null,null,null,null,null,null,null,null,null,null,null,null,null,null,null,null,null,null,null,null,null,null,null,null,null,null,null,null,null,null,null,"N/A","N/A","N/A","N/A","N/A","N/A","N/A","N/A","N/A",1,1,1,1,1,1,1,1,1]
[null,null,null,null,null,null,null,null,null,null,null,null,null,null,null,null,null,null,null,null,null,null,null,null,null,null,null,null,null,null,null,null,null,null,"N/A","N/A","N/A","N/A","N/A","N/A","N/A","N/A","N/A",1,1,1,1,1,1,1,1,1]
[null,null,null,null,null,null,null,null,null,null,null,null,null,null,null,null,null,null,null,null,null,null,null,null,null,null,null,null,null,null,null,null,null,null,"N/A","N/A","N/A","N/A","N/A","N/A","N/A","N/A","N/A",1,1,1,1,1,1,1,1,1]
[null,null,null,null,null,null,null,null,null,null,null,null,null,null,null,null,null,null,null,null,null,null,null,null,null,null,null,null,null,null,null,null,null,null,"N/A","N/A","N/A","N/A","N/A","N/A","N/A","N/A","N/A",1,1,1,1,1,1,1,1,1]
[null,null,null,null,null,null,null,null,null,null,null,null,null,null,null,null,null,null,null,null,null,null,null,null,null,null,null,null,null,null,null,null,null,null,"N/A","N/A","N/A","N/A","N/A","N/A","N/A","N/A","N/A",1,1,1,1,1,1,1,1,1]
[null,null,null,null,null,null,null,null,null,null,null,null,null,null,null,null,null,null,null,null,null,null,null,null,null,null,null,null,null,null,null,null,null,null,"N/A","N/A","N/A","N/A","N/A","N/A","N/A","N/A","N/A",1,1,1,1,1,1,1,1,1]
[null,null,null,null,null,null,null,null,null,null,null,null,null,null,null,null,null,null,null,null,null,null,null,null,null,null,null,null,null,null,null,null,null,null,"N/A","N/A","N/A","N/A","N/A","N/A","N/A","N/A","N/A",1,1,1,1,1,1,1,1,1]
[null,null,null,null,null,null,null,null,null,null,null,null,null,null,null,null,null,null,null,null,null,null,null,null,null,null,null,null,null,null,null,null,null,null,"N/A","N/A","N/A","N/A","N/A","N/A","N/A","N/A","N/A",1,1,1,1,1,1,1,1,1]
[null,null,null,null,null,null,null,null,null,null,null,null,null,null,null,null,null,null,null,null,null,null,null,null,null,null,null,null,null,null,null,null,null,null,"N/A","N/A","N/A","N/A","N/A","N/A","N/A","N/A","N/A",1,1,1,1,1,1,1,1,1]
[null,null,null,null,null,null,null,null,null,null,null,null,null,null,null,null,null,null,null,null,null,null,null,null,null,null,null,null,null,null,null,null,null,null,"N/A","N/A","N/A","N/A","N/A","N/A","N/A","N/A","N/A",1,1,1,1,1,1,1,1,1]
[null,null,null,null,null,null,null,null,null,null,null,null,null,null,null,null,null,null,null,null,null,null,null,null,null,null,null,null,null,null,null,null,null,null,{"$f":"IF(COUNTA(E144:G144)>0,(COUNTIF(E144:G144,\"=0\")*0+COUNTIF(E144:G144,\"=1\")*100+COUNTIF(E144:G144,\"=2\")*80+COUNTIF(E144:G144,\"=3\")*50+COUNTIF(E144:G144,\"=8\")*20+COUNTIF(E144:G144,\"=9\")*0)/COUNTA(E144:G144)/100,\"N/A\")","v":"N/A"},{"$f":"IF(COUNTA(H144:J144)>0,(COUNTIF(H144:J144,\"=0\")*0+COUNTIF(H144:J144,\"=1\")*100+COUNTIF(H144:J144,\"=2\")*80+COUNTIF(H144:J144,\"=3\")*50+COUNTIF(H144:J144,\"=8\")*20+COUNTIF(H144:J144,\"=9\")*0)/COUNTA(H144:J144)/100,\"N/A\")","v":"N/A"},{"$f":"IF(COUNTA(K144:M144)>0,(COUNTIF(K144:M144,\"=0\")*0+COUNTIF(K144:M144,\"=1\")*100+COUNTIF(K144:M144,\"=2\")*80+COUNTIF(K144:M144,\"=3\")*50+COUNTIF(K144:M144,\"=8\")*20+COUNTIF(K144:M144,\"=9\")*0)/COUNTA(K144:M144)/100,\"N/A\")","v":"N/A"},{"$f":"IF(COUNTA(N144:V144)>0,(COUNTIF(N144:V144,\"=0\")*0+COUNTIF(N144:V144,\"=1\")*100+COUNTIF(N144:V144,\"=2\")*80+COUNTIF(N144:V144,\"=3\")*50+COUNTIF(N144:V144,\"=8\")*20+COUNTIF(N144:V144,\"=9\")*0)/COUNTA(N144:V144)/100,\"N/A\")","v":"N/A"},{"$f":"IF(COUNTA(W144:AA144)>0,(COUNTIF(W144:AA144,\"=0\")*0+COUNTIF(W144:AA144,\"=1\")*100+COUNTIF(W144:AA144,\"=2\")*80+COUNTIF(W144:AA144,\"=3\")*50+COUNTIF(W144:AA144,\"=8\")*20+COUNTIF(W144:AA144,\"=9\")*0)/COUNTA(W144:AA144)/100,\"N/A\")","v":"N/A"},{"$f":"IF(COUNTA(AB144:AC144)>0,(COUNTIF(AB144:AC144,\"=0\")*0+COUNTIF(AB144:AC144,\"=1\")*100+COUNTIF(AB144:AC144,\"=2\")*80+COUNTIF(AB144:AC144,\"=3\")*50+COUNTIF(AB144:AC144,\"=8\")*20+COUNTIF(AB144:AC144,\"=9\")*0)/COUNTA(AB144:AC144)/100,\"N/A\")","v":"N/A"},{"$f":"IF(COUNTA((AD144:AF144))>0,(COUNTIF((AD144:AF144),\"=0\")*0+COUNTIF((AD144:AF144),\"=1\")*100+COUNTIF((AD144:AF144),\"=2\")*80+COUNTIF((AD144:AF144),\"=3\")*50+COUNTIF((AD144:AF144),\"=8\")*20+COUNTIF((AD144:AF144),\"=9\")*0)/COUNTA((AD144:AF144))/100,\"N/A\")","v":"N/A"},{"$f":"IF(COUNTA(AG144:AH144)>0,(COUNTIF(AG144:AH144,\"=0\")*0+COUNTIF(AG144:AH144,\"=1\")*100+COUNTIF(AG144:AH144,\"=2\")*80+COUNTIF(AG144:AH144,\"=3\")*50+COUNTIF(AG144:AH144,\"=8\")*20+COUNTIF(AG144:AH144,\"=9\")*0)/COUNTA(AG144:AH144)/100,\"N/A\")","v":"N/A"},{"$f":"IF(AND(COUNTA(E144:AH144)<>0,B144<>\"\"),AVERAGE(AL144:AP144,AI144),\"N/A\")","v":"N/A"},1,1,1,1,1,1,1,1,1]
[null,null,null,null,null,null,null,null,null,null,null,null,null,null,null,null,null,null,null,null,null,null,null,null,null,null,null,null,null,null,null,null,null,null,"N/A","N/A","N/A","N/A","N/A","N/A","N/A","N/A","N/A",1,1,1,1,1,1,1,1,1]
[null,null,null,null,null,null,null,null,null,null,null,null,null,null,null,null,null,null,null,null,null,null,null,null,null,null,null,null,null,null,null,null,null,null,"N/A","N/A","N/A","N/A","N/A","N/A","N/A","N/A","N/A",1,1,1,1,1,1,1,1,1]
[null,null,null,null,null,null,null,null,null,null,null,null,null,null,null,null,null,null,null,null,null,null,null,null,null,null,null,null,null,null,null,null,null,null,"N/A","N/A","N/A","N/A","N/A","N/A","N/A","N/A","N/A",1,1,1,1,1,1,1,1,1]
[null,null,null,null,null,null,null,null,null,null,null,null,null,null,null,null,null,null,null,null,null,null,null,null,null,null,null,null,null,null,null,null,null,null,"N/A","N/A","N/A","N/A","N/A","N/A","N/A","N/A","N/A",1,1,1,1,1,1,1,1,1]
[null,null,null,null,null,null,null,null,null,null,null,null,null,null,null,null,null,null,null,null,null,null,null,null,null,null,null,null,null,null,null,null,null,null,"N/A","N/A","N/A","N/A","N/A","N/A","N/A","N/A","N/A",1,1,1,1,1,1,1,1,1]
[null,null,null,null,null,null,null,null,null,null,null,null,null,null,null,null,null,null,null,null,null,null,null,null,null,null,null,null,null,null,null,null,null,null,"N/A","N/A","N/A","N/A","N/A","N/A","N/A","N/A","N/A",1,1,1,1,1,1,1,1,1]
[null,null,null,null,null,null,null,null,null,null,null,null,null,null,null,null,null,null,null,null,null,null,null,null,null,null,null,null,null,null,null,null,null,null,"N/A","N/A","N/A","N/A","N/A","N/A","N/A","N/A","N/A",1,1,1,1,1,1,1,1,1]
[null,null,null,null,null,null,null,null,null,null,null,null,null,null,null,null,null,null,null,null,null,null,null,null,null,null,null,null,null,null,null,null,null,null,"N/A","N/A","N/A","N/A","N/A","N/A","N/A","N/A","N/A",1,1,1,1,1,1,1,1,1]
[null,null,null,null,null,null,null,null,null,null,null,null,null,null,null,null,null,null,null,null,null,null,null,null,null,null,null,null,null,null,null,null,null,null,"N/A","N/A","N/A","N/A","N/A","N/A","N/A","N/A","N/A",1,1,1,{"$f":"IF(AL153=\"N/A\",1,\"\")","v":1},1,1,1,1,1]
[null,null,null,null,null,null,null,null,null,null,null,null,null,null,null,null,null,null,null,null,null,null,null,null,null,null,null,null,null,null,null,null,null,null,"N/A","N/A","N/A","N/A","N/A","N/A","N/A","N/A","N/A",{"$f":"IF(AI154=\"N/A\",1,\"\")","v":1},1,1,1,1,1,1,1,1]
[null,null,null,null,null,null,null,null,null,null,null,null,null,null,null,null,null,null,null,null,null,null,null,null,null,null,null,null,null,null,null,null,null,null,"N/A","N/A","N/A","N/A","N/A","N/A","N/A","N/A","N/A",1,1,1,1,1,1,1,1,1]
[null,null,null,null,null,null,null,null,null,null,null,null,null,null,null,null,null,null,null,null,null,null,null,null,null,null,null,null,null,null,null,null,null,null,"N/A","N/A","N/A","N/A","N/A","N/A","N/A","N/A","N/A",1,1,1,1,1,1,1,1,1]
[null,null,null,null,null,null,null,null,null,null,null,null,null,null,null,null,null,null,null,null,null,null,null,null,null,null,null,null,null,null,null,null,null,null,"N/A","N/A","N/A","N/A","N/A","N/A","N/A","N/A","N/A",1,1,1,1,1,1,1,1,1]
[null,null,null,null,null,null,null,null,null,null,null,null,null,null,null,null,null,null,null,null,null,null,null,null,null,null,null,null,null,null,null,null,null,null,"N/A","N/A","N/A","N/A","N/A","N/A","N/A","N/A","N/A",1,1,1,1,1,1,1,1,1]
[null,null,null,null,null,null,null,null,null,null,null,null,null,null,null,null,null,null,null,null,null,null,null,null,null,null,null,null,null,null,null,null,null,null,"N/A","N/A","N/A","N/A","N/A","N/A","N/A","N/A","N/A",1,1,1,1,1,1,1,1,1]
[null,null,null,null,null,null,null,null,null,null,null,null,null,null,null,null,null,null,null,null,null,null,null,null,null,null,null,null,null,null,null,null,null,null,"N/A","N/A","N/A","N/A","N/A","N/A","N/A","N/A","N/A",1,1,1,1,1,1,1,1,1]
[null,null,null,null,null,null,null,null,null,null,null,null,null,null,null,null,null,null,null,null,null,null,null,null,null,null,null,null,null,null,null,null,null,null,"N/A","N/A","N/A","N/A","N/A","N/A","N/A","N/A","N/A",1,1,1,1,1,1,1,1,1]
[null,null,null,null,null,null,null,null,null,null,null,null,null,null,null,null,null,null,null,null,null,null,null,null,null,null,null,null,null,null,null,null,null,null,"N/A","N/A","N/A","N/A","N/A","N/A","N/A","N/A","N/A",1,1,1,1,1,1,1,1,1]
[null,null,null,null,null,null,null,null,null,null,null,null,null,null,null,null,null,null,null,null,null,null,null,null,null,null,null,null,null,null,null,null,null,null,"N/A","N/A","N/A","N/A","N/A","N/A","N/A","N/A","N/A",1,1,1,1,1,1,1,1,1]
[null,null,null,null,null,null,null,null,null,null,null,null,null,null,null,null,null,null,null,null,null,null,null,null,null,null,null,null,null,null,null,null,null,null,"N/A","N/A","N/A","N/A","N/A","N/A","N/A","N/A","N/A",1,1,1,1,1,1,1,1,1]
[null,null,null,null,null,null,null,null,null,null,null,null,null,null,null,null,null,null,null,null,null,null,null,null,null,null,null,null,null,null,null,null,null,null,"N/A","N/A","N/A","N/A","N/A","N/A","N/A","N/A","N/A",1,1,1,1,1,1,1,1,1]
[null,null,null,null,null,null,null,null,null,null,null,null,null,null,null,null,null,null,null,null,null,null,null,null,null,null,null,null,null,null,null,null,null,null,"N/A","N/A","N/A","N/A","N/A","N/A","N/A","N/A","N/A",1,1,1,1,1,1,1,1,1]
[null,null,null,null,null,null,null,null,null,null,null,null,null,null,null,null,null,null,null,null,null,null,null,null,null,null,null,null,null,null,null,null,null,null,"N/A","N/A","N/A","N/A","N/A","N/A","N/A","N/A","N/A",1,1,1,1,1,1,1,1,1]
[null,null,null,null,null,null,null,null,null,null,null,null,null,null,null,null,null,null,null,null,null,null,null,null,null,null,null,null,null,null,null,null,null,null,"N/A","N/A","N/A","N/A","N/A","N/A","N/A","N/A","N/A",1,1,1,1,1,1,1,1,1]
[null,null,null,null,null,null,null,null,null,null,null,null,null,null,null,null,null,null,null,null,null,null,null,null,null,null,null,null,null,null,null,null,null,null,"N/A","N/A","N/A","N/A","N/A","N/A","N/A","N/A","N/A",1,1,1,1,1,1,1,1,1]
[null,null,null,null,null,null,null,null,null,null,null,null,null,null,null,null,null,null,null,null,null,null,null,null,null,null,null,null,null,null,null,null,null,null,"N/A","N/A","N/A","N/A","N/A","N/A","N/A","N/A","N/A",1,1,1,1,1,1,1,1,1]
[null,null,null,null,null,null,null,null,null,null,null,null,null,null,null,null,null,null,null,null,null,null,null,null,null,null,null,null,null,null,null,null,null,null,"N/A","N/A","N/A","N/A","N/A","N/A","N/A","N/A","N/A",1,1,1,1,1,1,1,1,1]
[null,null,null,null,null,null,null,null,null,null,null,null,null,null,null,null,null,null,null,null,null,null,null,null,null,null,null,null,null,null,null,null,null,null,"N/A","N/A","N/A","N/A","N/A","N/A","N/A","N/A","N/A",1,1,1,1,1,1,1,1,1]
[null,null,null,null,null,null,null,null,null,null,null,null,null,null,null,null,null,null,null,null,null,null,null,null,null,null,null,null,null,null,null,null,null,null,"N/A","N/A","N/A","N/A","N/A","N/A","N/A","N/A","N/A",1,1,1,1,1,1,1,1,1]
[null,null,null,null,null,null,null,null,null,null,null,null,null,null,null,null,null,null,null,null,null,null,null,null,null,null,null,null,null,null,null,null,null,null,"N/A","N/A","N/A","N/A","N/A","N/A","N/A","N/A","N/A",1,1,1,1,1,1,1,1,1]
[null,null,null,null,null,null,null,null,null,null,null,null,null,null,null,null,null,null,null,null,null,null,null,null,null,null,null,null,null,null,null,null,null,null,"N/A","N/A","N/A","N/A","N/A","N/A","N/A","N/A","N/A",1,1,1,1,1,1,1,1,1]
[null,null,null,null,null,null,null,null,null,null,null,null,null,null,null,null,null,null,null,null,null,null,null,null,null,null,null,null,null,null,null,null,null,null,"N/A","N/A","N/A","N/A","N/A","N/A","N/A","N/A","N/A",1,1,1,1,1,1,1,1,1]
[null,null,null,null,null,null,null,null,null,null,null,null,null,null,null,null,null,null,null,null,null,null,null,null,null,null,null,null,null,null,null,null,null,null,"N/A","N/A","N/A","N/A","N/A","N/A","N/A","N/A","N/A",1,1,1,1,1,1,1,1,1]
[null,null,null,null,null,null,null,null,null,null,null,null,null,null,null,null,null,null,null,null,null,null,null,null,null,null,null,null,null,null,null,null,null,null,"N/A","N/A","N/A","N/A","N/A","N/A","N/A","N/A","N/A",1,1,1,1,1,1,1,1,1]
[null,null,null,null,null,null,null,null,null,null,null,null,null,null,null,null,null,null,null,null,null,null,null,null,null,null,null,null,null,null,null,null,null,null,"N/A","N/A","N/A","N/A","N/A","N/A","N/A","N/A","N/A",1,1,1,1,1,1,1,1,1]
[null,null,null,null,null,null,null,null,null,null,null,null,null,null,null,null,null,null,null,null,null,null,null,null,null,null,null,null,null,null,null,null,null,null,"N/A","N/A","N/A","N/A","N/A","N/A","N/A","N/A","N/A",1,1,1,1,1,1,1,1,1]
[null,null,null,null,null,null,null,null,null,null,null,null,null,null,null,null,null,null,null,null,null,null,null,null,null,null,null,null,null,null,null,null,null,null,"N/A","N/A","N/A","N/A","N/A","N/A","N/A","N/A","N/A",1,1,1,1,1,1,1,1,1]
[null,null,null,null,null,null,null,null,null,null,null,null,null,null,null,null,null,null,null,null,null,null,null,null,null,null,null,null,null,null,null,null,null,null,"N/A","N/A","N/A","N/A","N/A","N/A","N/A","N/A","N/A",1,1,1,1,1,1,1,1,1]
[null,null,null,null,null,null,null,null,null,null,null,null,null,null,null,null,null,null,null,null,null,null,null,null,null,null,null,null,null,null,null,null,null,null,"N/A","N/A","N/A","N/A","N/A","N/A","N/A","N/A","N/A",1,1,1,1,1,1,1,1,1]
[null,null,null,null,null,null,null,null,null,null,null,null,null,null,null,null,null,null,null,null,null,null,null,null,null,null,null,null,null,null,null,null,null,null,"N/A","N/A","N/A","N/A","N/A","N/A","N/A","N/A","N/A",1,1,1,1,1,1,1,1,1]
[null,null,null,null,null,null,null,null,null,null,null,null,null,null,null,null,null,null,null,null,null,null,null,null,null,null,null,null,null,null,null,null,null,null,"N/A","N/A","N/A","N/A","N/A","N/A","N/A","N/A","N/A",1,1,1,1,1,1,1,1,1]
[null,null,null,null,null,null,null,null,null,null,null,null,null,null,null,null,null,null,null,null,null,null,null,null,null,null,null,null,null,null,null,null,null,null,"N/A","N/A","N/A","N/A","N/A","N/A","N/A","N/A","N/A",{"$f":"IF(AI186=\"N/A\",1,\"\")","v":1},1,1,1,1,1,1,1,1]
[null,null,null,null,null,null,null,null,null,null,null,null,null,null,null,null,null,null,null,null,null,null,null,null,null,null,null,null,null,null,null,null,null,null,"N/A","N/A","N/A","N/A","N/A","N/A","N/A","N/A","N/A",1,1,1,1,1,1,1,1,1]
[null,null,null,null,null,null,null,null,null,null,null,null,null,null,null,null,null,null,null,null,null,null,null,null,null,null,null,null,null,null,null,null,null,null,"N/A","N/A","N/A","N/A","N/A","N/A","N/A","N/A","N/A",1,1,1,1,1,1,1,1,1]
[null,null,null,null,null,null,null,null,null,null,null,null,null,null,null,null,null,null,null,null,null,null,null,null,null,null,null,null,null,null,null,null,null,null,"N/A","N/A","N/A","N/A","N/A","N/A","N/A","N/A","N/A",1,1,1,1,1,1,1,1,1]
[null,null,null,null,null,null,null,null,null,null,null,null,null,null,null,null,null,null,null,null,null,null,null,null,null,null,null,null,null,null,null,null,null,null,"N/A","N/A","N/A","N/A","N/A","N/A","N/A","N/A","N/A",1,1,1,1,1,1,1,1,1]
[null,null,null,null,null,null,null,null,null,null,null,null,null,null,null,null,null,null,null,null,null,null,null,null,null,null,null,null,null,null,null,null,null,null,"N/A","N/A","N/A","N/A","N/A","N/A","N/A","N/A","N/A",1,1,1,1,1,1,1,1,1]
[null,null,null,null,null,null,null,null,null,null,null,null,null,null,null,null,null,null,null,null,null,null,null,null,null,null,null,null,null,null,null,null,null,null,"N/A","N/A","N/A","N/A","N/A","N/A","N/A","N/A","N/A",1,1,1,1,1,1,1,1,1]
[null,null,null,null,null,null,null,null,null,null,null,null,null,null,null,null,null,null,null,null,null,null,null,null,null,null,null,null,null,null,null,null,null,null,"N/A","N/A","N/A","N/A","N/A","N/A","N/A","N/A","N/A",1,1,1,1,1,1,1,1,1]
[null,null,null,null,null,null,null,null,null,null,null,null,null,null,null,null,null,null,null,null,null,null,null,null,null,null,null,null,null,null,null,null,null,null,"N/A","N/A","N/A","N/A","N/A","N/A","N/A","N/A","N/A",1,1,1,1,1,1,1,1,1]
[null,null,null,null,null,null,null,null,null,null,null,null,null,null,null,null,null,null,null,null,null,null,null,null,null,null,null,null,null,null,null,null,null,null,"N/A","N/A","N/A","N/A","N/A","N/A","N/A","N/A","N/A",1,1,1,1,1,1,1,1,1]
[null,null,null,null,null,null,null,null,null,null,null,null,null,null,null,null,null,null,null,null,null,null,null,null,null,null,null,null,null,null,null,null,null,null,"N/A","N/A","N/A","N/A","N/A","N/A","N/A","N/A","N/A",1,1,1,1,1,1,1,1,1]
[null,null,null,null,null,null,null,null,null,null,null,null,null,null,null,null,null,null,null,null,null,null,null,null,null,null,null,null,null,null,null,null,null,null,"N/A","N/A","N/A","N/A","N/A","N/A","N/A","N/A","N/A",1,1,1,1,1,1,1,1,1]
[null,null,null,null,null,null,null,null,null,null,null,null,null,null,null,null,null,null,null,null,null,null,null,null,null,null,null,null,null,null,null,null,null,null,"N/A","N/A","N/A","N/A","N/A","N/A","N/A","N/A","N/A",1,1,1,1,1,1,1,1,1]
[null,null,null,null,null,null,null,null,null,null,null,null,null,null,null,null,null,null,null,null,null,null,null,null,null,null,null,null,null,null,null,null,null,null,"N/A","N/A","N/A","N/A","N/A","N/A","N/A","N/A","N/A",1,1,1,1,1,1,1,1,1]
[null,null,null,null,null,null,null,null,null,null,null,null,null,null,null,null,null,null,null,null,null,null,null,null,null,null,null,null,null,null,null,null,null,null,"N/A","N/A","N/A","N/A","N/A","N/A","N/A","N/A","N/A",1,1,1,1,1,1,1,1,1]
[null,null,null,null,null,null,null,null,null,null,null,null,null,null,null,null,null,null,null,null,null,null,null,null,null,null,null,null,null,null,null,null,null,null,"N/A","N/A","N/A","N/A","N/A","N/A","N/A","N/A","N/A",1,1,1,1,1,1,1,1,1]
[null,null,null,null,null,null,null,null,null,null,null,null,null,null,null,null,null,null,null,null,null,null,null,null,null,null,null,null,null,null,null,null,null,null,"N/A","N/A","N/A","N/A","N/A","N/A","N/A","N/A","N/A",1,1,1,1,1,1,1,1,1]
[null,null,null,null,null,null,null,null,null,null,null,null,null,null,null,null,null,null,null,null,null,null,null,null,null,null,null,null,null,null,null,null,null,null,"N/A","N/A","N/A","N/A","N/A","N/A","N/A","N/A","N/A",1,1,1,1,1,1,1,1,1]
[null,null,null,null,null,null,null,null,null,null,null,null,null,null,null,null,null,null,null,null,null,null,null,null,null,null,null,null,null,null,null,null,null,null,"N/A","N/A","N/A","N/A","N/A","N/A","N/A","N/A","N/A",1,1,1,1,1,1,1,1,1]
[null,null,null,null,null,null,null,null,null,null,null,null,null,null,null,null,null,null,null,null,null,null,null,null,null,null,null,null,null,null,null,null,null,null,"N/A","N/A","N/A","N/A","N/A","N/A","N/A","N/A","N/A",1,1,1,1,1,1,1,1,1]
[null,null,null,null,null,null,null,null,null,null,null,null,null,null,null,null,null,null,null,null,null,null,null,null,null,null,null,null,null,null,null,null,null,null,"N/A","N/A","N/A","N/A","N/A","N/A","N/A","N/A","N/A",1,1,1,1,1,1,1,1,1]
[null,null,null,null,null,null,null,null,null,null,null,null,null,null,null,null,null,null,null,null,null,null,null,null,null,null,null,null,null,null,null,null,null,null,"N/A","N/A","N/A","N/A","N/A","N/A","N/A","N/A","N/A",1,1,1,1,1,1,1,1,1]
[null,null,null,null,null,null,null,null,null,null,null,null,null,null,null,null,null,null,null,null,null,null,null,null,null,null,null,null,null,null,null,null,null,null,{"$f":"IF(COUNTA(E208:G208)>0,(COUNTIF(E208:G208,\"=0\")*0+COUNTIF(E208:G208,\"=1\")*100+COUNTIF(E208:G208,\"=2\")*80+COUNTIF(E208:G208,\"=3\")*50+COUNTIF(E208:G208,\"=8\")*20+COUNTIF(E208:G208,\"=9\")*0)/COUNTA(E208:G208)/100,\"N/A\")","v":"N/A"},{"$f":"IF(COUNTA(H208:J208)>0,(COUNTIF(H208:J208,\"=0\")*0+COUNTIF(H208:J208,\"=1\")*100+COUNTIF(H208:J208,\"=2\")*80+COUNTIF(H208:J208,\"=3\")*50+COUNTIF(H208:J208,\"=8\")*20+COUNTIF(H208:J208,\"=9\")*0)/COUNTA(H208:J208)/100,\"N/A\")","v":"N/A"},{"$f":"IF(COUNTA(K208:M208)>0,(COUNTIF(K208:M208,\"=0\")*0+COUNTIF(K208:M208,\"=1\")*100+COUNTIF(K208:M208,\"=2\")*80+COUNTIF(K208:M208,\"=3\")*50+COUNTIF(K208:M208,\"=8\")*20+COUNTIF(K208:M208,\"=9\")*0)/COUNTA(K208:M208)/100,\"N/A\")","v":"N/A"},{"$f":"IF(COUNTA(N208:V208)>0,(COUNTIF(N208:V208,\"=0\")*0+COUNTIF(N208:V208,\"=1\")*100+COUNTIF(N208:V208,\"=2\")*80+COUNTIF(N208:V208,\"=3\")*50+COUNTIF(N208:V208,\"=8\")*20+COUNTIF(N208:V208,\"=9\")*0)/COUNTA(N208:V208)/100,\"N/A\")","v":"N/A"},{"$f":"IF(COUNTA(W208:AA208)>0,(COUNTIF(W208:AA208,\"=0\")*0+COUNTIF(W208:AA208,\"=1\")*100+COUNTIF(W208:AA208,\"=2\")*80+COUNTIF(W208:AA208,\"=3\")*50+COUNTIF(W208:AA208,\"=8\")*20+COUNTIF(W208:AA208,\"=9\")*0)/COUNTA(W208:AA208)/100,\"N/A\")","v":"N/A"},{"$f":"IF(COUNTA(AB208:AC208)>0,(COUNTIF(AB208:AC208,\"=0\")*0+COUNTIF(AB208:AC208,\"=1\")*100+COUNTIF(AB208:AC208,\"=2\")*80+COUNTIF(AB208:AC208,\"=3\")*50+COUNTIF(AB208:AC208,\"=8\")*20+COUNTIF(AB208:AC208,\"=9\")*0)/COUNTA(AB208:AC208)/100,\"N/A\")","v":"N/A"},{"$f":"IF(COUNTA((AD208:AF208))>0,(COUNTIF((AD208:AF208),\"=0\")*0+COUNTIF((AD208:AF208),\"=1\")*100+COUNTIF((AD208:AF208),\"=2\")*80+COUNTIF((AD208:AF208),\"=3\")*50+COUNTIF((AD208:AF208),\"=8\")*20+COUNTIF((AD208:AF208),\"=9\")*0)/COUNTA((AD208:AF208))/100,\"N/A\")","v":"N/A"},{"$f":"IF(COUNTA(AG208:AH208)>0,(COUNTIF(AG208:AH208,\"=0\")*0+COUNTIF(AG208:AH208,\"=1\")*100+COUNTIF(AG208:AH208,\"=2\")*80+COUNTIF(AG208:AH208,\"=3\")*50+COUNTIF(AG208:AH208,\"=8\")*20+COUNTIF(AG208:AH208,\"=9\")*0)/COUNTA(AG208:AH208)/100,\"N/A\")","v":"N/A"},{"$f":"IF(AND(COUNTA(E208:AH208)<>0,B208<>\"\"),AVERAGE(AL208:AP208,AI208),\"N/A\")","v":"N/A"},1,1,1,1,1,1,1,1,1]
[null,null,null,null,null,null,null,null,null,null,null,null,null,null,null,null,null,null,null,null,null,null,null,null,null,null,null,null,null,null,null,null,null,null,"N/A","N/A","N/A","N/A","N/A","N/A","N/A","N/A","N/A",1,1,1,1,1,1,1,1,1]
[null,null,null,null,null,null,null,null,null,null,null,null,null,null,null,null,null,null,null,null,null,null,null,null,null,null,null,null,null,null,null,null,null,null,"N/A","N/A","N/A","N/A","N/A","N/A","N/A","N/A","N/A",1,1,1,1,1,1,1,1,1]
[null,null,null,null,null,null,null,null,null,null,null,null,null,null,null,null,null,null,null,null,null,null,null,null,null,null,null,null,null,null,null,null,null,null,"N/A","N/A","N/A","N/A","N/A","N/A","N/A","N/A","N/A",1,1,1,1,1,1,1,1,1]
[null,null,null,null,null,null,null,null,null,null,null,null,null,null,null,null,null,null,null,null,null,null,null,null,null,null,null,null,null,null,null,null,null,null,"N/A","N/A","N/A","N/A","N/A","N/A","N/A","N/A","N/A",1,1,1,1,1,1,1,1,1]
[null,null,null,null,null,null,null,null,null,null,null,null,null,null,null,null,null,null,null,null,null,null,null,null,null,null,null,null,null,null,null,null,null,null,"N/A","N/A","N/A","N/A","N/A","N/A","N/A","N/A","N/A",1,1,1,1,1,1,1,1,1]
[null,null,null,null,null,null,null,null,null,null,null,null,null,null,null,null,null,null,null,null,null,null,null,null,null,null,null,null,null,null,null,null,null,null,"N/A","N/A","N/A","N/A","N/A","N/A","N/A","N/A","N/A",1,1,1,{"$f":"IF(AL214=\"N/A\",1,\"\")","v":1},1,1,1,1,1]
[null,null,null,null,null,null,null,null,null,null,null,null,null,null,null,null,null,null,null,null,null,null,null,null,null,null,null,null,null,null,null,null,null,null,"N/A","N/A","N/A","N/A","N/A","N/A","N/A","N/A","N/A",{"$f":"IF(AI215=\"N/A\",1,\"\")","v":1},1,1,1,1,1,1,1,1]
[null,null,null,null,null,null,null,null,null,null,null,null,null,null,null,null,null,null,null,null,null,null,null,null,null,null,null,null,null,null,null,null,null,null,"N/A","N/A","N/A","N/A","N/A","N/A","N/A","N/A","N/A",1,1,1,1,1,{"$f":"IF(AN216=\"N/A\",1,\"\")","v":1},1,1,1]
[null,null,null,null,null,null,null,null,null,null,null,null,null,null,null,null,null,null,null,null,null,null,null,null,null,null,null,null,null,null,null,null,null,null,"N/A","N/A","N/A","N/A","N/A","N/A","N/A","N/A","N/A",1,1,1,1,1,{"$f":"IF(AN217=\"N/A\",1,\"\")","v":1},1,1,1]
[null,null,null,null,null,null,null,null,null,null,null,null,null,null,null,null,null,null,null,null,null,null,null,null,null,null,null,null,null,null,null,null,null,null,"N/A","N/A","N/A","N/A","N/A","N/A","N/A","N/A","N/A",1,1,1,1,1,{"$f":"IF(AN218=\"N/A\",1,\"\")","v":1},1,1,1]
[null,null,null,null,null,null,null,null,null,null,null,null,null,null,null,null,null,null,null,null,null,null,null,null,null,null,null,null,null,null,null,null,null,null,"N/A","N/A","N/A","N/A","N/A","N/A","N/A","N/A","N/A",1,1,1,1,1,{"$f":"IF(AN219=\"N/A\",1,\"\")","v":1},1,1,1]
[null,null,null,null,null,null,null,null,null,null,null,null,null,null,null,null,null,null,null,null,null,null,null,null,null,null,null,null,null,null,null,null,null,null,"N/A","N/A","N/A","N/A","N/A","N/A","N/A","N/A","N/A",1,1,1,1,1,1,1,1,1]
[null,null,null,null,null,null,null,null,null,null,null,null,null,null,null,null,null,null,null,null,null,null,null,null,null,null,null,null,null,null,null,null,null,null,"N/A","N/A","N/A","N/A","N/A","N/A","N/A","N/A","N/A",1,1,1,1,1,1,1,1,1]
[null,null,null,null,null,null,null,null,null,null,null,null,null,null,null,null,null,null,null,null,null,null,null,null,null,null,null,null,null,null,null,null,null,null,"N/A","N/A","N/A","N/A","N/A","N/A","N/A","N/A","N/A",1,1,1,1,1,1,1,1,1]
[null,null,null,null,null,null,null,null,null,null,null,null,null,null,null,null,null,null,null,null,null,null,null,null,null,null,null,null,null,null,null,null,null,null,"N/A","N/A","N/A","N/A","N/A","N/A","N/A","N/A","N/A",1,1,1,1,1,1,1,1,1]
[null,null,null,null,null,null,null,null,null,null,null,null,null,null,null,null,null,null,null,null,null,null,null,null,null,null,null,null,null,null,null,null,null,null,"N/A","N/A","N/A","N/A","N/A","N/A","N/A","N/A","N/A",1,1,1,1,1,1,1,1,1]
[null,null,null,null,null,null,null,null,null,null,null,null,null,null,null,null,null,null,null,null,null,null,null,null,null,null,null,null,null,null,null,null,null,null,"N/A","N/A","N/A","N/A","N/A","N/A","N/A","N/A","N/A",1,1,1,1,1,1,1,1,1]
[null,null,null,null,null,null,null,null,null,null,null,null,null,null,null,null,null,null,null,null,null,null,null,null,null,null,null,null,null,null,null,null,null,null,"N/A","N/A","N/A","N/A","N/A","N/A","N/A","N/A","N/A",1,1,1,1,1,1,1,1,1]
[null,null,null,null,null,null,null,null,null,null,null,null,null,null,null,null,null,null,null,null,null,null,null,null,null,null,null,null,null,null,null,null,null,null,"N/A","N/A","N/A","N/A","N/A","N/A","N/A","N/A","N/A",1,1,1,1,1,1,1,1,1]
[null,null,null,null,null,null,null,null,null,null,null,null,null,null,null,null,null,null,null,null,null,null,null,null,null,null,null,null,null,null,null,null,null,null,"N/A","N/A","N/A","N/A","N/A","N/A","N/A","N/A","N/A",1,1,1,1,1,1,1,1,1]
[null,null,null,null,null,null,null,null,null,null,null,null,null,null,null,null,null,null,null,null,null,null,null,null,null,null,null,null,null,null,null,null,null,null,"N/A","N/A","N/A","N/A","N/A","N/A","N/A","N/A","N/A",1,1,1,1,1,1,1,1,1]
[null,null,null,null,null,null,null,null,null,null,null,null,null,null,null,null,null,null,null,null,null,null,null,null,null,null,null,null,null,null,null,null,null,null,"N/A","N/A","N/A","N/A","N/A","N/A","N/A","N/A","N/A",1,1,1,1,1,1,1,1,1]
[null,null,null,null,null,null,null,null,null,null,null,null,null,null,null,null,null,null,null,null,null,null,null,null,null,null,null,null,null,null,null,null,null,null,"N/A","N/A","N/A","N/A","N/A","N/A","N/A","N/A","N/A",1,1,1,1,1,1,1,1,1]
[null,null,null,null,null,null,null,null,null,null,null,null,null,null,null,null,null,null,null,null,null,null,null,null,null,null,null,null,null,null,null,null,null,null,"N/A","N/A","N/A","N/A","N/A","N/A","N/A","N/A","N/A",1,1,1,1,1,1,1,1,1]
[null,null,null,null,null,null,null,null,null,null,null,null,null,null,null,null,null,null,null,null,null,null,null,null,null,null,null,null,null,null,null,null,null,null,"N/A","N/A","N/A","N/A","N/A","N/A","N/A","N/A","N/A",1,1,1,1,1,1,1,1,1]
[null,null,null,null,null,null,null,null,null,null,null,null,null,null,null,null,null,null,null,null,null,null,null,null,null,null,null,null,null,null,null,null,null,null,"N/A","N/A","N/A","N/A","N/A","N/A","N/A","N/A","N/A",1,1,1,1,1,1,1,1,1]
[null,null,null,null,null,null,null,null,null,null,null,null,null,null,null,null,null,null,null,null,null,null,null,null,null,null,null,null,null,null,null,null,null,null,"N/A","N/A","N/A","N/A","N/A","N/A","N/A","N/A","N/A",1,1,1,1,1,1,1,1,1]
[null,null,null,null,null,null,null,null,null,null,null,null,null,null,null,null,null,null,null,null,null,null,null,null,null,null,null,null,null,null,null,null,null,null,"N/A","N/A","N/A","N/A","N/A","N/A","N/A","N/A","N/A",1,1,1,1,1,1,1,1,1]
[null,null,null,null,null,null,null,null,null,null,null,null,null,null,null,null,null,null,null,null,null,null,null,null,null,null,null,null,null,null,null,null,null,null,"N/A","N/A","N/A","N/A","N/A","N/A","N/A","N/A","N/A",1,1,1,1,1,1,1,1,1]
[null,null,null,null,null,null,null,null,null,null,null,null,null,null,null,null,null,null,null,null,null,null,null,null,null,null,null,null,null,null,null,null,null,null,"N/A","N/A","N/A","N/A","N/A","N/A","N/A","N/A","N/A",1,1,1,1,1,1,1,1,1]
[null,null,null,null,null,null,null,null,null,null,null,null,null,null,null,null,null,null,null,null,null,null,null,null,null,null,null,null,null,null,null,null,null,null,"N/A","N/A","N/A","N/A","N/A","N/A","N/A","N/A","N/A",{"$f":"IF(AI239=\"N/A\",1,\"\")","v":1},1,1,1,1,1,1,1,1]
[null,null,null,null,null,null,null,null,null,null,null,null,null,null,null,null,null,null,null,null,null,null,null,null,null,null,null,null,null,null,null,null,null,null,"N/A","N/A","N/A","N/A","N/A","N/A","N/A","N/A","N/A",1,1,1,1,1,1,1,1,1]
[null,null,null,null,null,null,null,null,null,null,null,null,null,null,null,null,null,null,null,null,null,null,null,null,null,null,null,null,null,null,null,null,null,null,"N/A","N/A","N/A","N/A","N/A","N/A","N/A","N/A","N/A",1,1,1,1,1,1,1,1,1]
[null,null,null,null,null,null,null,null,null,null,null,null,null,null,null,null,null,null,null,null,null,null,null,null,null,null,null,null,null,null,null,null,null,null,"N/A","N/A","N/A","N/A","N/A","N/A","N/A","N/A","N/A",1,1,1,1,1,1,1,1,1]
[null,null,null,null,null,null,null,null,null,null,null,null,null,null,null,null,null,null,null,null,null,null,null,null,null,null,null,null,null,null,null,null,null,null,"N/A","N/A","N/A","N/A","N/A","N/A","N/A","N/A","N/A",1,1,1,1,1,1,1,1,1]
[null,null,null,null,null,null,null,null,null,null,null,null,null,null,null,null,null,null,null,null,null,null,null,null,null,null,null,null,null,null,null,null,null,null,"N/A","N/A","N/A","N/A","N/A","N/A","N/A","N/A","N/A",1,1,1,1,1,1,1,1,1]
[null,null,null,null,null,null,null,null,null,null,null,null,null,null,null,null,null,null,null,null,null,null,null,null,null,null,null,null,null,null,null,null,null,null,"N/A","N/A","N/A","N/A","N/A","N/A","N/A","N/A","N/A",1,1,1,1,1,1,1,1,1]
[null,null,null,null,null,null,null,null,null,null,null,null,null,null,null,null,null,null,null,null,null,null,null,null,null,null,null,null,null,null,null,null,null,null,"N/A","N/A","N/A","N/A","N/A","N/A","N/A","N/A","N/A",1,1,1,1,1,1,1,1,1]
[null,null,null,null,null,null,null,null,null,null,null,null,null,null,null,null,null,null,null,null,null,null,null,null,null,null,null,null,null,null,null,null,null,null,"N/A","N/A","N/A","N/A","N/A","N/A","N/A","N/A","N/A",1,1,1,1,1,1,1,1,1]
[null,null,null,null,null,null,null,null,null,null,null,null,null,null,null,null,null,null,null,null,null,null,null,null,null,null,null,null,null,null,null,null,null,null,"N/A","N/A","N/A","N/A","N/A","N/A","N/A","N/A","N/A",1,1,1,1,1,1,1,1,1]
[null,null,null,null,null,null,null,null,null,null,null,null,null,null,null,null,null,null,null,null,null,null,null,null,null,null,null,null,null,null,null,null,null,null,"N/A","N/A","N/A","N/A","N/A","N/A","N/A","N/A","N/A",1,1,1,1,1,1,1,1,1]
[null,null,null,null,null,null,null,null,null,null,null,null,null,null,null,null,null,null,null,null,null,null,null,null,null,null,null,null,null,null,null,null,null,null,"N/A","N/A","N/A","N/A","N/A","N/A","N/A","N/A","N/A",1,1,1,1,1,1,1,1,1]
[null,null,null,null,null,null,null,null,null,null,null,null,null,null,null,null,null,null,null,null,null,null,null,null,null,null,null,null,null,null,null,null,null,null,"N/A","N/A","N/A","N/A","N/A","N/A","N/A","N/A","N/A",1,1,1,1,1,1,1,1,1]
[null,null,null,null,null,null,null,null,null,null,null,null,null,null,null,null,null,null,null,null,null,null,null,null,null,null,null,null,null,null,null,null,null,null,"N/A","N/A","N/A","N/A","N/A","N/A","N/A","N/A","N/A",1,1,1,1,1,1,1,1,1]
[null,null,null,null,null,null,null,null,null,null,null,null,null,null,null,null,null,null,null,null,null,null,null,null,null,null,null,null,null,null,null,null,null,null,"N/A","N/A","N/A","N/A","N/A","N/A","N/A","N/A","N/A",1,1,1,1,1,1,1,1,1]
[null,null,null,null,null,null,null,null,null,null,null,null,null,null,null,null,null,null,null,null,null,null,null,null,null,null,null,null,null,null,null,null,null,null,"N/A","N/A","N/A","N/A","N/A","N/A","N/A","N/A","N/A",1,1,1,1,1,1,1,1,1]
[null,null,null,null,null,null,null,null,null,null,null,null,null,null,null,null,null,null,null,null,null,null,null,null,null,null,null,null,null,null,null,null,null,null,"N/A","N/A","N/A","N/A","N/A","N/A","N/A","N/A","N/A",1,1,1,1,1,1,1,1,1]
[null,null,null,null,null,null,null,null,null,null,null,null,null,null,null,null,null,null,null,null,null,null,null,null,null,null,null,null,null,null,null,null,null,null,"N/A","N/A","N/A","N/A","N/A","N/A","N/A","N/A","N/A",1,1,1,1,1,1,1,1,1]
[null,null,null,null,null,null,null,null,null,null,null,null,null,null,null,null,null,null,null,null,null,null,null,null,null,null,null,null,null,null,null,null,null,null,"N/A","N/A","N/A","N/A","N/A","N/A","N/A","N/A","N/A",1,1,1,1,1,1,1,1,1]
[null,null,null,null,null,null,null,null,null,null,null,null,null,null,null,null,null,null,null,null,null,null,null,null,null,null,null,null,null,null,null,null,null,null,"N/A","N/A","N/A","N/A","N/A","N/A","N/A","N/A","N/A",1,1,1,1,1,1,1,1,1]
[null,null,null,null,null,null,null,null,null,null,null,null,null,null,null,null,null,null,null,null,null,null,null,null,null,null,null,null,null,null,null,null,null,null,"N/A","N/A","N/A","N/A","N/A","N/A","N/A","N/A","N/A",1,1,1,1,1,1,1,1,1]
[null,null,null,null,null,null,null,null,null,null,null,null,null,null,null,null,null,null,null,null,null,null,null,null,null,null,null,null,null,null,null,null,null,null,"N/A","N/A","N/A","N/A","N/A","N/A","N/A","N/A","N/A",1,1,1,1,1,1,1,1,1]
[null,null,null,null,null,null,null,null,null,null,null,null,null,null,null,null,null,null,null,null,null,null,null,null,null,null,null,null,null,null,null,null,null,null,"N/A","N/A","N/A","N/A","N/A","N/A","N/A","N/A","N/A",1,1,1,1,1,1,1,1,1]
[null,null,null,null,null,null,null,null,null,null,null,null,null,null,null,null,null,null,null,null,null,null,null,null,null,null,null,null,null,null,null,null,null,null,"N/A","N/A","N/A","N/A","N/A","N/A","N/A","N/A","N/A",1,1,1,1,1,1,1,1,1]
[null,null,null,null,null,null,null,null,null,null,null,null,null,null,null,null,null,null,null,null,null,null,null,null,null,null,null,null,null,null,null,null,null,null,"N/A","N/A","N/A","N/A","N/A","N/A","N/A","N/A","N/A",1,1,1,1,1,1,1,1,1]
[null,null,null,null,null,null,null,null,null,null,null,null,null,null,null,null,null,null,null,null,null,null,null,null,null,null,null,null,null,null,null,null,null,null,"N/A","N/A","N/A","N/A","N/A","N/A","N/A","N/A","N/A",1,1,1,1,1,1,1,1,1]
[null,null,null,null,null,null,null,null,null,null,null,null,null,null,null,null,null,null,null,null,null,null,null,null,null,null,null,null,null,null,null,null,null,null,"N/A","N/A","N/A","N/A","N/A","N/A","N/A","N/A","N/A",1,1,1,1,1,1,1,1,1]
[null,null,null,null,null,null,null,null,null,null,null,null,null,null,null,null,null,null,null,null,null,null,null,null,null,null,null,null,null,null,null,null,null,null,"N/A","N/A","N/A","N/A","N/A","N/A","N/A","N/A","N/A",1,1,1,1,1,1,1,1,1]
[null,null,null,null,null,null,null,null,null,null,null,null,null,null,null,null,null,null,null,null,null,null,null,null,null,null,null,null,null,null,null,null,null,null,"N/A","N/A","N/A","N/A","N/A","N/A","N/A","N/A","N/A",1,1,1,{"$f":"IF(AL267=\"N/A\",1,\"\")","v":1},1,1,1,1,1]
[null,null,null,null,null,null,null,null,null,null,null,null,null,null,null,null,null,null,null,null,null,null,null,null,null,null,null,null,null,null,null,null,null,null,"N/A","N/A","N/A","N/A","N/A","N/A","N/A","N/A","N/A",{"$f":"IF(AI268=\"N/A\",1,\"\")","v":1},1,1,1,1,1,1,1,1]
[null,null,null,null,null,null,null,null,null,null,null,null,null,null,null,null,null,null,null,null,null,null,null,null,null,null,null,null,null,null,null,null,null,null,"N/A","N/A","N/A","N/A","N/A","N/A","N/A","N/A","N/A",1,1,1,1,1,1,1,1,1]
[null,null,null,null,null,null,null,null,null,null,null,null,null,null,null,null,null,null,null,null,null,null,null,null,null,null,null,null,null,null,null,null,null,null,"N/A","N/A","N/A","N/A","N/A","N/A","N/A","N/A","N/A",1,1,1,1,1,1,1,1,1]
[null,null,null,null,null,null,null,null,null,null,null,null,null,null,null,null,null,null,null,null,null,null,null,null,null,null,null,null,null,null,null,null,null,null,"N/A","N/A","N/A","N/A","N/A","N/A","N/A","N/A","N/A",1,1,1,1,1,1,1,1,1]
[null,null,null,null,null,null,null,null,null,null,null,null,null,null,null,null,null,null,null,null,null,null,null,null,null,null,null,null,null,null,null,null,null,null,{"$f":"IF(COUNTA(E272:G272)>0,(COUNTIF(E272:G272,\"=0\")*0+COUNTIF(E272:G272,\"=1\")*100+COUNTIF(E272:G272,\"=2\")*80+COUNTIF(E272:G272,\"=3\")*50+COUNTIF(E272:G272,\"=8\")*20+COUNTIF(E272:G272,\"=9\")*0)/COUNTA(E272:G272)/100,\"N/A\")","v":"N/A"},{"$f":"IF(COUNTA(H272:J272)>0,(COUNTIF(H272:J272,\"=0\")*0+COUNTIF(H272:J272,\"=1\")*100+COUNTIF(H272:J272,\"=2\")*80+COUNTIF(H272:J272,\"=3\")*50+COUNTIF(H272:J272,\"=8\")*20+COUNTIF(H272:J272,\"=9\")*0)/COUNTA(H272:J272)/100,\"N/A\")","v":"N/A"},{"$f":"IF(COUNTA(K272:M272)>0,(COUNTIF(K272:M272,\"=0\")*0+COUNTIF(K272:M272,\"=1\")*100+COUNTIF(K272:M272,\"=2\")*80+COUNTIF(K272:M272,\"=3\")*50+COUNTIF(K272:M272,\"=8\")*20+COUNTIF(K272:M272,\"=9\")*0)/COUNTA(K272:M272)/100,\"N/A\")","v":"N/A"},{"$f":"IF(COUNTA(N272:V272)>0,(COUNTIF(N272:V272,\"=0\")*0+COUNTIF(N272:V272,\"=1\")*100+COUNTIF(N272:V272,\"=2\")*80+COUNTIF(N272:V272,\"=3\")*50+COUNTIF(N272:V272,\"=8\")*20+COUNTIF(N272:V272,\"=9\")*0)/COUNTA(N272:V272)/100,\"N/A\")","v":"N/A"},{"$f":"IF(COUNTA(W272:AA272)>0,(COUNTIF(W272:AA272,\"=0\")*0+COUNTIF(W272:AA272,\"=1\")*100+COUNTIF(W272:AA272,\"=2\")*80+COUNTIF(W272:AA272,\"=3\")*50+COUNTIF(W272:AA272,\"=8\")*20+COUNTIF(W272:AA272,\"=9\")*0)/COUNTA(W272:AA272)/100,\"N/A\")","v":"N/A"},{"$f":"IF(COUNTA(AB272:AC272)>0,(COUNTIF(AB272:AC272,\"=0\")*0+COUNTIF(AB272:AC272,\"=1\")*100+COUNTIF(AB272:AC272,\"=2\")*80+COUNTIF(AB272:AC272,\"=3\")*50+COUNTIF(AB272:AC272,\"=8\")*20+COUNTIF(AB272:AC272,\"=9\")*0)/COUNTA(AB272:AC272)/100,\"N/A\")","v":"N/A"},{"$f":"IF(COUNTA((AD272:AF272))>0,(COUNTIF((AD272:AF272),\"=0\")*0+COUNTIF((AD272:AF272),\"=1\")*100+COUNTIF((AD272:AF272),\"=2\")*80+COUNTIF((AD272:AF272),\"=3\")*50+COUNTIF((AD272:AF272),\"=8\")*20+COUNTIF((AD272:AF272),\"=9\")*0)/COUNTA((AD272:AF272))/100,\"N/A\")","v":"N/A"},{"$f":"IF(COUNTA(AG272:AH272)>0,(COUNTIF(AG272:AH272,\"=0\")*0+COUNTIF(AG272:AH272,\"=1\")*100+COUNTIF(AG272:AH272,\"=2\")*80+COUNTIF(AG272:AH272,\"=3\")*50+COUNTIF(AG272:AH272,\"=8\")*20+COUNTIF(AG272:AH272,\"=9\")*0)/COUNTA(AG272:AH272)/100,\"N/A\")","v":"N/A"},{"$f":"IF(AND(COUNTA(E272:AH272)<>0,B272<>\"\"),AVERAGE(AL272:AP272,AI272),\"N/A\")","v":"N/A"},1,1,1,1,1,1,1,1,1]
[null,null,null,null,null,null,null,null,null,null,null,null,null,null,null,null,null,null,null,null,null,null,null,null,null,null,null,null,null,null,null,null,null,null,"N/A","N/A","N/A","N/A","N/A","N/A","N/A","N/A","N/A",1,1,1,1,1,1,1,1,1]
[null,null,null,null,null,null,null,null,null,null,null,null,null,null,null,null,null,null,null,null,null,null,null,null,null,null,null,null,null,null,null,null,null,null,"N/A","N/A","N/A","N/A","N/A","N/A","N/A","N/A","N/A",1,1,1,1,1,1,1,1,1]
[null,null,null,null,null,null,null,null,null,null,null,null,null,null,null,null,null,null,null,null,null,null,null,null,null,null,null,null,null,null,null,null,null,null,"N/A","N/A","N/A","N/A","N/A","N/A","N/A","N/A","N/A",1,1,1,1,1,1,1,1,1]
[null,null,null,null,null,null,null,null,null,null,null,null,null,null,null,null,null,null,null,null,null,null,null,null,null,null,null,null,null,null,null,null,null,null,"N/A","N/A","N/A","N/A","N/A","N/A","N/A","N/A","N/A",1,1,1,1,1,1,1,1,1]
[null,null,null,null,null,null,null,null,null,null,null,null,null,null,null,null,null,null,null,null,null,null,null,null,null,null,null,null,null,null,null,null,null,null,"N/A","N/A","N/A","N/A","N/A","N/A","N/A","N/A","N/A",1,1,1,1,1,1,1,1,1]
[null,null,null,null,null,null,null,null,null,null,null,null,null,null,null,null,null,null,null,null,null,null,null,null,null,null,null,null,null,null,null,null,null,null,"N/A","N/A","N/A","N/A","N/A","N/A","N/A","N/A","N/A",1,1,1,1,1,1,1,1,1]
[null,null,null,null,null,null,null,null,null,null,null,null,null,null,null,null,null,null,null,null,null,null,null,null,null,null,null,null,null,null,null,null,null,null,"N/A","N/A","N/A","N/A","N/A","N/A","N/A","N/A","N/A",1,1,1,1,1,1,1,1,1]
[null,null,null,null,null,null,null,null,null,null,null,null,null,null,null,null,null,null,null,null,null,null,null,null,null,null,null,null,null,null,null,null,null,null,"N/A","N/A","N/A","N/A","N/A","N/A","N/A","N/A","N/A",1,1,1,1,1,1,1,1,1]
[null,null,null,null,null,null,null,null,null,null,null,null,null,null,null,null,null,null,null,null,null,null,null,null,null,null,null,null,null,null,null,null,null,null,"N/A","N/A","N/A","N/A","N/A","N/A","N/A","N/A","N/A",1,1,1,1,1,1,1,1,1]
[null,null,null,null,null,null,null,null,null,null,null,null,null,null,null,null,null,null,null,null,null,null,null,null,null,null,null,null,null,null,null,null,null,null,"N/A","N/A","N/A","N/A","N/A","N/A","N/A","N/A","N/A",1,1,1,1,1,1,1,1,1]
[null,null,null,null,null,null,null,null,null,null,null,null,null,null,null,null,null,null,null,null,null,null,null,null,null,null,null,null,null,null,null,null,null,null,"N/A","N/A","N/A","N/A","N/A","N/A","N/A","N/A","N/A",1,1,1,1,1,1,1,1,1]
[null,null,null,null,null,null,null,null,null,null,null,null,null,null,null,null,null,null,null,null,null,null,null,null,null,null,null,null,null,null,null,null,null,null,"N/A","N/A","N/A","N/A","N/A","N/A","N/A","N/A","N/A",1,1,1,1,1,1,1,1,1]
[null,null,null,null,null,null,null,null,null,null,null,null,null,null,null,null,null,null,null,null,null,null,null,null,null,null,null,null,null,null,null,null,null,null,"N/A","N/A","N/A","N/A","N/A","N/A","N/A","N/A","N/A",1,1,1,1,1,1,1,1,1]
[null,null,null,null,null,null,null,null,null,null,null,null,null,null,null,null,null,null,null,null,null,null,null,null,null,null,null,null,null,null,null,null,null,null,"N/A","N/A","N/A","N/A","N/A","N/A","N/A","N/A","N/A",1,1,1,1,1,1,1,1,1]
[null,null,null,null,null,null,null,null,null,null,null,null,null,null,null,null,null,null,null,null,null,null,null,null,null,null,null,null,null,null,null,null,null,null,"N/A","N/A","N/A","N/A","N/A","N/A","N/A","N/A","N/A",1,1,1,1,1,1,1,1,1]
[null,null,null,null,null,null,null,null,null,null,null,null,null,null,null,null,null,null,null,null,null,null,null,null,null,null,null,null,null,null,null,null,null,null,"N/A","N/A","N/A","N/A","N/A","N/A","N/A","N/A","N/A",1,1,1,1,1,1,1,1,1]
[null,null,null,null,null,null,null,null,null,null,null,null,null,null,null,null,null,null,null,null,null,null,null,null,null,null,null,null,null,null,null,null,null,null,"N/A","N/A","N/A","N/A","N/A","N/A","N/A","N/A","N/A",1,1,1,1,1,1,1,1,1]
[null,null,null,null,null,null,null,null,null,null,null,null,null,null,null,null,null,null,null,null,null,null,null,null,null,null,null,null,null,null,null,null,null,null,"N/A","N/A","N/A","N/A","N/A","N/A","N/A","N/A","N/A",1,1,1,1,1,1,1,1,1]
[null,null,null,null,null,null,null,null,null,null,null,null,null,null,null,null,null,null,null,null,null,null,null,null,null,null,null,null,null,null,null,null,null,null,"N/A","N/A","N/A","N/A","N/A","N/A","N/A","N/A","N/A",1,1,1,1,1,1,1,1,1]
[null,null,null,null,null,null,null,null,null,null,null,null,null,null,null,null,null,null,null,null,null,null,null,null,null,null,null,null,null,null,null,null,null,null,"N/A","N/A","N/A","N/A","N/A","N/A","N/A","N/A","N/A",1,1,1,1,1,1,1,1,1]
[null,null,null,null,null,null,null,null,null,null,null,null,null,null,null,null,null,null,null,null,null,null,null,null,null,null,null,null,null,null,null,null,null,null,"N/A","N/A","N/A","N/A","N/A","N/A","N/A","N/A","N/A",1,1,1,1,1,1,1,1,1]
[null,null,null,null,null,null,null,null,null,null,null,null,null,null,null,null,null,null,null,null,null,null,null,null,null,null,null,null,null,null,null,null,null,null,"N/A","N/A","N/A","N/A","N/A","N/A","N/A","N/A","N/A",1,1,1,1,1,1,1,1,1]
[null,null,null,null,null,null,null,null,null,null,null,null,null,null,null,null,null,null,null,null,null,null,null,null,null,null,null,null,null,null,null,null,null,null,"N/A","N/A","N/A","N/A","N/A","N/A","N/A","N/A","N/A",1,1,1,1,1,1,1,1,1]
[null,null,null,null,null,null,null,null,null,null,null,null,null,null,null,null,null,null,null,null,null,null,null,null,null,null,null,null,null,null,null,null,null,null,"N/A","N/A","N/A","N/A","N/A","N/A","N/A","N/A","N/A",1,1,1,1,1,1,1,1,1]
[null,null,null,null,null,null,null,null,null,null,null,null,null,null,null,null,null,null,null,null,null,null,null,null,null,null,null,null,null,null,null,null,null,null,"N/A","N/A","N/A","N/A","N/A","N/A","N/A","N/A","N/A",1,1,1,1,1,1,1,1,1]
[null,null,null,null,null,null,null,null,null,null,null,null,null,null,null,null,null,null,null,null,null,null,null,null,null,null,null,null,null,null,null,null,null,null,"N/A","N/A","N/A","N/A","N/A","N/A","N/A","N/A","N/A",1,1,1,1,1,1,1,1,1]
[null,null,null,null,null,null,null,null,null,null,null,null,null,null,null,null,null,null,null,null,null,null,null,null,null,null,null,null,null,null,null,null,null,null,"N/A","N/A","N/A","N/A","N/A","N/A","N/A","N/A","N/A",1,1,1,1,1,1,1,1,1]
[null,null,null,null,null,null,null,null,null,null,null,null,null,null,null,null,null,null,null,null,null,null,null,null,null,null,null,null,null,null,null,null,null,null,"N/A","N/A","N/A","N/A","N/A","N/A","N/A","N/A","N/A",{"$f":"IF(AI300=\"N/A\",1,\"\")","v":1},1,1,1,1,1,1,1,1]
[null,null,null,null,null,null,null,null,null,null,null,null,null,null,null,null,null,null,null,null,null,null,null,null,null,null,null,null,null,null,null,null,null,null,"N/A","N/A","N/A","N/A","N/A","N/A","N/A","N/A","N/A",1,1,1,1,1,1,1,1,1]
[null,null,null,null,null,null,null,null,null,null,null,null,null,null,null,null,null,null,null,null,null,null,null,null,null,null,null,null,null,null,null,null,null,null,"N/A","N/A","N/A","N/A","N/A","N/A","N/A","N/A","N/A",1,1,1,1,1,1,1,1,1]
[null,null,null,null,null,null,null,null,null,null,null,null,null,null,null,null,null,null,null,null,null,null,null,null,null,null,null,null,null,null,null,null,null,null,"N/A","N/A","N/A","N/A","N/A","N/A","N/A","N/A","N/A",1,1,1,1,1,1,1,1,1]
[null,null,null,null,null,null,null,null,null,null,null,null,null,null,null,null,null,null,null,null,null,null,null,null,null,null,null,null,null,null,null,null,null,null,"N/A","N/A","N/A","N/A","N/A","N/A","N/A","N/A","N/A",1,1,1,1,1,1,1,1,1]
[null,null,null,null,null,null,null,null,null,null,null,null,null,null,null,null,null,null,null,null,null,null,null,null,null,null,null,null,null,null,null,null,null,null,"N/A","N/A","N/A","N/A","N/A","N/A","N/A","N/A","N/A",1,1,1,1,1,1,1,1,1]
[null,null,null,null,null,null,null,null,null,null,null,null,null,null,null,null,null,null,null,null,null,null,null,null,null,null,null,null,null,null,null,null,null,null,"N/A","N/A","N/A","N/A","N/A","N/A","N/A","N/A","N/A",1,1,1,1,1,1,1,1,1]
[null,null,null,null,null,null,null,null,null,null,null,null,null,null,null,null,null,null,null,null,null,null,null,null,null,null,null,null,null,null,null,null,null,null,"N/A","N/A","N/A","N/A","N/A","N/A","N/A","N/A","N/A",1,1,1,1,1,1,1,1,1]
[null,null,null,null,null,null,null,null,null,null,null,null,null,null,null,null,null,null,null,null,null,null,null,null,null,null,null,null,null,null,null,null,null,null,"N/A","N/A","N/A","N/A","N/A","N/A","N/A","N/A","N/A",1,1,1,1,1,1,1,1,1]
[null,null,null,null,null,null,null,null,null,null,null,null,null,null,null,null,null,null,null,null,null,null,null,null,null,null,null,null,null,null,null,null,null,null,"N/A","N/A","N/A","N/A","N/A","N/A","N/A","N/A","N/A",1,1,1,1,1,1,1,1,1]
[null,null,null,null,null,null,null,null,null,null,null,null,null,null,null,null,null,null,null,null,null,null,null,null,null,null,null,null,null,null,null,null,null,null,"N/A","N/A","N/A","N/A","N/A","N/A","N/A","N/A","N/A",1,1,1,1,1,1,1,1,1]
[null,null,null,null,null,null,null,null,null,null,null,null,null,null,null,null,null,null,null,null,null,null,null,null,null,null,null,null,null,null,null,null,null,null,"N/A","N/A","N/A","N/A","N/A","N/A","N/A","N/A","N/A",1,1,1,1,1,1,1,1,1]
[null,null,null,null,null,null,null,null,null,null,null,null,null,null,null,null,null,null,null,null,null,null,null,null,null,null,null,null,null,null,null,null,null,null,"N/A","N/A","N/A","N/A","N/A","N/A","N/A","N/A","N/A",1,1,1,1,1,1,1,1,1]
[null,null,null,null,null,null,null,null,null,null,null,null,null,null,null,null,null,null,null,null,null,null,null,null,null,null,null,null,null,null,null,null,null,null,"N/A","N/A","N/A","N/A","N/A","N/A","N/A","N/A","N/A",1,1,1,1,1,1,1,1,1]
[null,null,null,null,null,null,null,null,null,null,null,null,null,null,null,null,null,null,null,null,null,null,null,null,null,null,null,null,null,null,null,null,null,null,"N/A","N/A","N/A","N/A","N/A","N/A","N/A","N/A","N/A",1,1,1,1,1,1,1,1,1]
[null,null,null,null,null,null,null,null,null,null,null,null,null,null,null,null,null,null,null,null,null,null,null,null,null,null,null,null,null,null,null,null,null,null,"N/A","N/A","N/A","N/A","N/A","N/A","N/A","N/A","N/A",1,1,1,1,1,1,1,1,1]
[null,null,null,null,null,null,null,null,null,null,null,null,null,null,null,null,null,null,null,null,null,null,null,null,null,null,null,null,null,null,null,null,null,null,"N/A","N/A","N/A","N/A","N/A","N/A","N/A","N/A","N/A",1,1,1,1,1,1,1,1,1]
[null,null,null,null,null,null,null,null,null,null,null,null,null,null,null,null,null,null,null,null,null,null,null,null,null,null,null,null,null,null,null,null,null,null,"N/A","N/A","N/A","N/A","N/A","N/A","N/A","N/A","N/A",1,1,1,1,1,1,1,1,1]
[null,null,null,null,null,null,null,null,null,null,null,null,null,null,null,null,null,null,null,null,null,null,null,null,null,null,null,null,null,null,null,null,null,null,"N/A","N/A","N/A","N/A","N/A","N/A","N/A","N/A","N/A",1,1,1,1,1,1,1,1,1]
[null,null,null,null,null,null,null,null,null,null,null,null,null,null,null,null,null,null,null,null,null,null,null,null,null,null,null,null,null,null,null,null,null,null,"N/A","N/A","N/A","N/A","N/A","N/A","N/A","N/A","N/A",1,1,1,1,1,1,1,1,1]
[null,null,null,null,null,null,null,null,null,null,null,null,null,null,null,null,null,null,null,null,null,null,null,null,null,null,null,null,null,null,null,null,null,null,"N/A","N/A","N/A","N/A","N/A","N/A","N/A","N/A","N/A",1,1,1,1,1,1,1,1,1]
[null,null,null,null,null,null,null,null,null,null,null,null,null,null,null,null,null,null,null,null,null,null,null,null,null,null,null,null,null,null,null,null,null,null,"N/A","N/A","N/A","N/A","N/A","N/A","N/A","N/A","N/A",1,1,1,1,1,1,1,1,1]
[null,null,null,null,null,null,null,null,null,null,null,null,null,null,null,null,null,null,null,null,null,null,null,null,null,null,null,null,null,null,null,null,null,null,"N/A","N/A","N/A","N/A","N/A","N/A","N/A","N/A","N/A",1,1,1,1,1,1,1,1,1]
[null,null,null,null,null,null,null,null,null,null,null,null,null,null,null,null,null,null,null,null,null,null,null,null,null,null,null,null,null,null,null,null,null,null,"N/A","N/A","N/A","N/A","N/A","N/A","N/A","N/A","N/A",1,1,1,1,1,1,1,1,1]
[null,null,null,null,null,null,null,null,null,null,null,null,null,null,null,null,null,null,null,null,null,null,null,null,null,null,null,null,null,null,null,null,null,null,"N/A","N/A","N/A","N/A","N/A","N/A","N/A","N/A","N/A",1,1,1,1,1,1,1,1,1]
[null,null,null,null,null,null,null,null,null,null,null,null,null,null,null,null,null,null,null,null,null,null,null,null,null,null,null,null,null,null,null,null,null,null,"N/A","N/A","N/A","N/A","N/A","N/A","N/A","N/A","N/A",1,1,1,1,1,1,1,1,1]
[null,null,null,null,null,null,null,null,null,null,null,null,null,null,null,null,null,null,null,null,null,null,null,null,null,null,null,null,null,null,null,null,null,null,"N/A","N/A","N/A","N/A","N/A","N/A","N/A","N/A","N/A",1,1,1,1,1,1,1,1,1]
[null,null,null,null,null,null,null,null,null,null,null,null,null,null,null,null,null,null,null,null,null,null,null,null,null,null,null,null,null,null,null,null,null,null,"N/A","N/A","N/A","N/A","N/A","N/A","N/A","N/A","N/A",1,1,1,1,1,1,1,1,1]
[null,null,null,null,null,null,null,null,null,null,null,null,null,null,null,null,null,null,null,null,null,null,null,null,null,null,null,null,null,null,null,null,null,null,"N/A","N/A","N/A","N/A","N/A","N/A","N/A","N/A","N/A",1,1,1,{"$f":"IF(AL328=\"N/A\",1,\"\")","v":1},1,1,1,1,1]
[null,null,null,null,null,null,null,null,null,null,null,null,null,null,null,null,null,null,null,null,null,null,null,null,null,null,null,null,null,null,null,null,null,null,"N/A","N/A","N/A","N/A","N/A","N/A","N/A","N/A","N/A",{"$f":"IF(AI329=\"N/A\",1,\"\")","v":1},1,1,1,1,1,1,1,1]
[null,null,null,null,null,null,null,null,null,null,null,null,null,null,null,null,null,null,null,null,null,null,null,null,null,null,null,null,null,null,null,null,null,null,"N/A","N/A","N/A","N/A","N/A","N/A","N/A","N/A","N/A",1,1,1,1,1,1,1,1,1]
[null,null,null,null,null,null,null,null,null,null,null,null,null,null,null,null,null,null,null,null,null,null,null,null,null,null,null,null,null,null,null,null,null,null,"N/A","N/A","N/A","N/A","N/A","N/A","N/A","N/A","N/A",1,1,1,1,1,1,1,1,1]
[null,null,null,null,null,null,null,null,null,null,null,null,null,null,null,null,null,null,null,null,null,null,null,null,null,null,null,null,null,null,null,null,null,null,"N/A","N/A","N/A","N/A","N/A","N/A","N/A","N/A","N/A",1,1,1,1,1,1,1,1,1]
[null,null,null,null,null,null,null,null,null,null,null,null,null,null,null,null,null,null,null,null,null,null,null,null,null,null,null,null,null,null,null,null,null,null,"N/A","N/A","N/A","N/A","N/A","N/A","N/A","N/A","N/A",1,1,1,1,1,1,1,1,1]
[null,null,null,null,null,null,null,null,null,null,null,null,null,null,null,null,null,null,null,null,null,null,null,null,null,null,null,null,null,null,null,null,null,null,"N/A","N/A","N/A","N/A","N/A","N/A","N/A","N/A","N/A",1,1,1,1,1,1,1,1,1]
[null,null,null,null,null,null,null,null,null,null,null,null,null,null,null,null,null,null,null,null,null,null,null,null,null,null,null,null,null,null,null,null,null,null,"N/A","N/A","N/A","N/A","N/A","N/A","N/A","N/A","N/A",1,1,1,1,1,1,1,1,1]
[null,null,null,null,null,null,null,null,null,null,null,null,null,null,null,null,null,null,null,null,null,null,null,null,null,null,null,null,null,null,null,null,null,null,{"$f":"IF(COUNTA(E336:G336)>0,(COUNTIF(E336:G336,\"=0\")*0+COUNTIF(E336:G336,\"=1\")*100+COUNTIF(E336:G336,\"=2\")*80+COUNTIF(E336:G336,\"=3\")*50+COUNTIF(E336:G336,\"=8\")*20+COUNTIF(E336:G336,\"=9\")*0)/COUNTA(E336:G336)/100,\"N/A\")","v":"N/A"},{"$f":"IF(COUNTA(H336:J336)>0,(COUNTIF(H336:J336,\"=0\")*0+COUNTIF(H336:J336,\"=1\")*100+COUNTIF(H336:J336,\"=2\")*80+COUNTIF(H336:J336,\"=3\")*50+COUNTIF(H336:J336,\"=8\")*20+COUNTIF(H336:J336,\"=9\")*0)/COUNTA(H336:J336)/100,\"N/A\")","v":"N/A"},{"$f":"IF(COUNTA(K336:M336)>0,(COUNTIF(K336:M336,\"=0\")*0+COUNTIF(K336:M336,\"=1\")*100+COUNTIF(K336:M336,\"=2\")*80+COUNTIF(K336:M336,\"=3\")*50+COUNTIF(K336:M336,\"=8\")*20+COUNTIF(K336:M336,\"=9\")*0)/COUNTA(K336:M336)/100,\"N/A\")","v":"N/A"},{"$f":"IF(COUNTA(N336:V336)>0,(COUNTIF(N336:V336,\"=0\")*0+COUNTIF(N336:V336,\"=1\")*100+COUNTIF(N336:V336,\"=2\")*80+COUNTIF(N336:V336,\"=3\")*50+COUNTIF(N336:V336,\"=8\")*20+COUNTIF(N336:V336,\"=9\")*0)/COUNTA(N336:V336)/100,\"N/A\")","v":"N/A"},{"$f":"IF(COUNTA(W336:AA336)>0,(COUNTIF(W336:AA336,\"=0\")*0+COUNTIF(W336:AA336,\"=1\")*100+COUNTIF(W336:AA336,\"=2\")*80+COUNTIF(W336:AA336,\"=3\")*50+COUNTIF(W336:AA336,\"=8\")*20+COUNTIF(W336:AA336,\"=9\")*0)/COUNTA(W336:AA336)/100,\"N/A\")","v":"N/A"},{"$f":"IF(COUNTA(AB336:AC336)>0,(COUNTIF(AB336:AC336,\"=0\")*0+COUNTIF(AB336:AC336,\"=1\")*100+COUNTIF(AB336:AC336,\"=2\")*80+COUNTIF(AB336:AC336,\"=3\")*50+COUNTIF(AB336:AC336,\"=8\")*20+COUNTIF(AB336:AC336,\"=9\")*0)/COUNTA(AB336:AC336)/100,\"N/A\")","v":"N/A"},{"$f":"IF(COUNTA((AD336:AF336))>0,(COUNTIF((AD336:AF336),\"=0\")*0+COUNTIF((AD336:AF336),\"=1\")*100+COUNTIF((AD336:AF336),\"=2\")*80+COUNTIF((AD336:AF336),\"=3\")*50+COUNTIF((AD336:AF336),\"=8\")*20+COUNTIF((AD336:AF336),\"=9\")*0)/COUNTA((AD336:AF336))/100,\"N/A\")","v":"N/A"},{"$f":"IF(COUNTA(AG336:AH336)>0,(COUNTIF(AG336:AH336,\"=0\")*0+COUNTIF(AG336:AH336,\"=1\")*100+COUNTIF(AG336:AH336,\"=2\")*80+COUNTIF(AG336:AH336,\"=3\")*50+COUNTIF(AG336:AH336,\"=8\")*20+COUNTIF(AG336:AH336,\"=9\")*0)/COUNTA(AG336:AH336)/100,\"N/A\")","v":"N/A"},{"$f":"IF(AND(COUNTA(E336:AH336)<>0,B336<>\"\"),AVERAGE(AL336:AP336,AI336),\"N/A\")","v":"N/A"},1,1,1,1,1,1,1,1,1]
[null,null,null,null,null,null,null,null,null,null,null,null,null,null,null,null,null,null,null,null,null,null,null,null,null,null,null,null,null,null,null,null,null,null,"N/A","N/A","N/A","N/A","N/A","N/A","N/A","N/A","N/A",1,1,1,1,1,1,1,1,1]
[null,null,null,null,null,null,null,null,null,null,null,null,null,null,null,null,null,null,null,null,null,null,null,null,null,null,null,null,null,null,null,null,null,null,"N/A","N/A","N/A","N/A","N/A","N/A","N/A","N/A","N/A",1,1,1,1,1,1,1,1,1]
[null,null,null,null,null,null,null,null,null,null,null,null,null,null,null,null,null,null,null,null,null,null,null,null,null,null,null,null,null,null,null,null,null,null,"N/A","N/A","N/A","N/A","N/A","N/A","N/A","N/A","N/A",1,1,1,1,1,1,1,1,1]
[null,null,null,null,null,null,null,null,null,null,null,null,null,null,null,null,null,null,null,null,null,null,null,null,null,null,null,null,null,null,null,null,null,null,"N/A","N/A","N/A","N/A","N/A","N/A","N/A","N/A","N/A",1,1,1,1,1,1,1,1,1]
[null,null,null,null,null,null,null,null,null,null,null,null,null,null,null,null,null,null,null,null,null,null,null,null,null,null,null,null,null,null,null,null,null,null,"N/A","N/A","N/A","N/A","N/A","N/A","N/A","N/A","N/A",1,1,1,1,1,1,1,1,1]
[null,null,null,null,null,null,null,null,null,null,null,null,null,null,null,null,null,null,null,null,null,null,null,null,null,null,null,null,null,null,null,null,null,null,"N/A","N/A","N/A","N/A","N/A","N/A","N/A","N/A","N/A",1,1,1,1,1,1,1,1,1]
[null,null,null,null,null,null,null,null,null,null,null,null,null,null,null,null,null,null,null,null,null,null,null,null,null,null,null,null,null,null,null,null,null,null,"N/A","N/A","N/A","N/A","N/A","N/A","N/A","N/A","N/A",1,1,1,1,1,1,1,1,1]
[null,null,null,null,null,null,null,null,null,null,null,null,null,null,null,null,null,null,null,null,null,null,null,null,null,null,null,null,null,null,null,null,null,null,"N/A","N/A","N/A","N/A","N/A","N/A","N/A","N/A","N/A",1,1,1,1,1,1,1,1,1]
[null,null,null,null,null,null,null,null,null,null,null,null,null,null,null,null,null,null,null,null,null,null,null,null,null,null,null,null,null,null,null,null,null,null,{"$f":"IF(COUNTA(E345:G345)>0,(COUNTIF(E345:G345,\"=0\")*0+COUNTIF(E345:G345,\"=1\")*100+COUNTIF(E345:G345,\"=2\")*80+COUNTIF(E345:G345,\"=3\")*50+COUNTIF(E345:G345,\"=8\")*20+COUNTIF(E345:G345,\"=9\")*0)/COUNTA(E345:G345)/100,\"N/A\")","v":"N/A"},{"$f":"IF(COUNTA(H345:J345)>0,(COUNTIF(H345:J345,\"=0\")*0+COUNTIF(H345:J345,\"=1\")*100+COUNTIF(H345:J345,\"=2\")*80+COUNTIF(H345:J345,\"=3\")*50+COUNTIF(H345:J345,\"=8\")*20+COUNTIF(H345:J345,\"=9\")*0)/COUNTA(H345:J345)/100,\"N/A\")","v":"N/A"},{"$f":"IF(COUNTA(K345:M345)>0,(COUNTIF(K345:M345,\"=0\")*0+COUNTIF(K345:M345,\"=1\")*100+COUNTIF(K345:M345,\"=2\")*80+COUNTIF(K345:M345,\"=3\")*50+COUNTIF(K345:M345,\"=8\")*20+COUNTIF(K345:M345,\"=9\")*0)/COUNTA(K345:M345)/100,\"N/A\")","v":"N/A"},{"$f":"IF(COUNTA(N345:V345)>0,(COUNTIF(N345:V345,\"=0\")*0+COUNTIF(N345:V345,\"=1\")*100+COUNTIF(N345:V345,\"=2\")*80+COUNTIF(N345:V345,\"=3\")*50+COUNTIF(N345:V345,\"=8\")*20+COUNTIF(N345:V345,\"=9\")*0)/COUNTA(N345:V345)/100,\"N/A\")","v":"N/A"},{"$f":"IF(COUNTA(W345:AA345)>0,(COUNTIF(W345:AA345,\"=0\")*0+COUNTIF(W345:AA345,\"=1\")*100+COUNTIF(W345:AA345,\"=2\")*80+COUNTIF(W345:AA345,\"=3\")*50+COUNTIF(W345:AA345,\"=8\")*20+COUNTIF(W345:AA345,\"=9\")*0)/COUNTA(W345:AA345)/100,\"N/A\")","v":"N/A"},{"$f":"IF(COUNTA(AB345:AC345)>0,(COUNTIF(AB345:AC345,\"=0\")*0+COUNTIF(AB345:AC345,\"=1\")*100+COUNTIF(AB345:AC345,\"=2\")*80+COUNTIF(AB345:AC345,\"=3\")*50+COUNTIF(AB345:AC345,\"=8\")*20+COUNTIF(AB345:AC345,\"=9\")*0)/COUNTA(AB345:AC345)/100,\"N/A\")","v":"N/A"},{"$f":"IF(COUNTA((AD345:AF345))>0,(COUNTIF((AD345:AF345),\"=0\")*0+COUNTIF((AD345:AF345),\"=1\")*100+COUNTIF((AD345:AF345),\"=2\")*80+COUNTIF((AD345:AF345),\"=3\")*50+COUNTIF((AD345:AF345),\"=8\")*20+COUNTIF((AD345:AF345),\"=9\")*0)/COUNTA((AD345:AF345))/100,\"N/A\")","v":"N/A"},{"$f":"IF(COUNTA(AG345:AH345)>0,(COUNTIF(AG345:AH345,\"=0\")*0+COUNTIF(AG345:AH345,\"=1\")*100+COUNTIF(AG345:AH345,\"=2\")*80+COUNTIF(AG345:AH345,\"=3\")*50+COUNTIF(AG345:AH345,\"=8\")*20+COUNTIF(AG345:AH345,\"=9\")*0)/COUNTA(AG345:AH345)/100,\"N/A\")","v":"N/A"},{"$f":"IF(AND(COUNTA(E345:AH345)<>0,B345<>\"\"),AVERAGE(AL345:AP345,AI345),\"N/A\")","v":"N/A"},1,1,{"$f":"IF(AK345=\"N/A\",1,\"\")","v":1},{"$f":"IF(AL345=\"N/A\",1,\"\")","v":1},{"$f":"IF(AM345=\"N/A\",1,\"\")","v":1},{"$f":"IF(AN345=\"N/A\",1,\"\")","v":1},{"$f":"IF(AO345=\"N/A\",1,\"\")","v":1},1,1]
[null,null,null,null,null,null,null,null,null,null,null,null,null,null,null,null,null,null,null,null,null,null,null,null,null,null,null,null,null,null,null,null,null,null,{"$f":"IF(COUNTA(E346:G346)>0,(COUNTIF(E346:G346,\"=0\")*0+COUNTIF(E346:G346,\"=1\")*100+COUNTIF(E346:G346,\"=2\")*80+COUNTIF(E346:G346,\"=3\")*50+COUNTIF(E346:G346,\"=8\")*20+COUNTIF(E346:G346,\"=9\")*0)/COUNTA(E346:G346)/100,\"N/A\")","v":"N/A"},{"$f":"IF(COUNTA(H346:J346)>0,(COUNTIF(H346:J346,\"=0\")*0+COUNTIF(H346:J346,\"=1\")*100+COUNTIF(H346:J346,\"=2\")*80+COUNTIF(H346:J346,\"=3\")*50+COUNTIF(H346:J346,\"=8\")*20+COUNTIF(H346:J346,\"=9\")*0)/COUNTA(H346:J346)/100,\"N/A\")","v":"N/A"},{"$f":"IF(COUNTA(K346:M346)>0,(COUNTIF(K346:M346,\"=0\")*0+COUNTIF(K346:M346,\"=1\")*100+COUNTIF(K346:M346,\"=2\")*80+COUNTIF(K346:M346,\"=3\")*50+COUNTIF(K346:M346,\"=8\")*20+COUNTIF(K346:M346,\"=9\")*0)/COUNTA(K346:M346)/100,\"N/A\")","v":"N/A"},{"$f":"IF(COUNTA(N346:V346)>0,(COUNTIF(N346:V346,\"=0\")*0+COUNTIF(N346:V346,\"=1\")*100+COUNTIF(N346:V346,\"=2\")*80+COUNTIF(N346:V346,\"=3\")*50+COUNTIF(N346:V346,\"=8\")*20+COUNTIF(N346:V346,\"=9\")*0)/COUNTA(N346:V346)/100,\"N/A\")","v":"N/A"},{"$f":"IF(COUNTA(W346:AA346)>0,(COUNTIF(W346:AA346,\"=0\")*0+COUNTIF(W346:AA346,\"=1\")*100+COUNTIF(W346:AA346,\"=2\")*80+COUNTIF(W346:AA346,\"=3\")*50+COUNTIF(W346:AA346,\"=8\")*20+COUNTIF(W346:AA346,\"=9\")*0)/COUNTA(W346:AA346)/100,\"N/A\")","v":"N/A"},{"$f":"IF(COUNTA(AB346:AC346)>0,(COUNTIF(AB346:AC346,\"=0\")*0+COUNTIF(AB346:AC346,\"=1\")*100+COUNTIF(AB346:AC346,\"=2\")*80+COUNTIF(AB346:AC346,\"=3\")*50+COUNTIF(AB346:AC346,\"=8\")*20+COUNTIF(AB346:AC346,\"=9\")*0)/COUNTA(AB346:AC346)/100,\"N/A\")","v":"N/A"},{"$f":"IF(COUNTA((AD346:AF346))>0,(COUNTIF((AD346:AF346),\"=0\")*0+COUNTIF((AD346:AF346),\"=1\")*100+COUNTIF((AD346:AF346),\"=2\")*80+COUNTIF((AD346:AF346),\"=3\")*50+COUNTIF((AD346:AF346),\"=8\")*20+COUNTIF((AD346:AF346),\"=9\")*0)/COUNTA((AD346:AF346))/100,\"N/A\")","v":"N/A"},{"$f":"IF(COUNTA(AG346:AH346)>0,(COUNTIF(AG346:AH346,\"=0\")*0+COUNTIF(AG346:AH346,\"=1\")*100+COUNTIF(AG346:AH346,\"=2\")*80+COUNTIF(AG346:AH346,\"=3\")*50+COUNTIF(AG346:AH346,\"=8\")*20+COUNTIF(AG346:AH346,\"=9\")*0)/COUNTA(AG346:AH346)/100,\"N/A\")","v":"N/A"},{"$f":"IF(AND(COUNTA(E346:AH346)<>0,B346<>\"\"),AVERAGE(AL346:AP346,AI346),\"N/A\")","v":"N/A"},1,1,1,1,1,1,1,1,1]
[null,null,null,null,null,null,null,null,null,null,null,null,null,null,null,null,null,null,null,null,null,null,null,null,null,null,null,null,null,null,null,null,null,null,"N/A","N/A","N/A","N/A","N/A","N/A","N/A","N/A","N/A",1,1,1,1,1,1,1,1,1]
[null,null,null,null,null,null,null,null,null,null,null,null,null,null,null,null,null,null,null,null,null,null,null,null,null,null,null,null,null,null,null,null,null,null,"N/A","N/A","N/A","N/A","N/A","N/A","N/A","N/A","N/A",1,1,1,1,1,1,1,1,1]
[null,null,null,null,null,null,null,null,null,null,null,null,null,null,null,null,null,null,null,null,null,null,null,null,null,null,null,null,null,null,null,null,null,null,"N/A","N/A","N/A","N/A","N/A","N/A","N/A","N/A","N/A",1,1,1,1,1,1,1,1,1]
[null,null,null,null,null,null,null,null,null,null,null,null,null,null,null,null,null,null,null,null,null,null,null,null,null,null,null,null,null,null,null,null,null,null,"N/A","N/A","N/A","N/A","N/A","N/A","N/A","N/A","N/A",1,1,1,1,1,1,1,1,1]
[null,null,null,null,null,null,null,null,null,null,null,null,null,null,null,null,null,null,null,null,null,null,null,null,null,null,null,null,null,null,null,null,null,null,"N/A","N/A","N/A","N/A","N/A","N/A","N/A","N/A","N/A",1,1,1,1,1,1,1,1,1]
[null,null,null,null,null,null,null,null,null,null,null,null,null,null,null,null,null,null,null,null,null,null,null,null,null,null,null,null,null,null,null,null,null,null,"N/A","N/A","N/A","N/A","N/A","N/A","N/A","N/A","N/A",1,1,1,1,1,1,1,1,1]
[null,null,null,null,null,null,null,null,null,null,null,null,null,null,null,null,null,null,null,null,null,null,null,null,null,null,null,null,null,null,null,null,null,null,"N/A","N/A","N/A","N/A","N/A","N/A","N/A","N/A","N/A",1,1,1,1,1,1,1,1,1]
[null,null,null,null,null,null,null,null,null,null,null,null,null,null,null,null,null,null,null,null,null,null,null,null,null,null,null,null,null,null,null,null,null,null,"N/A","N/A","N/A","N/A","N/A","N/A","N/A","N/A","N/A",1,1,1,1,1,1,1,1,1]
[null,null,null,null,null,null,null,null,null,null,null,null,null,null,null,null,null,null,null,null,null,null,null,null,null,null,null,null,null,null,null,null,null,null,"N/A","N/A","N/A","N/A","N/A","N/A","N/A","N/A","N/A",1,1,1,1,1,1,1,1,1]
[null,null,null,null,null,null,null,null,null,null,null,null,null,null,null,null,null,null,null,null,null,null,null,null,null,null,null,null,null,null,null,null,null,null,"N/A","N/A","N/A","N/A","N/A","N/A","N/A","N/A","N/A",1,1,1,1,1,1,1,1,1]
[null,null,null,null,null,null,null,null,null,null,null,null,null,null,null,null,null,null,null,null,null,null,null,null,null,null,null,null,null,null,null,null,null,null,"N/A","N/A","N/A","N/A","N/A","N/A","N/A","N/A","N/A",1,1,1,1,1,1,1,1,1]
[null,null,null,null,null,null,null,null,null,null,null,null,null,null,null,null,null,null,null,null,null,null,null,null,null,null,null,null,null,null,null,null,null,null,"N/A","N/A","N/A","N/A","N/A","N/A","N/A","N/A","N/A",1,1,1,1,1,1,1,1,1]
[null,null,null,null,null,null,null,null,null,null,null,null,null,null,null,null,null,null,null,null,null,null,null,null,null,null,null,null,null,null,null,null,null,null,"N/A","N/A","N/A","N/A","N/A","N/A","N/A","N/A","N/A",1,1,1,1,1,1,1,1,1]
[null,null,null,null,null,null,null,null,null,null,null,null,null,null,null,null,null,null,null,null,null,null,null,null,null,null,null,null,null,null,null,null,null,null,"N/A","N/A","N/A","N/A","N/A","N/A","N/A","N/A","N/A",1,1,1,1,1,1,1,1,1]
[null,null,null,null,null,null,null,null,null,null,null,null,null,null,null,null,null,null,null,null,null,null,null,null,null,null,null,null,null,null,null,null,null,null,"N/A","N/A","N/A","N/A","N/A","N/A","N/A","N/A","N/A",1,1,1,1,1,1,1,1,1]
[null,null,null,null,null,null,null,null,null,null,null,null,null,null,null,null,null,null,null,null,null,null,null,null,null,null,null,null,null,null,null,null,null,null,"N/A","N/A","N/A","N/A","N/A","N/A","N/A","N/A","N/A",1,1,1,1,1,1,1,1,1]
[null,null,null,null,null,null,null,null,null,null,null,null,null,null,null,null,null,null,null,null,null,null,null,null,null,null,null,null,null,null,null,null,null,null,"N/A","N/A","N/A","N/A","N/A","N/A","N/A","N/A","N/A",1,1,1,1,1,1,1,1,1]
[null,null,null,null,null,null,null,null,null,null,null,null,null,null,null,null,null,null,null,null,null,null,null,null,null,null,null,null,null,null,null,null,null,null,"N/A","N/A","N/A","N/A","N/A","N/A","N/A","N/A","N/A",1,1,1,1,1,1,1,1,1]
[null,null,null,null,null,null,null,null,null,null,null,null,null,null,null,null,null,null,null,null,null,null,null,null,null,null,null,null,null,null,null,null,null,null,"N/A","N/A","N/A","N/A","N/A","N/A","N/A","N/A","N/A",1,1,1,1,1,1,1,1,1]
[null,null,null,null,null,null,null,null,null,null,null,null,null,null,null,null,null,null,null,null,null,null,null,null,null,null,null,null,null,null,null,null,null,null,"N/A","N/A","N/A","N/A","N/A","N/A","N/A","N/A","N/A",1,1,1,1,1,1,1,1,1]
[null,null,null,null,null,null,null,null,null,null,null,null,null,null,null,null,null,null,null,null,null,null,null,null,null,null,null,null,null,null,null,null,null,null,"N/A","N/A","N/A","N/A","N/A","N/A","N/A","N/A","N/A",1,1,1,1,1,1,1,1,1]
[null,null,null,null,null,null,null,null,null,null,null,null,null,null,null,null,null,null,null,null,null,null,null,null,null,null,null,null,null,null,null,null,null,null,"N/A","N/A","N/A","N/A","N/A","N/A","N/A","N/A","N/A",1,1,1,1,1,1,1,1,1]
[null,null,null,null,null,null,null,null,null,null,null,null,null,null,null,null,null,null,null,null,null,null,null,null,null,null,null,null,null,null,null,null,null,null,"N/A","N/A","N/A","N/A","N/A","N/A","N/A","N/A","N/A",1,1,1,1,1,1,1,1,1]
[null,null,null,null,null,null,null,null,null,null,null,null,null,null,null,null,null,null,null,null,null,null,null,null,null,null,null,null,null,null,null,null,null,null,"N/A","N/A","N/A","N/A","N/A","N/A","N/A","N/A","N/A",1,1,1,1,1,1,1,1,1]
[null,null,null,null,null,null,null,null,null,null,null,null,null,null,null,null,null,null,null,null,null,null,null,null,null,null,null,null,null,null,null,null,null,null,"N/A","N/A","N/A","N/A","N/A","N/A","N/A","N/A","N/A",1,1,1,1,1,1,{"$f":"IF(AO371=\"N/A\",1,\"\")","v":1},1,1]
[null,null,null,null,null,null,null,null,null,null,null,null,null,null,null,null,null,null,null,null,null,null,null,null,null,null,null,null,null,null,null,null,null,null,"N/A","N/A","N/A","N/A","N/A","N/A","N/A","N/A","N/A",{"$f":"IF(AI372=\"N/A\",1,\"\")","v":1},1,1,1,1,1,1,1,1]
[null,null,null,null,null,null,null,null,null,null,null,null,null,null,null,null,null,null,null,null,null,null,null,null,null,null,null,null,null,null,null,null,null,null,"N/A","N/A","N/A","N/A","N/A","N/A","N/A","N/A","N/A",1,1,1,1,1,1,1,1,1]
[null,null,null,null,null,null,null,null,null,null,null,null,null,null,null,null,null,null,null,null,null,null,null,null,null,null,null,null,null,null,null,null,null,null,"N/A","N/A","N/A","N/A","N/A","N/A","N/A","N/A","N/A",1,1,1,1,1,1,1,1,1]
[null,null,null,null,null,null,null,null,null,null,null,null,null,null,null,null,null,null,null,null,null,null,null,null,null,null,null,null,null,null,null,null,null,null,"N/A","N/A","N/A","N/A","N/A","N/A","N/A","N/A","N/A",1,1,1,1,1,1,1,1,1]
[null,null,null,null,null,null,null,null,null,null,null,null,null,null,null,null,null,null,null,null,null,null,null,null,null,null,null,null,null,null,null,null,null,null,"N/A","N/A","N/A","N/A","N/A","N/A","N/A","N/A","N/A",1,1,1,1,1,1,1,1,1]
[null,null,null,null,null,null,null,null,null,null,null,null,null,null,null,null,null,null,null,null,null,null,null,null,null,null,null,null,null,null,null,null,null,null,"N/A","N/A","N/A","N/A","N/A","N/A","N/A","N/A","N/A",1,1,1,1,1,1,1,1,1]
[null,null,null,null,null,null,null,null,null,null,null,null,null,null,null,null,null,null,null,null,null,null,null,null,null,null,null,null,null,null,null,null,null,null,"N/A","N/A","N/A","N/A","N/A","N/A","N/A","N/A","N/A",1,1,1,1,1,1,1,1,1]
[null,null,null,null,null,null,null,null,null,null,null,null,null,null,null,null,null,null,null,null,null,null,null,null,null,null,null,null,null,null,null,null,null,null,"N/A","N/A","N/A","N/A","N/A","N/A","N/A","N/A","N/A",1,1,1,1,1,1,1,1,1]
[null,null,null,null,null,null,null,null,null,null,null,null,null,null,null,null,null,null,null,null,null,null,null,null,null,null,null,null,null,null,null,null,null,null,"N/A","N/A","N/A","N/A","N/A","N/A","N/A","N/A","N/A",1,1,1,1,1,1,1,1,1]
[null,null,null,null,null,null,null,null,null,null,null,null,null,null,null,null,null,null,null,null,null,null,null,null,null,null,null,null,null,null,null,null,null,null,"N/A","N/A","N/A","N/A","N/A","N/A","N/A","N/A","N/A",1,1,1,1,1,1,1,1,1]
[null,null,null,null,null,null,null,null,null,null,null,null,null,null,null,null,null,null,null,null,null,null,null,null,null,null,null,null,null,null,null,null,null,null,"N/A","N/A","N/A","N/A","N/A","N/A","N/A","N/A","N/A",1,1,1,1,1,1,1,1,1]
[null,null,null,null,null,null,null,null,null,null,null,null,null,null,null,null,null,null,null,null,null,null,null,null,null,null,null,null,null,null,null,null,null,null,"N/A","N/A","N/A","N/A","N/A","N/A","N/A","N/A","N/A",1,1,1,1,1,1,1,1,1]
[null,null,null,null,null,null,null,null,null,null,null,null,null,null,null,null,null,null,null,null,null,null,null,null,null,null,null,null,null,null,null,null,null,null,"N/A","N/A","N/A","N/A","N/A","N/A","N/A","N/A","N/A",1,1,1,1,1,1,1,1,1]
[null,null,null,null,null,null,null,null,null,null,null,null,null,null,null,null,null,null,null,null,null,null,null,null,null,null,null,null,null,null,null,null,null,null,"N/A","N/A","N/A","N/A","N/A","N/A","N/A","N/A","N/A",1,1,1,1,1,1,1,1,1]
[null,null,null,null,null,null,null,null,null,null,null,null,null,null,null,null,null,null,null,null,null,null,null,null,null,null,null,null,null,null,null,null,null,null,"N/A","N/A","N/A","N/A","N/A","N/A","N/A","N/A","N/A",1,1,1,1,1,1,1,1,1]
[null,null,null,null,null,null,null,null,null,null,null,null,null,null,null,null,null,null,null,null,null,null,null,null,null,null,null,null,null,null,null,null,null,null,"N/A","N/A","N/A","N/A","N/A","N/A","N/A","N/A","N/A",1,1,1,1,1,1,1,1,1]
[null,null,null,null,null,null,null,null,null,null,null,null,null,null,null,null,null,null,null,null,null,null,null,null,null,null,null,null,null,null,null,null,null,null,"N/A","N/A","N/A","N/A","N/A","N/A","N/A","N/A","N/A",1,1,1,1,1,1,1,1,1]
[null,null,null,null,null,null,null,null,null,null,null,null,null,null,null,null,null,null,null,null,null,null,null,null,null,null,null,null,null,null,null,null,null,null,"N/A","N/A","N/A","N/A","N/A","N/A","N/A","N/A","N/A",1,1,1,1,1,1,1,1,1]
[null,null,null,null,null,null,null,null,null,null,null,null,null,null,null,null,null,null,null,null,null,null,null,null,null,null,null,null,null,null,null,null,null,null,"N/A","N/A","N/A","N/A","N/A","N/A","N/A","N/A","N/A",1,1,1,1,1,1,1,1,1]
[null,null,null,null,null,null,null,null,null,null,null,null,null,null,null,null,null,null,null,null,null,null,null,null,null,null,null,null,null,null,null,null,null,null,"N/A","N/A","N/A","N/A","N/A","N/A","N/A","N/A","N/A",1,1,1,1,1,1,1,1,1]
[null,null,null,null,null,null,null,null,null,null,null,null,null,null,null,null,null,null,null,null,null,null,null,null,null,null,null,null,null,null,null,null,null,null,"N/A","N/A","N/A","N/A","N/A","N/A","N/A","N/A","N/A",1,1,1,1,1,1,1,1,1]
[null,null,null,null,null,null,null,null,null,null,null,null,null,null,null,null,null,null,null,null,null,null,null,null,null,null,null,null,null,null,null,null,null,null,"N/A","N/A","N/A","N/A","N/A","N/A","N/A","N/A","N/A",1,1,1,1,1,1,1,{"$f":"IF(AP393=\"N/A\",1,\"\")","v":1},1]
[null,null,null,null,null,null,null,null,null,null,null,null,null,null,null,null,null,null,null,null,null,null,null,null,null,null,null,null,null,null,null,null,null,null,"N/A","N/A","N/A","N/A","N/A","N/A","N/A","N/A","N/A",1,1,1,1,1,1,1,1,1]
[null,null,null,null,null,null,null,null,null,null,null,null,null,null,null,null,null,null,null,null,null,null,null,null,null,null,null,null,null,null,null,null,null,null,"N/A","N/A","N/A","N/A","N/A","N/A","N/A","N/A","N/A",1,1,1,1,1,1,1,1,1]
[null,null,null,null,null,null,null,null,null,null,null,null,null,null,null,null,null,null,null,null,null,null,null,null,null,null,null,null,null,null,null,null,null,null,"N/A","N/A","N/A","N/A","N/A","N/A","N/A","N/A","N/A",1,1,1,1,1,1,1,1,1]
[null,null,null,null,null,null,null,null,null,null,null,null,null,null,null,null,null,null,null,null,null,null,null,null,null,null,null,null,null,null,null,null,null,null,"N/A","N/A","N/A","N/A","N/A","N/A","N/A","N/A","N/A",1,1,1,1,1,1,1,1,1]
[null,null,null,null,null,null,null,null,null,null,null,null,null,null,null,null,null,null,null,null,null,null,null,null,null,null,null,null,null,null,null,null,null,null,"N/A","N/A","N/A","N/A","N/A","N/A","N/A","N/A","N/A",1,1,1,1,1,1,1,1,1]
[null,null,null,null,null,null,null,null,null,null,null,null,null,null,null,null,null,null,null,null,null,null,null,null,null,null,null,null,null,null,null,null,null,null,"N/A","N/A","N/A","N/A","N/A","N/A","N/A","N/A","N/A",1,1,1,1,1,1,1,1,1]
[null,null,null,null,null,null,null,null,null,null,null,null,null,null,null,null,null,null,null,null,null,null,null,null,null,null,null,null,null,null,null,null,null,null,"N/A","N/A","N/A","N/A","N/A","N/A","N/A","N/A","N/A",1,1,1,1,1,1,1,1,1]
[null,null,null,null,null,null,null,null,null,null,null,null,null,null,null,null,null,null,null,null,null,null,null,null,null,null,null,null,null,null,null,null,null,null,"N/A","N/A","N/A","N/A","N/A","N/A","N/A","N/A","N/A",1,1,1,1,1,1,1,1,1]
[null,null,null,null,null,null,null,null,null,null,null,null,null,null,null,null,null,null,null,null,null,null,null,null,null,null,null,null,null,null,null,null,null,null,"N/A","N/A","N/A","N/A","N/A","N/A","N/A","N/A","N/A",1,1,1,1,1,1,1,1,1]
[null,null,null,null,null,null,null,null,null,null,null,null,null,null,null,null,null,null,null,null,null,null,null,null,null,null,null,null,null,null,null,null,null,null,"N/A","N/A","N/A","N/A","N/A","N/A","N/A","N/A","N/A",1,1,1,1,1,1,1,1,1]
[null,null,null,null,null,null,null,null,null,null,null,null,null,null,null,null,null,null,null,null,null,null,null,null,null,null,null,null,null,null,null,null,null,null,"N/A","N/A","N/A","N/A","N/A","N/A","N/A","N/A","N/A",1,1,1,1,1,1,1,1,1]
[null,null,null,null,null,null,null,null,null,null,null,null,null,null,null,null,null,null,null,null,null,null,null,null,null,null,null,null,null,null,null,null,null,null,"N/A","N/A","N/A","N/A","N/A","N/A","N/A","N/A","N/A",1,1,1,1,1,1,1,1,1]
[null,null,null,null,null,null,null,null,null,null,null,null,null,null,null,null,null,null,null,null,null,null,null,null,null,null,null,null,null,null,null,null,null,null,"N/A","N/A","N/A","N/A","N/A","N/A","N/A","N/A","N/A",1,1,1,1,1,1,1,1,1]
[null,null,null,null,null,null,null,null,null,null,null,null,null,null,null,null,null,null,null,null,null,null,null,null,null,null,null,null,null,null,null,null,null,null,"N/A","N/A","N/A","N/A","N/A","N/A","N/A","N/A","N/A",1,1,1,1,1,1,1,1,1]
[null,null,null,null,null,null,null,null,null,null,null,null,null,null,null,null,null,null,null,null,null,null,null,null,null,null,null,null,null,null,null,null,null,null,"N/A","N/A","N/A","N/A","N/A","N/A","N/A","N/A","N/A",1,1,1,1,1,1,1,1,1]
[null,null,null,null,null,null,null,null,null,null,null,null,null,null,null,null,null,null,null,null,null,null,null,null,null,null,null,null,null,null,null,null,null,null,"N/A","N/A","N/A","N/A","N/A","N/A","N/A","N/A","N/A",1,1,1,1,1,1,1,1,1]
[null,null,null,null,null,null,null,null,null,null,null,null,null,null,null,null,null,null,null,null,null,null,null,null,null,null,null,null,null,null,null,null,null,null,{"$f":"IF(COUNTA(E410:G410)>0,(COUNTIF(E410:G410,\"=0\")*0+COUNTIF(E410:G410,\"=1\")*100+COUNTIF(E410:G410,\"=2\")*80+COUNTIF(E410:G410,\"=3\")*50+COUNTIF(E410:G410,\"=8\")*20+COUNTIF(E410:G410,\"=9\")*0)/COUNTA(E410:G410)/100,\"N/A\")","v":"N/A"},{"$f":"IF(COUNTA(H410:J410)>0,(COUNTIF(H410:J410,\"=0\")*0+COUNTIF(H410:J410,\"=1\")*100+COUNTIF(H410:J410,\"=2\")*80+COUNTIF(H410:J410,\"=3\")*50+COUNTIF(H410:J410,\"=8\")*20+COUNTIF(H410:J410,\"=9\")*0)/COUNTA(H410:J410)/100,\"N/A\")","v":"N/A"},{"$f":"IF(COUNTA(K410:M410)>0,(COUNTIF(K410:M410,\"=0\")*0+COUNTIF(K410:M410,\"=1\")*100+COUNTIF(K410:M410,\"=2\")*80+COUNTIF(K410:M410,\"=3\")*50+COUNTIF(K410:M410,\"=8\")*20+COUNTIF(K410:M410,\"=9\")*0)/COUNTA(K410:M410)/100,\"N/A\")","v":"N/A"},{"$f":"IF(COUNTA(N410:V410)>0,(COUNTIF(N410:V410,\"=0\")*0+COUNTIF(N410:V410,\"=1\")*100+COUNTIF(N410:V410,\"=2\")*80+COUNTIF(N410:V410,\"=3\")*50+COUNTIF(N410:V410,\"=8\")*20+COUNTIF(N410:V410,\"=9\")*0)/COUNTA(N410:V410)/100,\"N/A\")","v":"N/A"},{"$f":"IF(COUNTA(W410:AA410)>0,(COUNTIF(W410:AA410,\"=0\")*0+COUNTIF(W410:AA410,\"=1\")*100+COUNTIF(W410:AA410,\"=2\")*80+COUNTIF(W410:AA410,\"=3\")*50+COUNTIF(W410:AA410,\"=8\")*20+COUNTIF(W410:AA410,\"=9\")*0)/COUNTA(W410:AA410)/100,\"N/A\")","v":"N/A"},{"$f":"IF(COUNTA(AB410:AC410)>0,(COUNTIF(AB410:AC410,\"=0\")*0+COUNTIF(AB410:AC410,\"=1\")*100+COUNTIF(AB410:AC410,\"=2\")*80+COUNTIF(AB410:AC410,\"=3\")*50+COUNTIF(AB410:AC410,\"=8\")*20+COUNTIF(AB410:AC410,\"=9\")*0)/COUNTA(AB410:AC410)/100,\"N/A\")","v":"N/A"},{"$f":"IF(COUNTA((AD410:AF410))>0,(COUNTIF((AD410:AF410),\"=0\")*0+COUNTIF((AD410:AF410),\"=1\")*100+COUNTIF((AD410:AF410),\"=2\")*80+COUNTIF((AD410:AF410),\"=3\")*50+COUNTIF((AD410:AF410),\"=8\")*20+COUNTIF((AD410:AF410),\"=9\")*0)/COUNTA((AD410:AF410))/100,\"N/A\")","v":"N/A"},{"$f":"IF(COUNTA(AG410:AH410)>0,(COUNTIF(AG410:AH410,\"=0\")*0+COUNTIF(AG410:AH410,\"=1\")*100+COUNTIF(AG410:AH410,\"=2\")*80+COUNTIF(AG410:AH410,\"=3\")*50+COUNTIF(AG410:AH410,\"=8\")*20+COUNTIF(AG410:AH410,\"=9\")*0)/COUNTA(AG410:AH410)/100,\"N/A\")","v":"N/A"},{"$f":"IF(AND(COUNTA(E410:AH410)<>0,B410<>\"\"),AVERAGE(AL410:AP410,AI410),\"N/A\")","v":"N/A"},1,1,1,1,1,1,1,1,1]
[null,null,null,null,null,null,null,null,null,null,null,null,null,null,null,null,null,null,null,null,null,null,null,null,null,null,null,null,null,null,null,null,null,null,"N/A","N/A","N/A","N/A","N/A","N/A","N/A","N/A","N/A",1,1,1,1,1,1,1,1,1]
[null,null,null,null,null,null,null,null,null,null,null,null,null,null,null,null,null,null,null,null,null,null,null,null,null,null,null,null,null,null,null,null,null,null,"N/A","N/A","N/A","N/A","N/A","N/A","N/A","N/A","N/A",1,1,1,1,1,1,1,1,1]
[null,null,null,null,null,null,null,null,null,null,null,null,null,null,null,null,null,null,null,null,null,null,null,null,null,null,null,null,null,null,null,null,null,null,"N/A","N/A","N/A","N/A","N/A","N/A","N/A","N/A","N/A",1,1,1,1,1,1,1,1,1]
[null,null,null,null,null,null,null,null,null,null,null,null,null,null,null,null,null,null,null,null,null,null,null,null,null,null,null,null,null,null,null,null,null,null,"N/A","N/A","N/A","N/A","N/A","N/A","N/A","N/A","N/A",1,1,1,{"$f":"IF(AL414=\"N/A\",1,\"\")","v":1},1,1,1,1,1]
[null,null,null,null,null,null,null,null,null,null,null,null,null,null,null,null,null,null,null,null,null,null,null,null,null,null,null,null,null,null,null,null,null,null,"N/A","N/A","N/A","N/A","N/A","N/A","N/A","N/A","N/A",{"$f":"IF(AI415=\"N/A\",1,\"\")","v":1},1,1,1,1,1,1,1,1]
[null,null,null,null,null,null,null,null,null,null,null,null,null,null,null,null,null,null,null,null,null,null,null,null,null,null,null,null,null,null,null,null,null,null,"N/A","N/A","N/A","N/A","N/A","N/A","N/A","N/A","N/A",1,1,1,1,1,1,1,1,1]
[null,null,null,null,null,null,null,null,null,null,null,null,null,null,null,null,null,null,null,null,null,null,null,null,null,null,null,null,null,null,null,null,null,null,"N/A","N/A","N/A","N/A","N/A","N/A","N/A","N/A","N/A",1,1,1,1,1,1,1,1,1]
[null,null,null,null,null,null,null,null,null,null,null,null,null,null,null,null,null,null,null,null,null,null,null,null,null,null,null,null,null,null,null,null,null,null,"N/A","N/A","N/A","N/A","N/A","N/A","N/A","N/A","N/A",1,1,1,1,1,1,1,1,1]
[null,null,null,null,null,null,null,null,null,null,null,null,null,null,null,null,null,null,null,null,null,null,null,null,null,null,null,null,null,null,null,null,null,null,"N/A","N/A","N/A","N/A","N/A","N/A","N/A","N/A","N/A",1,1,1,1,1,1,1,1,1]
[null,null,null,null,null,null,null,null,null,null,null,null,null,null,null,null,null,null,null,null,null,null,null,null,null,null,null,null,null,null,null,null,null,null,"N/A","N/A","N/A","N/A","N/A","N/A","N/A","N/A","N/A",1,1,1,1,1,1,1,1,1]
[null,null,null,null,null,null,null,null,null,null,null,null,null,null,null,null,null,null,null,null,null,null,null,null,null,null,null,null,null,null,null,null,null,null,"N/A","N/A","N/A","N/A","N/A","N/A","N/A","N/A","N/A",1,1,1,1,1,1,1,1,1]
[null,null,null,null,null,null,null,null,null,null,null,null,null,null,null,null,null,null,null,null,null,null,null,null,null,null,null,null,null,null,null,null,null,null,"N/A","N/A","N/A","N/A","N/A","N/A","N/A","N/A","N/A",1,1,1,1,1,1,1,1,1]
[null,null,null,null,null,null,null,null,null,null,null,null,null,null,null,null,null,null,null,null,null,null,null,null,null,null,null,null,null,null,null,null,null,null,"N/A","N/A","N/A","N/A","N/A","N/A","N/A","N/A","N/A",1,1,1,1,1,1,1,1,1]
[null,null,null,null,null,null,null,null,null,null,null,null,null,null,null,null,null,null,null,null,null,null,null,null,null,null,null,null,null,null,null,null,null,null,"N/A","N/A","N/A","N/A","N/A","N/A","N/A","N/A","N/A",1,1,1,1,1,1,1,1,1]
[null,null,null,null,null,null,null,null,null,null,null,null,null,null,null,null,null,null,null,null,null,null,null,null,null,null,null,null,null,null,null,null,null,null,"N/A","N/A","N/A","N/A","N/A","N/A","N/A","N/A","N/A",1,1,1,1,1,1,1,1,1]
[null,null,null,null,null,null,null,null,null,null,null,null,null,null,null,null,null,null,null,null,null,null,null,null,null,null,null,null,null,null,null,null,null,null,"N/A","N/A","N/A","N/A","N/A","N/A","N/A","N/A","N/A",1,1,1,1,1,1,1,1,1]
[null,null,null,null,null,null,null,null,null,null,null,null,null,null,null,null,null,null,null,null,null,null,null,null,null,null,null,null,null,null,null,null,null,null,"N/A","N/A","N/A","N/A","N/A","N/A","N/A","N/A","N/A",1,1,1,1,1,1,1,1,1]
[null,null,null,null,null,null,null,null,null,null,null,null,null,null,null,null,null,null,null,null,null,null,null,null,null,null,null,null,null,null,null,null,null,null,"N/A","N/A","N/A","N/A","N/A","N/A","N/A","N/A","N/A",1,1,1,1,1,1,1,1,1]
[null,null,null,null,null,null,null,null,null,null,null,null,null,null,null,null,null,null,null,null,null,null,null,null,null,null,null,null,null,null,null,null,null,null,"N/A","N/A","N/A","N/A","N/A","N/A","N/A","N/A","N/A",1,1,1,1,1,1,1,1,1]
[null,null,null,null,null,null,null,null,null,null,null,null,null,null,null,null,null,null,null,null,null,null,null,null,null,null,null,null,null,null,null,null,null,null,"N/A","N/A","N/A","N/A","N/A","N/A","N/A","N/A","N/A",1,1,1,1,1,1,1,1,1]
[null,null,null,null,null,null,null,null,null,null,null,null,null,null,null,null,null,null,null,null,null,null,null,null,null,null,null,null,null,null,null,null,null,null,"N/A","N/A","N/A","N/A","N/A","N/A","N/A","N/A","N/A",1,1,1,1,1,1,1,1,1]
[null,null,null,null,null,null,null,null,null,null,null,null,null,null,null,null,null,null,null,null,null,null,null,null,null,null,null,null,null,null,null,null,null,null,"N/A","N/A","N/A","N/A","N/A","N/A","N/A","N/A","N/A",1,1,1,1,1,1,1,1,1]
[null,null,null,null,null,null,null,null,null,null,null,null,null,null,null,null,null,null,null,null,null,null,null,null,null,null,null,null,null,null,null,null,null,null,"N/A","N/A","N/A","N/A","N/A","N/A","N/A","N/A","N/A",1,1,1,1,1,1,1,1,1]
[null,null,null,null,null,null,null,null,null,null,null,null,null,null,null,null,null,null,null,null,null,null,null,null,null,null,null,null,null,null,null,null,null,null,"N/A","N/A","N/A","N/A","N/A","N/A","N/A","N/A","N/A",1,1,1,1,1,1,1,1,1]
[null,null,null,null,null,null,null,null,null,null,null,null,null,null,null,null,null,null,null,null,null,null,null,null,null,null,null,null,null,null,null,null,null,null,"N/A","N/A","N/A","N/A","N/A","N/A","N/A","N/A","N/A",1,1,1,1,1,1,1,1,1]
[null,null,null,null,null,null,null,null,null,null,null,null,null,null,null,null,null,null,null,null,null,null,null,null,null,null,null,null,null,null,null,null,null,null,"N/A","N/A","N/A","N/A","N/A","N/A","N/A","N/A","N/A",1,1,1,1,1,1,1,1,1]
[null,null,null,null,null,null,null,null,null,null,null,null,null,null,null,null,null,null,null,null,null,null,null,null,null,null,null,null,null,null,null,null,null,null,"N/A","N/A","N/A","N/A","N/A","N/A","N/A","N/A","N/A",1,1,1,1,1,1,1,1,1]
[null,null,null,null,null,null,null,null,null,null,null,null,null,null,null,null,null,null,null,null,null,null,null,null,null,null,null,null,null,null,null,null,null,null,"N/A","N/A","N/A","N/A","N/A","N/A","N/A","N/A","N/A",1,1,1,1,1,1,1,1,1]
[null,null,null,null,null,null,null,null,null,null,null,null,null,null,null,null,null,null,null,null,null,null,null,null,null,null,null,null,null,null,null,null,null,null,"N/A","N/A","N/A","N/A","N/A","N/A","N/A","N/A","N/A",1,1,1,1,1,1,1,1,1]
[null,null,null,null,null,null,null,null,null,null,null,null,null,null,null,null,null,null,null,null,null,null,null,null,null,null,null,null,null,null,null,null,null,null,"N/A","N/A","N/A","N/A","N/A","N/A","N/A","N/A","N/A",1,1,1,1,1,1,1,1,1]
[null,null,null,null,null,null,null,null,null,null,null,null,null,null,null,null,null,null,null,null,null,null,null,null,null,null,null,null,null,null,null,null,null,null,"N/A","N/A","N/A","N/A","N/A","N/A","N/A","N/A","N/A",1,1,1,1,1,1,1,1,1]
[null,null,null,null,null,null,null,null,null,null,null,null,null,null,null,null,null,null,null,null,null,null,null,null,null,null,null,null,null,null,null,null,null,null,"N/A","N/A","N/A","N/A","N/A","N/A","N/A","N/A","N/A",1,1,1,1,1,1,1,1,1]
[null,null,null,null,null,null,null,null,null,null,null,null,null,null,null,null,null,null,null,null,null,null,null,null,null,null,null,null,null,null,null,null,null,null,"N/A","N/A","N/A","N/A","N/A","N/A","N/A","N/A","N/A",1,1,1,1,1,1,1,1,1]
[null,null,null,null,null,null,null,null,null,null,null,null,null,null,null,null,null,null,null,null,null,null,null,null,null,null,null,null,null,null,null,null,null,null,"N/A","N/A","N/A","N/A","N/A","N/A","N/A","N/A","N/A",1,1,1,1,1,1,1,1,1]
[null,null,null,null,null,null,null,null,null,null,null,null,null,null,null,null,null,null,null,null,null,null,null,null,null,null,null,null,null,null,null,null,null,null,"N/A","N/A","N/A","N/A","N/A","N/A","N/A","N/A","N/A",1,1,1,1,1,1,1,1,1]
[null,null,null,null,null,null,null,null,null,null,null,null,null,null,null,null,null,null,null,null,null,null,null,null,null,null,null,null,null,null,null,null,null,null,"N/A","N/A","N/A","N/A","N/A","N/A","N/A","N/A","N/A",1,1,1,1,1,1,1,1,1]
[null,null,null,null,null,null,null,null,null,null,null,null,null,null,null,null,null,null,null,null,null,null,null,null,null,null,null,null,null,null,null,null,null,null,"N/A","N/A","N/A","N/A","N/A","N/A","N/A","N/A","N/A",1,1,1,1,1,1,1,1,1]
[null,null,null,null,null,null,null,null,null,null,null,null,null,null,null,null,null,null,null,null,null,null,null,null,null,null,null,null,null,null,null,null,null,null,"N/A","N/A","N/A","N/A","N/A","N/A","N/A","N/A","N/A",1,1,1,1,1,1,1,1,1]
[null,null,null,null,null,null,null,null,null,null,null,null,null,null,null,null,null,null,null,null,null,null,null,null,null,null,null,null,null,null,null,null,null,null,"N/A","N/A","N/A","N/A","N/A","N/A","N/A","N/A","N/A",1,1,1,1,1,1,1,1,1]
[null,null,null,null,null,null,null,null,null,null,null,null,null,null,null,null,null,null,null,null,null,null,null,null,null,null,null,null,null,null,null,null,null,null,"N/A","N/A","N/A","N/A","N/A","N/A","N/A","N/A","N/A",1,1,1,1,1,1,1,1,1]
[null,null,null,null,null,null,null,null,null,null,null,null,null,null,null,null,null,null,null,null,null,null,null,null,null,null,null,null,null,null,null,null,null,null,"N/A","N/A","N/A","N/A","N/A","N/A","N/A","N/A","N/A",1,1,1,1,1,1,1,1,1]
[null,null,null,null,null,null,null,null,null,null,null,null,null,null,null,null,null,null,null,null,null,null,null,null,null,null,null,null,null,null,null,null,null,null,"N/A","N/A","N/A","N/A","N/A","N/A","N/A","N/A","N/A",1,1,1,1,1,1,1,1,1]
[null,null,null,null,null,null,null,null,null,null,null,null,null,null,null,null,null,null,null,null,null,null,null,null,null,null,null,null,null,null,null,null,null,null,"N/A","N/A","N/A","N/A","N/A","N/A","N/A","N/A","N/A",1,1,1,1,1,1,1,1,1]
[null,null,null,null,null,null,null,null,null,null,null,null,null,null,null,null,null,null,null,null,null,null,null,null,null,null,null,null,null,null,null,null,null,null,"N/A","N/A","N/A","N/A","N/A","N/A","N/A","N/A","N/A",1,1,1,1,1,1,1,1,1]
[null,null,null,null,null,null,null,null,null,null,null,null,null,null,null,null,null,null,null,null,null,null,null,null,null,null,null,null,null,null,null,null,null,null,"N/A","N/A","N/A","N/A","N/A","N/A","N/A","N/A","N/A",1,1,1,1,1,1,1,1,1]
[null,null,null,null,null,null,null,null,null,null,null,null,null,null,null,null,null,null,null,null,null,null,null,null,null,null,null,null,null,null,null,null,null,null,"N/A","N/A","N/A","N/A","N/A","N/A","N/A","N/A","N/A",1,1,1,1,1,1,1,1,1]
[null,null,null,null,null,null,null,null,null,null,null,null,null,null,null,null,null,null,null,null,null,null,null,null,null,null,null,null,null,null,null,null,null,null,"N/A","N/A","N/A","N/A","N/A","N/A","N/A","N/A","N/A",1,1,1,1,1,1,1,1,1]
[null,null,null,null,null,null,null,null,null,null,null,null,null,null,null,null,null,null,null,null,null,null,null,null,null,null,null,null,null,null,null,null,null,null,"N/A","N/A","N/A","N/A","N/A","N/A","N/A","N/A","N/A",1,1,1,1,1,1,1,1,1]
[null,null,null,null,null,null,null,null,null,null,null,null,null,null,null,null,null,null,null,null,null,null,null,null,null,null,null,null,null,null,null,null,null,null,"N/A","N/A","N/A","N/A","N/A","N/A","N/A","N/A","N/A",1,1,1,1,1,1,1,1,1]
[null,null,null,null,null,null,null,null,null,null,null,null,null,null,null,null,null,null,null,null,null,null,null,null,null,null,null,null,null,null,null,null,null,null,"N/A","N/A","N/A","N/A","N/A","N/A","N/A","N/A","N/A",1,1,1,1,1,1,1,1,1]
[null,null,null,null,null,null,null,null,null,null,null,null,null,null,null,null,null,null,null,null,null,null,null,null,null,null,null,null,null,null,null,null,null,null,"N/A","N/A","N/A","N/A","N/A","N/A","N/A","N/A","N/A",1,1,1,1,1,1,1,1,1]
[null,null,null,null,null,null,null,null,null,null,null,null,null,null,null,null,null,null,null,null,null,null,null,null,null,null,null,null,null,null,null,null,null,null,"N/A","N/A","N/A","N/A","N/A","N/A","N/A","N/A","N/A",1,1,1,1,1,1,1,1,1]
[null,null,null,null,null,null,null,null,null,null,null,null,null,null,null,null,null,null,null,null,null,null,null,null,null,null,null,null,null,null,null,null,null,null,"N/A","N/A","N/A","N/A","N/A","N/A","N/A","N/A","N/A",1,1,1,1,1,1,1,1,1]
[null,null,null,null,null,null,null,null,null,null,null,null,null,null,null,null,null,null,null,null,null,null,null,null,null,null,null,null,null,null,null,null,null,null,"N/A","N/A","N/A","N/A","N/A","N/A","N/A","N/A","N/A",1,1,1,1,1,1,1,1,1]
[null,null,null,null,null,null,null,null,null,null,null,null,null,null,null,null,null,null,null,null,null,null,null,null,null,null,null,null,null,null,null,null,null,null,"N/A","N/A","N/A","N/A","N/A","N/A","N/A","N/A","N/A",1,1,1,1,1,1,1,1,1]
[null,null,null,null,null,null,null,null,null,null,null,null,null,null,null,null,null,null,null,null,null,null,null,null,null,null,null,null,null,null,null,null,null,null,"N/A","N/A","N/A","N/A","N/A","N/A","N/A","N/A","N/A",1,1,1,1,1,1,1,1,1]
[null,null,null,null,null,null,null,null,null,null,null,null,null,null,null,null,null,null,null,null,null,null,null,null,null,null,null,null,null,null,null,null,null,null,"N/A","N/A","N/A","N/A","N/A","N/A","N/A","N/A","N/A",1,1,1,1,1,1,1,1,1]
[null,null,null,null,null,null,null,null,null,null,null,null,null,null,null,null,null,null,null,null,null,null,null,null,null,null,null,null,null,null,null,null,null,null,"N/A","N/A","N/A","N/A","N/A","N/A","N/A","N/A","N/A",1,1,1,1,1,1,1,1,1]
[null,null,null,null,null,null,null,null,null,null,null,null,null,null,null,null,null,null,null,null,null,null,null,null,null,null,null,null,null,null,null,null,null,null,"N/A","N/A","N/A","N/A","N/A","N/A","N/A","N/A","N/A",1,1,1,1,1,1,1,1,1]
[null,null,null,null,null,null,null,null,null,null,null,null,null,null,null,null,null,null,null,null,null,null,null,null,null,null,null,null,null,null,null,null,null,null,"N/A","N/A","N/A","N/A","N/A","N/A","N/A","N/A","N/A",1,1,1,1,1,1,1,1,1]
[null,null,null,null,null,null,null,null,null,null,null,null,null,null,null,null,null,null,null,null,null,null,null,null,null,null,null,null,null,null,null,null,null,null,"N/A","N/A","N/A","N/A","N/A","N/A","N/A","N/A","N/A",1,1,1,1,1,1,1,1,1]
[null,null,null,null,null,null,null,null,null,null,null,null,null,null,null,null,null,null,null,null,null,null,null,null,null,null,null,null,null,null,null,null,null,null,"N/A","N/A","N/A","N/A","N/A","N/A","N/A","N/A","N/A",1,1,1,1,1,1,1,1,1]
[null,null,null,null,null,null,null,null,null,null,null,null,null,null,null,null,null,null,null,null,null,null,null,null,null,null,null,null,null,null,null,null,null,null,"N/A","N/A","N/A","N/A","N/A","N/A","N/A","N/A","N/A",1,1,1,1,1,1,1,1,1]
[null,null,null,null,null,null,null,null,null,null,null,null,null,null,null,null,null,null,null,null,null,null,null,null,null,null,null,null,null,null,null,null,null,null,{"$f":"IF(COUNTA(E474:G474)>0,(COUNTIF(E474:G474,\"=0\")*0+COUNTIF(E474:G474,\"=1\")*100+COUNTIF(E474:G474,\"=2\")*80+COUNTIF(E474:G474,\"=3\")*50+COUNTIF(E474:G474,\"=8\")*20+COUNTIF(E474:G474,\"=9\")*0)/COUNTA(E474:G474)/100,\"N/A\")","v":"N/A"},{"$f":"IF(COUNTA(H474:J474)>0,(COUNTIF(H474:J474,\"=0\")*0+COUNTIF(H474:J474,\"=1\")*100+COUNTIF(H474:J474,\"=2\")*80+COUNTIF(H474:J474,\"=3\")*50+COUNTIF(H474:J474,\"=8\")*20+COUNTIF(H474:J474,\"=9\")*0)/COUNTA(H474:J474)/100,\"N/A\")","v":"N/A"},{"$f":"IF(COUNTA(K474:M474)>0,(COUNTIF(K474:M474,\"=0\")*0+COUNTIF(K474:M474,\"=1\")*100+COUNTIF(K474:M474,\"=2\")*80+COUNTIF(K474:M474,\"=3\")*50+COUNTIF(K474:M474,\"=8\")*20+COUNTIF(K474:M474,\"=9\")*0)/COUNTA(K474:M474)/100,\"N/A\")","v":"N/A"},{"$f":"IF(COUNTA(N474:V474)>0,(COUNTIF(N474:V474,\"=0\")*0+COUNTIF(N474:V474,\"=1\")*100+COUNTIF(N474:V474,\"=2\")*80+COUNTIF(N474:V474,\"=3\")*50+COUNTIF(N474:V474,\"=8\")*20+COUNTIF(N474:V474,\"=9\")*0)/COUNTA(N474:V474)/100,\"N/A\")","v":"N/A"},{"$f":"IF(COUNTA(W474:AA474)>0,(COUNTIF(W474:AA474,\"=0\")*0+COUNTIF(W474:AA474,\"=1\")*100+COUNTIF(W474:AA474,\"=2\")*80+COUNTIF(W474:AA474,\"=3\")*50+COUNTIF(W474:AA474,\"=8\")*20+COUNTIF(W474:AA474,\"=9\")*0)/COUNTA(W474:AA474)/100,\"N/A\")","v":"N/A"},{"$f":"IF(COUNTA(AB474:AC474)>0,(COUNTIF(AB474:AC474,\"=0\")*0+COUNTIF(AB474:AC474,\"=1\")*100+COUNTIF(AB474:AC474,\"=2\")*80+COUNTIF(AB474:AC474,\"=3\")*50+COUNTIF(AB474:AC474,\"=8\")*20+COUNTIF(AB474:AC474,\"=9\")*0)/COUNTA(AB474:AC474)/100,\"N/A\")","v":"N/A"},{"$f":"IF(COUNTA((AD474:AF474))>0,(COUNTIF((AD474:AF474),\"=0\")*0+COUNTIF((AD474:AF474),\"=1\")*100+COUNTIF((AD474:AF474),\"=2\")*80+COUNTIF((AD474:AF474),\"=3\")*50+COUNTIF((AD474:AF474),\"=8\")*20+COUNTIF((AD474:AF474),\"=9\")*0)/COUNTA((AD474:AF474))/100,\"N/A\")","v":"N/A"},{"$f":"IF(COUNTA(AG474:AH474)>0,(COUNTIF(AG474:AH474,\"=0\")*0+COUNTIF(AG474:AH474,\"=1\")*100+COUNTIF(AG474:AH474,\"=2\")*80+COUNTIF(AG474:AH474,\"=3\")*50+COUNTIF(AG474:AH474,\"=8\")*20+COUNTIF(AG474:AH474,\"=9\")*0)/COUNTA(AG474:AH474)/100,\"N/A\")","v":"N/A"},{"$f":"IF(AND(COUNTA(E474:AH474)<>0,B474<>\"\"),AVERAGE(AL474:AP474,AI474),\"N/A\")","v":"N/A"},1,1,1,1,1,1,1,1,1]
[null,null,null,null,null,null,null,null,null,null,null,null,null,null,null,null,null,null,null,null,null,null,null,null,null,null,null,null,null,null,null,null,null,null,"N/A","N/A","N/A","N/A","N/A","N/A","N/A","N/A","N/A",1,1,1,1,1,1,1,1,1]
[null,null,null,null,null,null,null,null,null,null,null,null,null,null,null,null,null,null,null,null,null,null,null,null,null,null,null,null,null,null,null,null,null,null,"N/A","N/A","N/A","N/A","N/A","N/A","N/A","N/A","N/A",1,1,1,1,1,1,1,1,1]
[null,null,null,null,null,null,null,null,null,null,null,null,null,null,null,null,null,null,null,null,null,null,null,null,null,null,null,null,null,null,null,null,null,null,"N/A","N/A","N/A","N/A","N/A","N/A","N/A","N/A","N/A",1,1,1,1,1,1,1,1,1]
[null,null,null,null,null,null,null,null,null,null,null,null,null,null,null,null,null,null,null,null,null,null,null,null,null,null,null,null,null,null,null,null,null,null,"N/A","N/A","N/A","N/A","N/A","N/A","N/A","N/A","N/A",{"$f":"IF(AI478=\"N/A\",1,\"\")","v":1},1,1,1,1,1,1,1,1]
[null,null,null,null,null,null,null,null,null,null,null,null,null,null,null,null,null,null,null,null,null,null,null,null,null,null,null,null,null,null,null,null,null,null,"N/A","N/A","N/A","N/A","N/A","N/A","N/A","N/A","N/A",1,1,1,1,1,1,1,1,1]
[null,null,null,null,null,null,null,null,null,null,null,null,null,null,null,null,null,null,null,null,null,null,null,null,null,null,null,null,null,null,null,null,null,null,"N/A","N/A","N/A","N/A","N/A","N/A","N/A","N/A","N/A",1,1,1,1,1,1,1,1,1]
[null,null,null,null,null,null,null,null,null,null,null,null,null,null,null,null,null,null,null,null,null,null,null,null,null,null,null,null,null,null,null,null,null,null,"N/A","N/A","N/A","N/A","N/A","N/A","N/A","N/A","N/A",1,1,1,1,1,1,1,1,1]
[null,null,null,null,null,null,null,null,null,null,null,null,null,null,null,null,null,null,null,null,null,null,null,null,null,null,null,null,null,null,null,null,null,null,"N/A","N/A","N/A","N/A","N/A","N/A","N/A","N/A","N/A",1,1,1,1,1,1,1,1,1]
[null,null,null,null,null,null,null,null,null,null,null,null,null,null,null,null,null,null,null,null,null,null,null,null,null,null,null,null,null,null,null,null,null,null,"N/A","N/A","N/A","N/A","N/A","N/A","N/A","N/A","N/A",1,1,1,1,1,1,1,1,1]
[null,null,null,null,null,null,null,null,null,null,null,null,null,null,null,null,null,null,null,null,null,null,null,null,null,null,null,null,null,null,null,null,null,null,"N/A","N/A","N/A","N/A","N/A","N/A","N/A","N/A","N/A",1,1,1,1,1,1,1,1,1]
[null,null,null,null,null,null,null,null,null,null,null,null,null,null,null,null,null,null,null,null,null,null,null,null,null,null,null,null,null,null,null,null,null,null,"N/A","N/A","N/A","N/A","N/A","N/A","N/A","N/A","N/A",1,1,1,1,1,1,1,1,1]
[null,null,null,null,null,null,null,null,null,null,null,null,null,null,null,null,null,null,null,null,null,null,null,null,null,null,null,null,null,null,null,null,null,null,"N/A","N/A","N/A","N/A","N/A","N/A","N/A","N/A","N/A",1,1,1,1,1,1,1,1,1]
[null,null,null,null,null,null,null,null,null,null,null,null,null,null,null,null,null,null,null,null,null,null,null,null,null,null,null,null,null,null,null,null,null,null,"N/A","N/A","N/A","N/A","N/A","N/A","N/A","N/A","N/A",1,1,1,1,1,1,1,1,1]
[null,null,null,null,null,null,null,null,null,null,null,null,null,null,null,null,null,null,null,null,null,null,null,null,null,null,null,null,null,null,null,null,null,null,"N/A","N/A","N/A","N/A","N/A","N/A","N/A","N/A","N/A",1,1,1,1,1,1,1,1,1]
[null,null,null,null,null,null,null,null,null,null,null,null,null,null,null,null,null,null,null,null,null,null,null,null,null,null,null,null,null,null,null,null,null,null,"N/A","N/A","N/A","N/A","N/A","N/A","N/A","N/A","N/A",1,1,1,1,1,1,1,1,1]
[null,null,null,null,null,null,null,null,null,null,null,null,null,null,null,null,null,null,null,null,null,null,null,null,null,null,null,null,null,null,null,null,null,null,"N/A","N/A","N/A","N/A","N/A","N/A","N/A","N/A","N/A",1,1,1,1,1,1,1,1,1]
[null,null,null,null,null,null,null,null,null,null,null,null,null,null,null,null,null,null,null,null,null,null,null,null,null,null,null,null,null,null,null,null,null,null,"N/A","N/A","N/A","N/A","N/A","N/A","N/A","N/A","N/A",1,1,1,1,1,1,1,1,1]
[null,null,null,null,null,null,null,null,null,null,null,null,null,null,null,null,null,null,null,null,null,null,null,null,null,null,null,null,null,null,null,null,null,null,"N/A","N/A","N/A","N/A","N/A","N/A","N/A","N/A","N/A",1,1,1,1,1,1,1,1,1]
[null,null,null,null,null,null,null,null,null,null,null,null,null,null,null,null,null,null,null,null,null,null,null,null,null,null,null,null,null,null,null,null,null,null,"N/A","N/A","N/A","N/A","N/A","N/A","N/A","N/A","N/A",1,1,1,1,1,1,1,1,1]
[null,null,null,null,null,null,null,null,null,null,null,null,null,null,null,null,null,null,null,null,null,null,null,null,null,null,null,null,null,null,null,null,null,null,"N/A","N/A","N/A","N/A","N/A","N/A","N/A","N/A","N/A",1,1,1,1,1,1,1,1,1]
[null,null,null,null,null,null,null,null,null,null,null,null,null,null,null,null,null,null,null,null,null,null,null,null,null,null,null,null,null,null,null,null,null,null,"N/A","N/A","N/A","N/A","N/A","N/A","N/A","N/A","N/A",1,1,1,1,1,1,1,1,1]
[null,null,null,null,null,null,null,null,null,null,null,null,null,null,null,null,null,null,null,null,null,null,null,null,null,null,null,null,null,null,null,null,null,null,"N/A","N/A","N/A","N/A","N/A","N/A","N/A","N/A","N/A",1,1,1,1,1,1,1,1,1]
[null,null,null,null,null,null,null,null,null,null,null,null,null,null,null,null,null,null,null,null,null,null,null,null,null,null,null,null,null,null,null,null,null,null,"N/A","N/A","N/A","N/A","N/A","N/A","N/A","N/A","N/A",1,1,1,1,1,1,1,1,1]
[null,null,null,null,null,null,null,null,null,null,null,null,null,null,null,null,null,null,null,null,null,null,null,null,null,null,null,null,null,null,null,null,null,null,"N/A","N/A","N/A","N/A","N/A","N/A","N/A","N/A","N/A",1,1,1,1,1,1,1,1,1]
[null,null,null,null,null,null,null,null,null,null,null,null,null,null,null,null,null,null,null,null,null,null,null,null,null,null,null,null,null,null,null,null,null,null,"N/A","N/A","N/A","N/A","N/A","N/A","N/A","N/A","N/A",1,1,1,1,1,1,1,1,1]
[null,null,null,null,null,null,null,null,null,null,null,null,null,null,null,null,null,null,null,null,null,null,null,null,null,null,null,null,null,null,null,null,null,null,"N/A","N/A","N/A","N/A","N/A","N/A","N/A","N/A","N/A",1,1,1,1,1,1,1,1,1]
[null,null,null,null,null,null,null,null,null,null,null,null,null,null,null,null,null,null,null,null,null,null,null,null,null,null,null,null,null,null,null,null,null,null,"N/A","N/A","N/A","N/A","N/A","N/A","N/A","N/A","N/A",1,1,1,1,1,1,1,1,1]
[null,null,null,null,null,null,null,null,null,null,null,null,null,null,null,null,null,null,null,null,null,null,null,null,null,null,null,null,null,null,null,null,null,null,"N/A","N/A","N/A","N/A","N/A","N/A","N/A","N/A","N/A",1,1,1,1,1,1,1,1,1]
[null,null,null,null,null,null,null,null,null,null,null,null,null,null,null,null,null,null,null,null,null,null,null,null,null,null,null,null,null,null,null,null,null,null,"N/A","N/A","N/A","N/A","N/A","N/A","N/A","N/A","N/A",1,1,1,1,1,1,1,1,1]
[null,null,null,null,null,null,null,null,null,null,null,null,null,null,null,null,null,null,null,null,null,null,null,null,null,null,null,null,null,null,null,null,null,null,"N/A","N/A","N/A","N/A","N/A","N/A","N/A","N/A","N/A",1,1,1,1,1,1,1,1,1]
[null,null,null,null,null,null,null,null,null,null,null,null,null,null,null,null,null,null,null,null,null,null,null,null,null,null,null,null,null,null,null,null,null,null,"N/A","N/A","N/A","N/A","N/A","N/A","N/A","N/A","N/A",1,1,1,1,1,1,1,1,1]
[null,null,null,null,null,null,null,null,null,null,null,null,null,null,null,null,null,null,null,null,null,null,null,null,null,null,null,null,null,null,null,null,null,null,"N/A","N/A","N/A","N/A","N/A","N/A","N/A","N/A","N/A",1,1,1,{"$f":"IF(AL506=\"N/A\",1,\"\")","v":1},1,1,1,1,1]
[null,null,null,null,null,null,null,null,null,null,null,null,null,null,null,null,null,null,null,null,null,null,null,null,null,null,null,null,null,null,null,null,null,null,"N/A","N/A","N/A","N/A","N/A","N/A","N/A","N/A","N/A",{"$f":"IF(AI507=\"N/A\",1,\"\")","v":1},1,1,1,1,1,1,1,1]
[null,null,null,null,null,null,null,null,null,null,null,null,null,null,null,null,null,null,null,null,null,null,null,null,null,null,null,null,null,null,null,null,null,null,"N/A","N/A","N/A","N/A","N/A","N/A","N/A","N/A","N/A",1,1,1,1,1,1,1,1,1]
[null,null,null,null,null,null,null,null,null,null,null,null,null,null,null,null,null,null,null,null,null,null,null,null,null,null,null,null,null,null,null,null,null,null,"N/A","N/A","N/A","N/A","N/A","N/A","N/A","N/A","N/A",1,1,1,1,1,1,1,1,1]
[null,null,null,null,null,null,null,null,null,null,null,null,null,null,null,null,null,null,null,null,null,null,null,null,null,null,null,null,null,null,null,null,null,null,"N/A","N/A","N/A","N/A","N/A","N/A","N/A","N/A","N/A",1,1,1,1,1,1,1,1,1]
[null,null,null,null,null,null,null,null,null,null,null,null,null,null,null,null,null,null,null,null,null,null,null,null,null,null,null,null,null,null,null,null,null,null,"N/A","N/A","N/A","N/A","N/A","N/A","N/A","N/A","N/A",1,1,1,1,1,1,1,1,1]
[null,null,null,null,null,null,null,null,null,null,null,null,null,null,null,null,null,null,null,null,null,null,null,null,null,null,null,null,null,null,null,null,null,null,"N/A","N/A","N/A","N/A","N/A","N/A","N/A","N/A","N/A",1,1,1,1,1,1,1,1,1]
[null,null,null,null,null,null,null,null,null,null,null,null,null,null,null,null,null,null,null,null,null,null,null,null,null,null,null,null,null,null,null,null,null,null,"N/A","N/A","N/A","N/A","N/A","N/A","N/A","N/A","N/A",1,1,1,1,1,1,1,1,1]
[null,null,null,null,null,null,null,null,null,null,null,null,null,null,null,null,null,null,null,null,null,null,null,null,null,null,null,null,null,null,null,null,null,null,"N/A","N/A","N/A","N/A","N/A","N/A","N/A","N/A","N/A",1,1,1,1,1,1,1,1,1]
[null,null,null,null,null,null,null,null,null,null,null,null,null,null,null,null,null,null,null,null,null,null,null,null,null,null,null,null,null,null,null,null,null,null,"N/A","N/A","N/A","N/A","N/A","N/A","N/A","N/A","N/A",1,1,1,1,1,1,1,1,1]
[null,null,null,null,null,null,null,null,null,null,null,null,null,null,null,null,null,null,null,null,null,null,null,null,null,null,null,null,null,null,null,null,null,null,"N/A","N/A","N/A","N/A","N/A","N/A","N/A","N/A","N/A",1,1,1,1,1,1,1,1,1]
[null,null,null,null,null,null,null,null,null,null,null,null,null,null,null,null,null,null,null,null,null,null,null,null,null,null,null,null,null,null,null,null,null,null,"N/A","N/A","N/A","N/A","N/A","N/A","N/A","N/A","N/A",1,1,1,1,1,1,1,1,1]
[null,null,null,null,null,null,null,null,null,null,null,null,null,null,null,null,null,null,null,null,null,null,null,null,null,null,null,null,null,null,null,null,null,null,"N/A","N/A","N/A","N/A","N/A","N/A","N/A","N/A","N/A",1,1,1,1,1,1,1,1,1]
[null,null,null,null,null,null,null,null,null,null,null,null,null,null,null,null,null,null,null,null,null,null,null,null,null,null,null,null,null,null,null,null,null,null,"N/A","N/A","N/A","N/A","N/A","N/A","N/A","N/A","N/A",1,1,1,1,1,1,1,1,1]
[null,null,null,null,null,null,null,null,null,null,null,null,null,null,null,null,null,null,null,null,null,null,null,null,null,null,null,null,null,null,null,null,null,null,"N/A","N/A","N/A","N/A","N/A","N/A","N/A","N/A","N/A",1,1,1,1,1,1,1,1,1]
[null,null,null,null,null,null,null,null,null,null,null,null,null,null,null,null,null,null,null,null,null,null,null,null,null,null,null,null,null,null,null,null,null,null,"N/A","N/A","N/A","N/A","N/A","N/A","N/A","N/A","N/A",1,1,1,1,1,1,1,1,1]
[null,null,null,null,null,null,null,null,null,null,null,null,null,null,null,null,null,null,null,null,null,null,null,null,null,null,null,null,null,null,null,null,null,null,"N/A","N/A","N/A","N/A","N/A","N/A","N/A","N/A","N/A",1,1,1,1,1,1,1,1,1]
[null,null,null,null,null,null,null,null,null,null,null,null,null,null,null,null,null,null,null,null,null,null,null,null,null,null,null,null,null,null,null,null,null,null,"N/A","N/A","N/A","N/A","N/A","N/A","N/A","N/A","N/A",1,1,1,1,1,1,1,1,1]
[null,null,null,null,null,null,null,null,null,null,null,null,null,null,null,null,null,null,null,null,null,null,null,null,null,null,null,null,null,null,null,null,null,null,"N/A","N/A","N/A","N/A","N/A","N/A","N/A","N/A","N/A",1,1,1,1,1,1,1,1,1]
[null,null,null,null,null,null,null,null,null,null,null,null,null,null,null,null,null,null,null,null,null,null,null,null,null,null,null,null,null,null,null,null,null,null,"N/A","N/A","N/A","N/A","N/A","N/A","N/A","N/A","N/A",1,1,1,1,1,1,1,1,1]
[null,null,null,null,null,null,null,null,null,null,null,null,null,null,null,null,null,null,null,null,null,null,null,null,null,null,null,null,null,null,null,null,null,null,"N/A","N/A","N/A","N/A","N/A","N/A","N/A","N/A","N/A",1,1,1,1,1,1,1,1,1]
[null,null,null,null,null,null,null,null,null,null,null,null,null,null,null,null,null,null,null,null,null,null,null,null,null,null,null,null,null,null,null,null,null,null,"N/A","N/A","N/A","N/A","N/A","N/A","N/A","N/A","N/A",1,1,1,1,1,1,1,1,1]
[null,null,null,null,null,null,null,null,null,null,null,null,null,null,null,null,null,null,null,null,null,null,null,null,null,null,null,null,null,null,null,null,null,null,"N/A","N/A","N/A","N/A","N/A","N/A","N/A","N/A","N/A",1,1,1,1,1,1,1,1,1]
[null,null,null,null,null,null,null,null,null,null,null,null,null,null,null,null,null,null,null,null,null,null,null,null,null,null,null,null,null,null,null,null,null,null,"N/A","N/A","N/A","N/A","N/A","N/A","N/A","N/A","N/A",1,1,1,1,1,1,1,1,1]
[null,null,null,null,null,null,null,null,null,null,null,null,null,null,null,null,null,null,null,null,null,null,null,null,null,null,null,null,null,null,null,null,null,null,"N/A","N/A","N/A","N/A","N/A","N/A","N/A","N/A","N/A",1,1,1,1,1,1,1,1,1]
[null,null,null,null,null,null,null,null,null,null,null,null,null,null,null,null,null,null,null,null,null,null,null,null,null,null,null,null,null,null,null,null,null,null,"N/A","N/A","N/A","N/A","N/A","N/A","N/A","N/A","N/A",1,1,1,1,1,1,1,1,1]
[null,null,null,null,null,null,null,null,null,null,null,null,null,null,null,null,null,null,null,null,null,null,null,null,null,null,null,null,null,null,null,null,null,null,"N/A","N/A","N/A","N/A","N/A","N/A","N/A","N/A","N/A",1,1,1,1,1,1,1,1,1]
[null,null,null,null,null,null,null,null,null,null,null,null,null,null,null,null,null,null,null,null,null,null,null,null,null,null,null,null,null,null,null,null,null,null,"N/A","N/A","N/A","N/A","N/A","N/A","N/A","N/A","N/A",1,1,1,1,1,1,1,1,1]
[null,null,null,null,null,null,null,null,null,null,null,null,null,null,null,null,null,null,null,null,null,null,null,null,null,null,null,null,null,null,null,null,null,null,"N/A","N/A","N/A","N/A","N/A","N/A","N/A","N/A","N/A",1,1,1,1,1,1,1,1,1]
[null,null,null,null,null,null,null,null,null,null,null,null,null,null,null,null,null,null,null,null,null,null,null,null,null,null,null,null,null,null,null,null,null,null,"N/A","N/A","N/A","N/A","N/A","N/A","N/A","N/A","N/A",1,1,1,1,1,1,1,1,1]
[null,null,null,null,null,null,null,null,null,null,null,null,null,null,null,null,null,null,null,null,null,null,null,null,null,null,null,null,null,null,null,null,null,null,"N/A","N/A","N/A","N/A","N/A","N/A","N/A","N/A","N/A",1,1,1,1,1,1,1,1,1]
[null,null,null,null,null,null,null,null,null,null,null,null,null,null,null,null,null,null,null,null,null,null,null,null,null,null,null,null,null,null,null,null,null,null,"N/A","N/A","N/A","N/A","N/A","N/A","N/A","N/A","N/A",1,1,1,1,1,1,1,1,1]
[null,null,null,null,null,null,null,null,null,null,null,null,null,null,null,null,null,null,null,null,null,null,null,null,null,null,null,null,null,null,null,null,null,null,{"$f":"IF(COUNTA(E538:G538)>0,(COUNTIF(E538:G538,\"=0\")*0+COUNTIF(E538:G538,\"=1\")*100+COUNTIF(E538:G538,\"=2\")*80+COUNTIF(E538:G538,\"=3\")*50+COUNTIF(E538:G538,\"=8\")*20+COUNTIF(E538:G538,\"=9\")*0)/COUNTA(E538:G538)/100,\"N/A\")","v":"N/A"},{"$f":"IF(COUNTA(H538:J538)>0,(COUNTIF(H538:J538,\"=0\")*0+COUNTIF(H538:J538,\"=1\")*100+COUNTIF(H538:J538,\"=2\")*80+COUNTIF(H538:J538,\"=3\")*50+COUNTIF(H538:J538,\"=8\")*20+COUNTIF(H538:J538,\"=9\")*0)/COUNTA(H538:J538)/100,\"N/A\")","v":"N/A"},{"$f":"IF(COUNTA(K538:M538)>0,(COUNTIF(K538:M538,\"=0\")*0+COUNTIF(K538:M538,\"=1\")*100+COUNTIF(K538:M538,\"=2\")*80+COUNTIF(K538:M538,\"=3\")*50+COUNTIF(K538:M538,\"=8\")*20+COUNTIF(K538:M538,\"=9\")*0)/COUNTA(K538:M538)/100,\"N/A\")","v":"N/A"},{"$f":"IF(COUNTA(N538:V538)>0,(COUNTIF(N538:V538,\"=0\")*0+COUNTIF(N538:V538,\"=1\")*100+COUNTIF(N538:V538,\"=2\")*80+COUNTIF(N538:V538,\"=3\")*50+COUNTIF(N538:V538,\"=8\")*20+COUNTIF(N538:V538,\"=9\")*0)/COUNTA(N538:V538)/100,\"N/A\")","v":"N/A"},{"$f":"IF(COUNTA(W538:AA538)>0,(COUNTIF(W538:AA538,\"=0\")*0+COUNTIF(W538:AA538,\"=1\")*100+COUNTIF(W538:AA538,\"=2\")*80+COUNTIF(W538:AA538,\"=3\")*50+COUNTIF(W538:AA538,\"=8\")*20+COUNTIF(W538:AA538,\"=9\")*0)/COUNTA(W538:AA538)/100,\"N/A\")","v":"N/A"},{"$f":"IF(COUNTA(AB538:AC538)>0,(COUNTIF(AB538:AC538,\"=0\")*0+COUNTIF(AB538:AC538,\"=1\")*100+COUNTIF(AB538:AC538,\"=2\")*80+COUNTIF(AB538:AC538,\"=3\")*50+COUNTIF(AB538:AC538,\"=8\")*20+COUNTIF(AB538:AC538,\"=9\")*0)/COUNTA(AB538:AC538)/100,\"N/A\")","v":"N/A"},{"$f":"IF(COUNTA((AD538:AF538))>0,(COUNTIF((AD538:AF538),\"=0\")*0+COUNTIF((AD538:AF538),\"=1\")*100+COUNTIF((AD538:AF538),\"=2\")*80+COUNTIF((AD538:AF538),\"=3\")*50+COUNTIF((AD538:AF538),\"=8\")*20+COUNTIF((AD538:AF538),\"=9\")*0)/COUNTA((AD538:AF538))/100,\"N/A\")","v":"N/A"},{"$f":"IF(COUNTA(AG538:AH538)>0,(COUNTIF(AG538:AH538,\"=0\")*0+COUNTIF(AG538:AH538,\"=1\")*100+COUNTIF(AG538:AH538,\"=2\")*80+COUNTIF(AG538:AH538,\"=3\")*50+COUNTIF(AG538:AH538,\"=8\")*20+COUNTIF(AG538:AH538,\"=9\")*0)/COUNTA(AG538:AH538)/100,\"N/A\")","v":"N/A"},{"$f":"IF(AND(COUNTA(E538:AH538)<>0,B538<>\"\"),AVERAGE(AL538:AP538,AI538),\"N/A\")","v":"N/A"},1,1,1,1,1,1,1,1,1]
[null,null,null,null,null,null,null,null,null,null,null,null,null,null,null,null,null,null,null,null,null,null,null,null,null,null,null,null,null,null,null,null,null,null,"N/A","N/A","N/A","N/A","N/A","N/A","N/A","N/A","N/A",1,1,1,1,1,1,1,1,1]
[null,null,null,null,null,null,null,null,null,null,null,null,null,null,null,null,null,null,null,null,null,null,null,null,null,null,null,null,null,null,null,null,null,null,"N/A","N/A","N/A","N/A","N/A","N/A","N/A","N/A","N/A",1,1,1,1,1,1,1,1,1]
[null,null,null,null,null,null,null,null,null,null,null,null,null,null,null,null,null,null,null,null,null,null,null,null,null,null,null,null,null,null,null,null,null,null,"N/A","N/A","N/A","N/A","N/A","N/A","N/A","N/A","N/A",1,1,1,1,1,1,1,1,1]
[null,null,null,null,null,null,null,null,null,null,null,null,null,null,null,null,null,null,null,null,null,null,null,null,null,null,null,null,null,null,null,null,null,null,"N/A","N/A","N/A","N/A","N/A","N/A","N/A","N/A","N/A",1,1,1,1,1,1,1,1,1]
[null,null,null,null,null,null,null,null,null,null,null,null,null,null,null,null,null,null,null,null,null,null,null,null,null,null,null,null,null,null,null,null,null,null,"N/A","N/A","N/A","N/A","N/A","N/A","N/A","N/A","N/A",1,1,1,1,1,1,1,1,1]
[null,null,null,null,null,null,null,null,null,null,null,null,null,null,null,null,null,null,null,null,null,null,null,null,null,null,null,null,null,null,null,null,null,null,"N/A","N/A","N/A","N/A","N/A","N/A","N/A","N/A","N/A",1,1,1,1,1,1,1,1,1]
[null,null,null,null,null,null,null,null,null,null,null,null,null,null,null,null,null,null,null,null,null,null,null,null,null,null,null,null,null,null,null,null,null,null,"N/A","N/A","N/A","N/A","N/A","N/A","N/A","N/A","N/A",1,1,1,1,1,1,1,1,1]
[null,null,null,null,null,null,null,null,null,null,null,null,null,null,null,null,null,null,null,null,null,null,null,null,null,null,null,null,null,null,null,null,null,null,"N/A","N/A","N/A","N/A","N/A","N/A","N/A","N/A","N/A",1,1,1,1,1,{"$f":"IF(AN546=\"N/A\",1,\"\")","v":1},1,1,1]
[null,null,null,null,null,null,null,null,null,null,null,null,null,null,null,null,null,null,null,null,null,null,null,null,null,null,null,null,null,null,null,null,null,null,"N/A","N/A","N/A","N/A","N/A","N/A","N/A","N/A","N/A",1,1,1,1,1,{"$f":"IF(AN547=\"N/A\",1,\"\")","v":1},1,1,1]
[null,null,null,null,null,null,null,null,null,null,null,null,null,null,null,null,null,null,null,null,null,null,null,null,null,null,null,null,null,null,null,null,null,null,"N/A","N/A","N/A","N/A","N/A","N/A","N/A","N/A","N/A",1,1,1,1,1,{"$f":"IF(AN548=\"N/A\",1,\"\")","v":1},1,1,1]
[null,null,null,null,null,null,null,null,null,null,null,null,null,null,null,null,null,null,null,null,null,null,null,null,null,null,null,null,null,null,null,null,null,null,"N/A","N/A","N/A","N/A","N/A","N/A","N/A","N/A","N/A",1,1,1,1,1,{"$f":"IF(AN549=\"N/A\",1,\"\")","v":1},{"$f":"IF(AO549=\"N/A\",1,\"\")","v":1},1,1]
[null,null,null,null,null,null,null,null,null,null,null,null,null,null,null,null,null,null,null,null,null,null,null,null,null,null,null,null,null,null,null,null,null,null,"N/A","N/A","N/A","N/A","N/A","N/A","N/A","N/A","N/A",1,1,1,1,1,1,1,1,1]
[null,null,null,null,null,null,null,null,null,null,null,null,null,null,null,null,null,null,null,null,null,null,null,null,null,null,null,null,null,null,null,null,null,null,"N/A","N/A","N/A","N/A","N/A","N/A","N/A","N/A","N/A",1,1,1,1,1,1,1,1,1]
[null,null,null,null,null,null,null,null,null,null,null,null,null,null,null,null,null,null,null,null,null,null,null,null,null,null,null,null,null,null,null,null,null,null,"N/A","N/A","N/A","N/A","N/A","N/A","N/A","N/A","N/A",1,1,1,1,1,1,1,1,1]
[null,null,null,null,null,null,null,null,null,null,null,null,null,null,null,null,null,null,null,null,null,null,null,null,null,null,null,null,null,null,null,null,null,null,"N/A","N/A","N/A","N/A","N/A","N/A","N/A","N/A","N/A",1,1,1,1,1,1,1,1,1]
[null,null,null,null,null,null,null,null,null,null,null,null,null,null,null,null,null,null,null,null,null,null,null,null,null,null,null,null,null,null,null,null,null,null,"N/A","N/A","N/A","N/A","N/A","N/A","N/A","N/A","N/A",1,1,1,1,1,1,1,1,1]
[null,null,null,null,null,null,null,null,null,null,null,null,null,null,null,null,null,null,null,null,null,null,null,null,null,null,null,null,null,null,null,null,null,null,"N/A","N/A","N/A","N/A","N/A","N/A","N/A","N/A","N/A",1,1,1,1,1,1,1,1,1]
[null,null,null,null,null,null,null,null,null,null,null,null,null,null,null,null,null,null,null,null,null,null,null,null,null,null,null,null,null,null,null,null,null,null,"N/A","N/A","N/A","N/A","N/A","N/A","N/A","N/A","N/A",1,1,1,1,1,1,1,1,1]
[null,null,null,null,null,null,null,null,null,null,null,null,null,null,null,null,null,null,null,null,null,null,null,null,null,null,null,null,null,null,null,null,null,null,"N/A","N/A","N/A","N/A","N/A","N/A","N/A","N/A","N/A",1,1,1,1,1,1,1,1,1]
[null,null,null,null,null,null,null,null,null,null,null,null,null,null,null,null,null,null,null,null,null,null,null,null,null,null,null,null,null,null,null,null,null,null,"N/A","N/A","N/A","N/A","N/A","N/A","N/A","N/A","N/A",1,1,1,1,1,1,1,1,1]
[null,null,null,null,null,null,null,null,null,null,null,null,null,null,null,null,null,null,null,null,null,null,null,null,null,null,null,null,null,null,null,null,null,null,"N/A","N/A","N/A","N/A","N/A","N/A","N/A","N/A","N/A",1,1,1,1,1,1,1,1,1]
[null,null,null,null,null,null,null,null,null,null,null,null,null,null,null,null,null,null,null,null,null,null,null,null,null,null,null,null,null,null,null,null,null,null,"N/A","N/A","N/A","N/A","N/A","N/A","N/A","N/A","N/A",1,1,1,1,1,1,1,1,1]
[null,null,null,null,null,null,null,null,null,null,null,null,null,null,null,null,null,null,null,null,null,null,null,null,null,null,null,null,null,null,null,null,null,null,"N/A","N/A","N/A","N/A","N/A","N/A","N/A","N/A","N/A",1,1,1,1,1,1,1,1,1]
[null,null,null,null,null,null,null,null,null,null,null,null,null,null,null,null,null,null,null,null,null,null,null,null,null,null,null,null,null,null,null,null,null,null,"N/A","N/A","N/A","N/A","N/A","N/A","N/A","N/A","N/A",1,1,1,1,1,1,1,1,1]
[null,null,null,null,null,null,null,null,null,null,null,null,null,null,null,null,null,null,null,null,null,null,null,null,null,null,null,null,null,null,null,null,null,null,"N/A","N/A","N/A","N/A","N/A","N/A","N/A","N/A","N/A",1,1,1,1,1,1,1,1,1]
[null,null,null,null,null,null,null,null,null,null,null,null,null,null,null,null,null,null,null,null,null,null,null,null,null,null,null,null,null,null,null,null,null,null,"N/A","N/A","N/A","N/A","N/A","N/A","N/A","N/A","N/A",1,1,1,1,1,1,1,1,1]
[null,null,null,null,null,null,null,null,null,null,null,null,null,null,null,null,null,null,null,null,null,null,null,null,null,null,null,null,null,null,null,null,null,null,"N/A","N/A","N/A","N/A","N/A","N/A","N/A","N/A","N/A",1,1,1,1,1,1,1,1,1]
[null,null,null,null,null,null,null,null,null,null,null,null,null,null,null,null,null,null,null,null,null,null,null,null,null,null,null,null,null,null,null,null,null,null,"N/A","N/A","N/A","N/A","N/A","N/A","N/A","N/A","N/A",1,1,1,1,1,1,1,1,1]
[null,null,null,null,null,null,null,null,null,null,null,null,null,null,null,null,null,null,null,null,null,null,null,null,null,null,null,null,null,null,null,null,null,null,"N/A","N/A","N/A","N/A","N/A","N/A","N/A","N/A","N/A",1,1,1,1,1,1,1,1,1]
[null,null,null,null,null,null,null,null,null,null,null,null,null,null,null,null,null,null,null,null,null,null,null,null,null,null,null,null,null,null,null,null,null,null,"N/A","N/A","N/A","N/A","N/A","N/A","N/A","N/A","N/A",1,1,1,1,1,1,1,1,1]
[null,null,null,null,null,null,null,null,null,null,null,null,null,null,null,null,null,null,null,null,null,null,null,null,null,null,null,null,null,null,null,null,null,null,"N/A","N/A","N/A","N/A","N/A","N/A","N/A","N/A","N/A",1,1,1,1,1,1,1,1,1]
[null,null,null,null,null,null,null,null,null,null,null,null,null,null,null,null,null,null,null,null,null,null,null,null,null,null,null,null,null,null,null,null,null,null,"N/A","N/A","N/A","N/A","N/A","N/A","N/A","N/A","N/A",1,1,1,1,{"$f":"IF(AM570=\"N/A\",1,\"\")","v":1},1,1,1,1]
[null,null,null,null,null,null,null,null,null,null,null,null,null,null,null,null,null,null,null,null,null,null,null,null,null,null,null,null,null,null,null,null,null,null,"N/A","N/A","N/A","N/A","N/A","N/A","N/A","N/A","N/A",{"$f":"IF(AI571=\"N/A\",1,\"\")","v":1},1,1,1,1,1,1,1,1]
[null,null,null,null,null,null,null,null,null,null,null,null,null,null,null,null,null,null,null,null,null,null,null,null,null,null,null,null,null,null,null,null,null,null,"N/A","N/A","N/A","N/A","N/A","N/A","N/A","N/A","N/A",1,1,1,1,1,1,1,1,1]
[null,null,null,null,null,null,null,null,null,null,null,null,null,null,null,null,null,null,null,null,null,null,null,null,null,null,null,null,null,null,null,null,null,null,"N/A","N/A","N/A","N/A","N/A","N/A","N/A","N/A","N/A",1,1,1,1,1,1,1,1,1]
[null,null,null,null,null,null,null,null,null,null,null,null,null,null,null,null,null,null,null,null,null,null,null,null,null,null,null,null,null,null,null,null,null,null,"N/A","N/A","N/A","N/A","N/A","N/A","N/A","N/A","N/A",1,1,1,1,1,1,1,1,1]
[null,null,null,null,null,null,null,null,null,null,null,null,null,null,null,null,null,null,null,null,null,null,null,null,null,null,null,null,null,null,null,null,null,null,"N/A","N/A","N/A","N/A","N/A","N/A","N/A","N/A","N/A",1,1,1,1,1,1,1,1,1]
[null,null,null,null,null,null,null,null,null,null,null,null,null,null,null,null,null,null,null,null,null,null,null,null,null,null,null,null,null,null,null,null,null,null,"N/A","N/A","N/A","N/A","N/A","N/A","N/A","N/A","N/A",1,1,1,1,1,1,1,1,1]
[null,null,null,null,null,null,null,null,null,null,null,null,null,null,null,null,null,null,null,null,null,null,null,null,null,null,null,null,null,null,null,null,null,null,"N/A","N/A","N/A","N/A","N/A","N/A","N/A","N/A","N/A",1,1,1,1,1,1,1,1,1]
[null,null,null,null,null,null,null,null,null,null,null,null,null,null,null,null,null,null,null,null,null,null,null,null,null,null,null,null,null,null,null,null,null,null,"N/A","N/A","N/A","N/A","N/A","N/A","N/A","N/A","N/A",1,1,1,1,1,1,1,1,1]
[null,null,null,null,null,null,null,null,null,null,null,null,null,null,null,null,null,null,null,null,null,null,null,null,null,null,null,null,null,null,null,null,null,null,"N/A","N/A","N/A","N/A","N/A","N/A","N/A","N/A","N/A",1,1,1,1,1,1,1,1,1]
[null,null,null,null,null,null,null,null,null,null,null,null,null,null,null,null,null,null,null,null,null,null,null,null,null,null,null,null,null,null,null,null,null,null,"N/A","N/A","N/A","N/A","N/A","N/A","N/A","N/A","N/A",1,1,1,1,1,1,1,1,1]
[null,null,null,null,null,null,null,null,null,null,null,null,null,null,null,null,null,null,null,null,null,null,null,null,null,null,null,null,null,null,null,null,null,null,"N/A","N/A","N/A","N/A","N/A","N/A","N/A","N/A","N/A",1,1,1,1,1,1,1,1,1]
[null,null,null,null,null,null,null,null,null,null,null,null,null,null,null,null,null,null,null,null,null,null,null,null,null,null,null,null,null,null,null,null,null,null,"N/A","N/A","N/A","N/A","N/A","N/A","N/A","N/A","N/A",1,1,1,1,1,1,1,1,1]
[null,null,null,null,null,null,null,null,null,null,null,null,null,null,null,null,null,null,null,null,null,null,null,null,null,null,null,null,null,null,null,null,null,null,"N/A","N/A","N/A","N/A","N/A","N/A","N/A","N/A","N/A",1,1,1,1,1,1,1,1,1]
[null,null,null,null,null,null,null,null,null,null,null,null,null,null,null,null,null,null,null,null,null,null,null,null,null,null,null,null,null,null,null,null,null,null,"N/A","N/A","N/A","N/A","N/A","N/A","N/A","N/A","N/A",1,1,1,1,1,1,1,1,1]
[null,null,null,null,null,null,null,null,null,null,null,null,null,null,null,null,null,null,null,null,null,null,null,null,null,null,null,null,null,null,null,null,null,null,"N/A","N/A","N/A","N/A","N/A","N/A","N/A","N/A","N/A",1,1,1,1,1,1,1,1,1]
[null,null,null,null,null,null,null,null,null,null,null,null,null,null,null,null,null,null,null,null,null,null,null,null,null,null,null,null,null,null,null,null,null,null,"N/A","N/A","N/A","N/A","N/A","N/A","N/A","N/A","N/A",1,1,1,1,1,1,1,1,1]
[null,null,null,null,null,null,null,null,null,null,null,null,null,null,null,null,null,null,null,null,null,null,null,null,null,null,null,null,null,null,null,null,null,null,"N/A","N/A","N/A","N/A","N/A","N/A","N/A","N/A","N/A",1,1,1,1,1,1,1,1,1]
[null,null,null,null,null,null,null,null,null,null,null,null,null,null,null,null,null,null,null,null,null,null,null,null,null,null,null,null,null,null,null,null,null,null,"N/A","N/A","N/A","N/A","N/A","N/A","N/A","N/A","N/A",1,1,1,1,1,1,1,1,1]
[null,null,null,null,null,null,null,null,null,null,null,null,null,null,null,null,null,null,null,null,null,null,null,null,null,null,null,null,null,null,null,null,null,null,"N/A","N/A","N/A","N/A","N/A","N/A","N/A","N/A","N/A",1,1,1,1,1,1,1,1,1]
[null,null,null,null,null,null,null,null,null,null,null,null,null,null,null,null,null,null,null,null,null,null,null,null,null,null,null,null,null,null,null,null,null,null,"N/A","N/A","N/A","N/A","N/A","N/A","N/A","N/A","N/A",1,1,1,1,1,1,1,1,1]
[null,null,null,null,null,null,null,null,null,null,null,null,null,null,null,null,null,null,null,null,null,null,null,null,null,null,null,null,null,null,null,null,null,null,"N/A","N/A","N/A","N/A","N/A","N/A","N/A","N/A","N/A",1,1,1,1,1,1,1,1,1]
[null,null,null,null,null,null,null,null,null,null,null,null,null,null,null,null,null,null,null,null,null,null,null,null,null,null,null,null,null,null,null,null,null,null,"N/A","N/A","N/A","N/A","N/A","N/A","N/A","N/A","N/A",1,1,1,1,1,1,1,1,1]
[null,null,null,null,null,null,null,null,null,null,null,null,null,null,null,null,null,null,null,null,null,null,null,null,null,null,null,null,null,null,null,null,null,null,"N/A","N/A","N/A","N/A","N/A","N/A","N/A","N/A","N/A",1,1,1,1,1,1,1,1,1]
[null,null,null,null,null,null,null,null,null,null,null,null,null,null,null,null,null,null,null,null,null,null,null,null,null,null,null,null,null,null,null,null,null,null,"N/A","N/A","N/A","N/A","N/A","N/A","N/A","N/A","N/A",1,1,1,1,1,1,1,1,1]
[null,null,null,null,null,null,null,null,null,null,null,null,null,null,null,null,null,null,null,null,null,null,null,null,null,null,null,null,null,null,null,null,null,null,"N/A","N/A","N/A","N/A","N/A","N/A","N/A","N/A","N/A",1,1,1,1,1,1,1,1,1]
[null,null,null,null,null,null,null,null,null,null,null,null,null,null,null,null,null,null,null,null,null,null,null,null,null,null,null,null,null,null,null,null,null,null,"N/A","N/A","N/A","N/A","N/A","N/A","N/A","N/A","N/A",1,1,1,1,1,1,1,1,1]
[null,null,null,null,null,null,null,null,null,null,null,null,null,null,null,null,null,null,null,null,null,null,null,null,null,null,null,null,null,null,null,null,null,null,"N/A","N/A","N/A","N/A","N/A","N/A","N/A","N/A","N/A",1,1,1,1,1,1,1,1,1]
[null,null,null,null,null,null,null,null,null,null,null,null,null,null,null,null,null,null,null,null,null,null,null,null,null,null,null,null,null,null,null,null,null,null,"N/A","N/A","N/A","N/A","N/A","N/A","N/A","N/A","N/A",1,1,1,1,1,1,1,1,1]
[null,null,null,null,null,null,null,null,null,null,null,null,null,null,null,null,null,null,null,null,null,null,null,null,null,null,null,null,null,null,null,null,null,null,"N/A","N/A","N/A","N/A","N/A","N/A","N/A","N/A","N/A",1,1,1,1,1,1,1,1,1]
[null,null,null,null,null,null,null,null,null,null,null,null,null,null,null,null,null,null,null,null,null,null,null,null,null,null,null,null,null,null,null,null,null,null,"N/A","N/A","N/A","N/A","N/A","N/A","N/A","N/A","N/A",1,1,1,1,1,1,1,1,1]
[null,null,null,null,null,null,null,null,null,null,null,null,null,null,null,null,null,null,null,null,null,null,null,null,null,null,null,null,null,null,null,null,null,null,"N/A","N/A","N/A","N/A","N/A","N/A","N/A","N/A","N/A",1,1,1,1,1,1,1,1,1]
[null,null,null,null,null,null,null,null,null,null,null,null,null,null,null,null,null,null,null,null,null,null,null,null,null,null,null,null,null,null,null,null,null,null,{"$f":"IF(COUNTA(E602:G602)>0,(COUNTIF(E602:G602,\"=0\")*0+COUNTIF(E602:G602,\"=1\")*100+COUNTIF(E602:G602,\"=2\")*80+COUNTIF(E602:G602,\"=3\")*50+COUNTIF(E602:G602,\"=8\")*20+COUNTIF(E602:G602,\"=9\")*0)/COUNTA(E602:G602)/100,\"N/A\")","v":"N/A"},{"$f":"IF(COUNTA(H602:J602)>0,(COUNTIF(H602:J602,\"=0\")*0+COUNTIF(H602:J602,\"=1\")*100+COUNTIF(H602:J602,\"=2\")*80+COUNTIF(H602:J602,\"=3\")*50+COUNTIF(H602:J602,\"=8\")*20+COUNTIF(H602:J602,\"=9\")*0)/COUNTA(H602:J602)/100,\"N/A\")","v":"N/A"},{"$f":"IF(COUNTA(K602:M602)>0,(COUNTIF(K602:M602,\"=0\")*0+COUNTIF(K602:M602,\"=1\")*100+COUNTIF(K602:M602,\"=2\")*80+COUNTIF(K602:M602,\"=3\")*50+COUNTIF(K602:M602,\"=8\")*20+COUNTIF(K602:M602,\"=9\")*0)/COUNTA(K602:M602)/100,\"N/A\")","v":"N/A"},{"$f":"IF(COUNTA(N602:V602)>0,(COUNTIF(N602:V602,\"=0\")*0+COUNTIF(N602:V602,\"=1\")*100+COUNTIF(N602:V602,\"=2\")*80+COUNTIF(N602:V602,\"=3\")*50+COUNTIF(N602:V602,\"=8\")*20+COUNTIF(N602:V602,\"=9\")*0)/COUNTA(N602:V602)/100,\"N/A\")","v":"N/A"},{"$f":"IF(COUNTA(W602:AA602)>0,(COUNTIF(W602:AA602,\"=0\")*0+COUNTIF(W602:AA602,\"=1\")*100+COUNTIF(W602:AA602,\"=2\")*80+COUNTIF(W602:AA602,\"=3\")*50+COUNTIF(W602:AA602,\"=8\")*20+COUNTIF(W602:AA602,\"=9\")*0)/COUNTA(W602:AA602)/100,\"N/A\")","v":"N/A"},{"$f":"IF(COUNTA(AB602:AC602)>0,(COUNTIF(AB602:AC602,\"=0\")*0+COUNTIF(AB602:AC602,\"=1\")*100+COUNTIF(AB602:AC602,\"=2\")*80+COUNTIF(AB602:AC602,\"=3\")*50+COUNTIF(AB602:AC602,\"=8\")*20+COUNTIF(AB602:AC602,\"=9\")*0)/COUNTA(AB602:AC602)/100,\"N/A\")","v":"N/A"},{"$f":"IF(COUNTA((AD602:AF602))>0,(COUNTIF((AD602:AF602),\"=0\")*0+COUNTIF((AD602:AF602),\"=1\")*100+COUNTIF((AD602:AF602),\"=2\")*80+COUNTIF((AD602:AF602),\"=3\")*50+COUNTIF((AD602:AF602),\"=8\")*20+COUNTIF((AD602:AF602),\"=9\")*0)/COUNTA((AD602:AF602))/100,\"N/A\")","v":"N/A"},{"$f":"IF(COUNTA(AG602:AH602)>0,(COUNTIF(AG602:AH602,\"=0\")*0+COUNTIF(AG602:AH602,\"=1\")*100+COUNTIF(AG602:AH602,\"=2\")*80+COUNTIF(AG602:AH602,\"=3\")*50+COUNTIF(AG602:AH602,\"=8\")*20+COUNTIF(AG602:AH602,\"=9\")*0)/COUNTA(AG602:AH602)/100,\"N/A\")","v":"N/A"},{"$f":"IF(AND(COUNTA(E602:AH602)<>0,B602<>\"\"),AVERAGE(AL602:AP602,AI602),\"N/A\")","v":"N/A"},1,1,1,1,1,1,1,1,1]
[null,null,null,null,null,null,null,null,null,null,null,null,null,null,null,null,null,null,null,null,null,null,null,null,null,null,null,null,null,null,null,null,null,null,"N/A","N/A","N/A","N/A","N/A","N/A","N/A","N/A","N/A",1,1,1,1,1,1,1,1,1]
[null,null,null,null,null,null,null,null,null,null,null,null,null,null,null,null,null,null,null,null,null,null,null,null,null,null,null,null,null,null,null,null,null,null,"N/A","N/A","N/A","N/A","N/A","N/A","N/A","N/A","N/A",1,1,1,1,1,1,1,1,1]
[null,null,null,null,null,null,null,null,null,null,null,null,null,null,null,null,null,null,null,null,null,null,null,null,null,null,null,null,null,null,null,null,null,null,"N/A","N/A","N/A","N/A","N/A","N/A","N/A","N/A","N/A",1,1,1,1,1,1,1,1,1]
[null,null,null,null,null,null,null,null,null,null,null,null,null,null,null,null,null,null,null,null,null,null,null,null,null,null,null,null,null,null,null,null,null,null,"N/A","N/A","N/A","N/A","N/A","N/A","N/A","N/A","N/A",1,1,1,1,1,1,1,1,1]
[null,null,null,null,null,null,null,null,null,null,null,null,null,null,null,null,null,null,null,null,null,null,null,null,null,null,null,null,null,null,null,null,null,null,"N/A","N/A","N/A","N/A","N/A","N/A","N/A","N/A","N/A",1,1,1,1,1,1,1,1,1]
[null,null,null,null,null,null,null,null,null,null,null,null,null,null,null,null,null,null,null,null,null,null,null,null,null,null,null,null,null,null,null,null,null,null,"N/A","N/A","N/A","N/A","N/A","N/A","N/A","N/A","N/A",1,1,1,1,1,1,1,1,1]
[null,null,null,null,null,null,null,null,null,null,null,null,null,null,null,null,null,null,null,null,null,null,null,null,null,null,null,null,null,null,null,null,null,null,"N/A","N/A","N/A","N/A","N/A","N/A","N/A","N/A","N/A",1,1,1,1,1,1,1,1,1]
[null,null,null,null,null,null,null,null,null,null,null,null,null,null,null,null,null,null,null,null,null,null,null,null,null,null,null,null,null,null,null,null,null,null,"N/A","N/A","N/A","N/A","N/A","N/A","N/A","N/A","N/A",1,1,1,1,1,1,1,1,1]
[null,null,null,null,null,null,null,null,null,null,null,null,null,null,null,null,null,null,null,null,null,null,null,null,null,null,null,null,null,null,null,null,null,null,"N/A","N/A","N/A","N/A","N/A","N/A","N/A","N/A","N/A",1,1,1,1,1,1,1,1,1]
[null,null,null,null,null,null,null,null,null,null,null,null,null,null,null,null,null,null,null,null,null,null,null,null,null,null,null,null,null,null,null,null,null,null,"N/A","N/A","N/A","N/A","N/A","N/A","N/A","N/A","N/A",1,1,1,1,1,1,1,1,1]
[null,null,null,null,null,null,null,null,null,null,null,null,null,null,null,null,null,null,null,null,null,null,null,null,null,null,null,null,null,null,null,null,null,null,"N/A","N/A","N/A","N/A","N/A","N/A","N/A","N/A","N/A",1,1,1,1,1,1,1,1,1]
[null,null,null,null,null,null,null,null,null,null,null,null,null,null,null,null,null,null,null,null,null,null,null,null,null,null,null,null,null,null,null,null,null,null,"N/A","N/A","N/A","N/A","N/A","N/A","N/A","N/A","N/A",1,1,1,1,1,1,1,1,1]
[null,null,null,null,null,null,null,null,null,null,null,null,null,null,null,null,null,null,null,null,null,null,null,null,null,null,null,null,null,null,null,null,null,null,"N/A","N/A","N/A","N/A","N/A","N/A","N/A","N/A","N/A",1,1,1,1,1,1,1,1,1]
[null,null,null,null,null,null,null,null,null,null,null,null,null,null,null,null,null,null,null,null,null,null,null,null,null,null,null,null,null,null,null,null,null,null,"N/A","N/A","N/A","N/A","N/A","N/A","N/A","N/A","N/A",1,1,1,1,1,1,1,1,1]
[null,null,null,null,null,null,null,null,null,null,null,null,null,null,null,null,null,null,null,null,null,null,null,null,null,null,null,null,null,null,null,null,null,null,"N/A","N/A","N/A","N/A","N/A","N/A","N/A","N/A","N/A",1,1,1,1,1,1,1,1,1]
[null,null,null,null,null,null,null,null,null,null,null,null,null,null,null,null,null,null,null,null,null,null,null,null,null,null,null,null,null,null,null,null,null,null,"N/A","N/A","N/A","N/A","N/A","N/A","N/A","N/A","N/A",1,1,1,1,1,1,1,1,1]
[null,null,null,null,null,null,null,null,null,null,null,null,null,null,null,null,null,null,null,null,null,null,null,null,null,null,null,null,null,null,null,null,null,null,"N/A","N/A","N/A","N/A","N/A","N/A","N/A","N/A","N/A",1,1,1,1,1,1,1,1,1]
[null,null,null,null,null,null,null,null,null,null,null,null,null,null,null,null,null,null,null,null,null,null,null,null,null,null,null,null,null,null,null,null,null,null,"N/A","N/A","N/A","N/A","N/A","N/A","N/A","N/A","N/A",1,1,1,1,1,1,1,1,1]
[null,null,null,null,null,null,null,null,null,null,null,null,null,null,null,null,null,null,null,null,null,null,null,null,null,null,null,null,null,null,null,null,null,null,"N/A","N/A","N/A","N/A","N/A","N/A","N/A","N/A","N/A",1,1,1,1,1,1,1,1,1]
[null,null,null,null,null,null,null,null,null,null,null,null,null,null,null,null,null,null,null,null,null,null,null,null,null,null,null,null,null,null,null,null,null,null,"N/A","N/A","N/A","N/A","N/A","N/A","N/A","N/A","N/A",1,1,1,1,1,1,1,1,1]
[null,null,null,null,null,null,null,null,null,null,null,null,null,null,null,null,null,null,null,null,null,null,null,null,null,null,null,null,null,null,null,null,null,null,"N/A","N/A","N/A","N/A","N/A","N/A","N/A","N/A","N/A",1,1,1,1,1,1,1,1,1]
[null,null,null,null,null,null,null,null,null,null,null,null,null,null,null,null,null,null,null,null,null,null,null,null,null,null,null,null,null,null,null,null,null,null,"N/A","N/A","N/A","N/A","N/A","N/A","N/A","N/A","N/A",1,1,1,1,1,1,1,1,1]
[null,null,null,null,null,null,null,null,null,null,null,null,null,null,null,null,null,null,null,null,null,null,null,null,null,null,null,null,null,null,null,null,null,null,"N/A","N/A","N/A","N/A","N/A","N/A","N/A","N/A","N/A",1,1,1,1,1,1,1,1,1]
[null,null,null,null,null,null,null,null,null,null,null,null,null,null,null,null,null,null,null,null,null,null,null,null,null,null,null,null,null,null,null,null,null,null,"N/A","N/A","N/A","N/A","N/A","N/A","N/A","N/A","N/A",1,1,1,1,1,1,1,1,1]
[null,null,null,null,null,null,null,null,null,null,null,null,null,null,null,null,null,null,null,null,null,null,null,null,null,null,null,null,null,null,null,null,null,null,"N/A","N/A","N/A","N/A","N/A","N/A","N/A","N/A","N/A",1,1,1,1,1,1,1,1,1]
[null,null,null,null,null,null,null,null,null,null,null,null,null,null,null,null,null,null,null,null,null,null,null,null,null,null,null,null,null,null,null,null,null,null,"N/A","N/A","N/A","N/A","N/A","N/A","N/A","N/A","N/A",1,1,1,1,1,1,1,1,1]
[null,null,null,null,null,null,null,null,null,null,null,null,null,null,null,null,null,null,null,null,null,null,null,null,null,null,null,null,null,null,null,null,null,null,"N/A","N/A","N/A","N/A","N/A","N/A","N/A","N/A","N/A",1,1,1,1,1,1,1,1,1]
[null,null,null,null,null,null,null,null,null,null,null,null,null,null,null,null,null,null,null,null,null,null,null,null,null,null,null,null,null,null,null,null,null,null,"N/A","N/A","N/A","N/A","N/A","N/A","N/A","N/A","N/A",1,1,1,1,1,1,1,1,1]
[null,null,null,null,null,null,null,null,null,null,null,null,null,null,null,null,null,null,null,null,null,null,null,null,null,null,null,null,null,null,null,null,null,null,"N/A","N/A","N/A","N/A","N/A","N/A","N/A","N/A","N/A",1,1,1,1,1,1,1,1,1]
[null,null,null,null,null,null,null,null,null,null,null,null,null,null,null,null,null,null,null,null,null,null,null,null,null,null,null,null,null,null,null,null,null,null,"N/A","N/A","N/A","N/A","N/A","N/A","N/A","N/A","N/A",1,1,1,1,1,1,1,1,1]
[null,null,null,null,null,null,null,null,null,null,null,null,null,null,null,null,null,null,null,null,null,null,null,null,null,null,null,null,null,null,null,null,null,null,"N/A","N/A","N/A","N/A","N/A","N/A","N/A","N/A","N/A",1,1,1,1,1,1,1,1,1]
[null,null,null,null,null,null,null,null,null,null,null,null,null,null,null,null,null,null,null,null,null,null,null,null,null,null,null,null,null,null,null,null,null,null,"N/A","N/A","N/A","N/A","N/A","N/A","N/A","N/A","N/A",1,1,1,{"$f":"IF(AL634=\"N/A\",1,\"\")","v":1},1,1,1,1,1]
[null,null,null,null,null,null,null,null,null,null,null,null,null,null,null,null,null,null,null,null,null,null,null,null,null,null,null,null,null,null,null,null,null,null,"N/A","N/A","N/A","N/A","N/A","N/A","N/A","N/A","N/A",{"$f":"IF(AI635=\"N/A\",1,\"\")","v":1},1,1,1,1,1,1,1,1]
[null,null,null,null,null,null,null,null,null,null,null,null,null,null,null,null,null,null,null,null,null,null,null,null,null,null,null,null,null,null,null,null,null,null,"N/A","N/A","N/A","N/A","N/A","N/A","N/A","N/A","N/A",1,1,1,1,1,1,1,1,1]
[null,null,null,null,null,null,null,null,null,null,null,null,null,null,null,null,null,null,null,null,null,null,null,null,null,null,null,null,null,null,null,null,null,null,"N/A","N/A","N/A","N/A","N/A","N/A","N/A","N/A","N/A",1,1,1,1,1,1,1,1,1]
[null,null,null,null,null,null,null,null,null,null,null,null,null,null,null,null,null,null,null,null,null,null,null,null,null,null,null,null,null,null,null,null,null,null,"N/A","N/A","N/A","N/A","N/A","N/A","N/A","N/A","N/A",1,1,1,1,1,1,1,1,1]
[null,null,null,null,null,null,null,null,null,null,null,null,null,null,null,null,null,null,null,null,null,null,null,null,null,null,null,null,null,null,null,null,null,null,"N/A","N/A","N/A","N/A","N/A","N/A","N/A","N/A","N/A",1,1,1,1,1,1,1,1,1]
[null,null,null,null,null,null,null,null,null,null,null,null,null,null,null,null,null,null,null,null,null,null,null,null,null,null,null,null,null,null,null,null,null,null,"N/A","N/A","N/A","N/A","N/A","N/A","N/A","N/A","N/A",1,1,1,1,1,1,1,1,1]
[null,null,null,null,null,null,null,null,null,null,null,null,null,null,null,null,null,null,null,null,null,null,null,null,null,null,null,null,null,null,null,null,null,null,"N/A","N/A","N/A","N/A","N/A","N/A","N/A","N/A","N/A",1,1,1,1,1,1,1,1,1]
[null,null,null,null,null,null,null,null,null,null,null,null,null,null,null,null,null,null,null,null,null,null,null,null,null,null,null,null,null,null,null,null,null,null,"N/A","N/A","N/A","N/A","N/A","N/A","N/A","N/A","N/A",1,1,1,1,1,1,1,1,1]
[null,null,null,null,null,null,null,null,null,null,null,null,null,null,null,null,null,null,null,null,null,null,null,null,null,null,null,null,null,null,null,null,null,null,"N/A","N/A","N/A","N/A","N/A","N/A","N/A","N/A","N/A",1,1,1,1,1,1,1,1,1]
[null,null,null,null,null,null,null,null,null,null,null,null,null,null,null,null,null,null,null,null,null,null,null,null,null,null,null,null,null,null,null,null,null,null,"N/A","N/A","N/A","N/A","N/A","N/A","N/A","N/A","N/A",1,1,1,1,1,1,1,1,1]
[null,null,null,null,null,null,null,null,null,null,null,null,null,null,null,null,null,null,null,null,null,null,null,null,null,null,null,null,null,null,null,null,null,null,"N/A","N/A","N/A","N/A","N/A","N/A","N/A","N/A","N/A",1,1,1,1,1,1,1,1,1]
[null,null,null,null,null,null,null,null,null,null,null,null,null,null,null,null,null,null,null,null,null,null,null,null,null,null,null,null,null,null,null,null,null,null,"N/A","N/A","N/A","N/A","N/A","N/A","N/A","N/A","N/A",1,1,1,1,1,1,1,1,1]
[null,null,null,null,null,null,null,null,null,null,null,null,null,null,null,null,null,null,null,null,null,null,null,null,null,null,null,null,null,null,null,null,null,null,"N/A","N/A","N/A","N/A","N/A","N/A","N/A","N/A","N/A",1,1,1,1,1,1,1,1,1]
[null,null,null,null,null,null,null,null,null,null,null,null,null,null,null,null,null,null,null,null,null,null,null,null,null,null,null,null,null,null,null,null,null,null,"N/A","N/A","N/A","N/A","N/A","N/A","N/A","N/A","N/A",1,1,1,1,1,1,1,1,1]
[null,null,null,null,null,null,null,null,null,null,null,null,null,null,null,null,null,null,null,null,null,null,null,null,null,null,null,null,null,null,null,null,null,null,"N/A","N/A","N/A","N/A","N/A","N/A","N/A","N/A","N/A",1,1,1,1,1,1,1,1,1]
[null,null,null,null,null,null,null,null,null,null,null,null,null,null,null,null,null,null,null,null,null,null,null,null,null,null,null,null,null,null,null,null,null,null,"N/A","N/A","N/A","N/A","N/A","N/A","N/A","N/A","N/A",1,1,1,1,1,1,1,1,1]
[null,null,null,null,null,null,null,null,null,null,null,null,null,null,null,null,null,null,null,null,null,null,null,null,null,null,null,null,null,null,null,null,null,null,"N/A","N/A","N/A","N/A","N/A","N/A","N/A","N/A","N/A",1,1,1,1,1,1,1,1,1]
[null,null,null,null,null,null,null,null,null,null,null,null,null,null,null,null,null,null,null,null,null,null,null,null,null,null,null,null,null,null,null,null,null,null,"N/A","N/A","N/A","N/A","N/A","N/A","N/A","N/A","N/A",1,1,1,1,1,1,1,1,1]
[null,null,null,null,null,null,null,null,null,null,null,null,null,null,null,null,null,null,null,null,null,null,null,null,null,null,null,null,null,null,null,null,null,null,"N/A","N/A","N/A","N/A","N/A","N/A","N/A","N/A","N/A",1,1,1,1,1,1,1,1,1]
[null,null,null,null,null,null,null,null,null,null,null,null,null,null,null,null,null,null,null,null,null,null,null,null,null,null,null,null,null,null,null,null,null,null,"N/A","N/A","N/A","N/A","N/A","N/A","N/A","N/A","N/A",1,1,1,1,1,1,1,1,1]
[null,null,null,null,null,null,null,null,null,null,null,null,null,null,null,null,null,null,null,null,null,null,null,null,null,null,null,null,null,null,null,null,null,null,"N/A","N/A","N/A","N/A","N/A","N/A","N/A","N/A","N/A",1,1,1,1,1,1,1,1,1]
[null,null,null,null,null,null,null,null,null,null,null,null,null,null,null,null,null,null,null,null,null,null,null,null,null,null,null,null,null,null,null,null,null,null,"N/A","N/A","N/A","N/A","N/A","N/A","N/A","N/A","N/A",1,1,1,1,1,1,1,1,1]
[null,null,null,null,null,null,null,null,null,null,null,null,null,null,null,null,null,null,null,null,null,null,null,null,null,null,null,null,null,null,null,null,null,null,"N/A","N/A","N/A","N/A","N/A","N/A","N/A","N/A","N/A",1,1,1,1,1,1,1,1,1]
[null,null,null,null,null,null,null,null,null,null,null,null,null,null,null,null,null,null,null,null,null,null,null,null,null,null,null,null,null,null,null,null,null,null,"N/A","N/A","N/A","N/A","N/A","N/A","N/A","N/A","N/A",1,1,1,1,1,1,1,1,1]
[null,null,null,null,null,null,null,null,null,null,null,null,null,null,null,null,null,null,null,null,null,null,null,null,null,null,null,null,null,null,null,null,null,null,"N/A","N/A","N/A","N/A","N/A","N/A","N/A","N/A","N/A",1,1,1,1,1,1,1,1,1]
[null,null,null,null,null,null,null,null,null,null,null,null,null,null,null,null,null,null,null,null,null,null,null,null,null,null,null,null,null,null,null,null,null,null,"N/A","N/A","N/A","N/A","N/A","N/A","N/A","N/A","N/A",1,1,1,1,1,1,1,1,1]
[null,null,null,null,null,null,null,null,null,null,null,null,null,null,null,null,null,null,null,null,null,null,null,null,null,null,null,null,null,null,null,null,null,null,"N/A","N/A","N/A","N/A","N/A","N/A","N/A","N/A","N/A",1,1,1,1,1,1,1,1,1]
[null,null,null,null,null,null,null,null,null,null,null,null,null,null,null,null,null,null,null,null,null,null,null,null,null,null,null,null,null,null,null,null,null,null,"N/A","N/A","N/A","N/A","N/A","N/A","N/A","N/A","N/A",1,1,1,1,1,1,1,1,1]
[null,null,null,null,null,null,null,null,null,null,null,null,null,null,null,null,null,null,null,null,null,null,null,null,null,null,null,null,null,null,null,null,null,null,"N/A","N/A","N/A","N/A","N/A","N/A","N/A","N/A","N/A",1,1,1,1,1,1,1,1,1]
[null,null,null,null,null,null,null,null,null,null,null,null,null,null,null,null,null,null,null,null,null,null,null,null,null,null,null,null,null,null,null,null,null,null,"N/A","N/A","N/A","N/A","N/A","N/A","N/A","N/A","N/A",1,1,1,1,1,1,1,1,1]
[null,null,null,null,null,null,null,null,null,null,null,null,null,null,null,null,null,null,null,null,null,null,null,null,null,null,null,null,null,null,null,null,null,null,"N/A","N/A","N/A","N/A","N/A","N/A","N/A","N/A","N/A",1,1,1,1,1,1,1,1,1]
[null,null,null,null,null,null,null,null,null,null,null,null,null,null,null,null,null,null,null,null,null,null,null,null,null,null,null,null,null,null,null,null,null,null,{"$f":"IF(COUNTA(E666:G666)>0,(COUNTIF(E666:G666,\"=0\")*0+COUNTIF(E666:G666,\"=1\")*100+COUNTIF(E666:G666,\"=2\")*80+COUNTIF(E666:G666,\"=3\")*50+COUNTIF(E666:G666,\"=8\")*20+COUNTIF(E666:G666,\"=9\")*0)/COUNTA(E666:G666)/100,\"N/A\")","v":"N/A"},{"$f":"IF(COUNTA(H666:J666)>0,(COUNTIF(H666:J666,\"=0\")*0+COUNTIF(H666:J666,\"=1\")*100+COUNTIF(H666:J666,\"=2\")*80+COUNTIF(H666:J666,\"=3\")*50+COUNTIF(H666:J666,\"=8\")*20+COUNTIF(H666:J666,\"=9\")*0)/COUNTA(H666:J666)/100,\"N/A\")","v":"N/A"},{"$f":"IF(COUNTA(K666:M666)>0,(COUNTIF(K666:M666,\"=0\")*0+COUNTIF(K666:M666,\"=1\")*100+COUNTIF(K666:M666,\"=2\")*80+COUNTIF(K666:M666,\"=3\")*50+COUNTIF(K666:M666,\"=8\")*20+COUNTIF(K666:M666,\"=9\")*0)/COUNTA(K666:M666)/100,\"N/A\")","v":"N/A"},{"$f":"IF(COUNTA(N666:V666)>0,(COUNTIF(N666:V666,\"=0\")*0+COUNTIF(N666:V666,\"=1\")*100+COUNTIF(N666:V666,\"=2\")*80+COUNTIF(N666:V666,\"=3\")*50+COUNTIF(N666:V666,\"=8\")*20+COUNTIF(N666:V666,\"=9\")*0)/COUNTA(N666:V666)/100,\"N/A\")","v":"N/A"},{"$f":"IF(COUNTA(W666:AA666)>0,(COUNTIF(W666:AA666,\"=0\")*0+COUNTIF(W666:AA666,\"=1\")*100+COUNTIF(W666:AA666,\"=2\")*80+COUNTIF(W666:AA666,\"=3\")*50+COUNTIF(W666:AA666,\"=8\")*20+COUNTIF(W666:AA666,\"=9\")*0)/COUNTA(W666:AA666)/100,\"N/A\")","v":"N/A"},{"$f":"IF(COUNTA(AB666:AC666)>0,(COUNTIF(AB666:AC666,\"=0\")*0+COUNTIF(AB666:AC666,\"=1\")*100+COUNTIF(AB666:AC666,\"=2\")*80+COUNTIF(AB666:AC666,\"=3\")*50+COUNTIF(AB666:AC666,\"=8\")*20+COUNTIF(AB666:AC666,\"=9\")*0)/COUNTA(AB666:AC666)/100,\"N/A\")","v":"N/A"},{"$f":"IF(COUNTA((AD666:AF666))>0,(COUNTIF((AD666:AF666),\"=0\")*0+COUNTIF((AD666:AF666),\"=1\")*100+COUNTIF((AD666:AF666),\"=2\")*80+COUNTIF((AD666:AF666),\"=3\")*50+COUNTIF((AD666:AF666),\"=8\")*20+COUNTIF((AD666:AF666),\"=9\")*0)/COUNTA((AD666:AF666))/100,\"N/A\")","v":"N/A"},{"$f":"IF(COUNTA(AG666:AH666)>0,(COUNTIF(AG666:AH666,\"=0\")*0+COUNTIF(AG666:AH666,\"=1\")*100+COUNTIF(AG666:AH666,\"=2\")*80+COUNTIF(AG666:AH666,\"=3\")*50+COUNTIF(AG666:AH666,\"=8\")*20+COUNTIF(AG666:AH666,\"=9\")*0)/COUNTA(AG666:AH666)/100,\"N/A\")","v":"N/A"},{"$f":"IF(AND(COUNTA(E666:AH666)<>0,B666<>\"\"),AVERAGE(AL666:AP666,AI666),\"N/A\")","v":"N/A"},1,1,1,1,1,1,1,1,1]
[null,null,null,null,null,null,null,null,null,null,null,null,null,null,null,null,null,null,null,null,null,null,null,null,null,null,null,null,null,null,null,null,null,null,"N/A","N/A","N/A","N/A","N/A","N/A","N/A","N/A","N/A",1,1,1,1,1,1,1,1,1]
[null,null,null,null,null,null,null,null,null,null,null,null,null,null,null,null,null,null,null,null,null,null,null,null,null,null,null,null,null,null,null,null,null,null,"N/A","N/A","N/A","N/A","N/A","N/A","N/A","N/A","N/A",1,1,1,1,1,1,1,1,1]
[null,null,null,null,null,null,null,null,null,null,null,null,null,null,null,null,null,null,null,null,null,null,null,null,null,null,null,null,null,null,null,null,null,null,"N/A","N/A","N/A","N/A","N/A","N/A","N/A","N/A","N/A",1,1,1,1,1,1,1,1,1]
[null,null,null,null,null,null,null,null,null,null,null,null,null,null,null,null,null,null,null,null,null,null,null,null,null,null,null,null,null,null,null,null,null,null,"N/A","N/A","N/A","N/A","N/A","N/A","N/A","N/A","N/A",1,1,1,1,1,1,1,1,1]
[null,null,null,null,null,null,null,null,null,null,null,null,null,null,null,null,null,null,null,null,null,null,null,null,null,null,null,null,null,null,null,null,null,null,"N/A","N/A","N/A","N/A","N/A","N/A","N/A","N/A","N/A",1,1,1,1,1,1,1,1,1]
[null,null,null,null,null,null,null,null,null,null,null,null,null,null,null,null,null,null,null,null,null,null,null,null,null,null,null,null,null,null,null,null,null,null,"N/A","N/A","N/A","N/A","N/A","N/A","N/A","N/A","N/A",1,1,1,1,1,1,1,1,1]
[null,null,null,null,null,null,null,null,null,null,null,null,null,null,null,null,null,null,null,null,null,null,null,null,null,null,null,null,null,null,null,null,null,null,"N/A","N/A","N/A","N/A","N/A","N/A","N/A","N/A","N/A",1,1,1,1,1,1,1,1,1]
[null,null,null,null,null,null,null,null,null,null,null,null,null,null,null,null,null,null,null,null,null,null,null,null,null,null,null,null,null,null,null,null,null,null,"N/A","N/A","N/A","N/A","N/A","N/A","N/A","N/A","N/A",1,1,1,1,1,1,1,1,1]
[null,null,null,null,null,null,null,null,null,null,null,null,null,null,null,null,null,null,null,null,null,null,null,null,null,null,null,null,null,null,null,null,null,null,{"$f":"IF(COUNTA(E675:G675)>0,(COUNTIF(E675:G675,\"=0\")*0+COUNTIF(E675:G675,\"=1\")*100+COUNTIF(E675:G675,\"=2\")*80+COUNTIF(E675:G675,\"=3\")*50+COUNTIF(E675:G675,\"=8\")*20+COUNTIF(E675:G675,\"=9\")*0)/COUNTA(E675:G675)/100,\"N/A\")","v":"N/A"},{"$f":"IF(COUNTA(H675:J675)>0,(COUNTIF(H675:J675,\"=0\")*0+COUNTIF(H675:J675,\"=1\")*100+COUNTIF(H675:J675,\"=2\")*80+COUNTIF(H675:J675,\"=3\")*50+COUNTIF(H675:J675,\"=8\")*20+COUNTIF(H675:J675,\"=9\")*0)/COUNTA(H675:J675)/100,\"N/A\")","v":"N/A"},{"$f":"IF(COUNTA(K675:M675)>0,(COUNTIF(K675:M675,\"=0\")*0+COUNTIF(K675:M675,\"=1\")*100+COUNTIF(K675:M675,\"=2\")*80+COUNTIF(K675:M675,\"=3\")*50+COUNTIF(K675:M675,\"=8\")*20+COUNTIF(K675:M675,\"=9\")*0)/COUNTA(K675:M675)/100,\"N/A\")","v":"N/A"},{"$f":"IF(COUNTA(N675:V675)>0,(COUNTIF(N675:V675,\"=0\")*0+COUNTIF(N675:V675,\"=1\")*100+COUNTIF(N675:V675,\"=2\")*80+COUNTIF(N675:V675,\"=3\")*50+COUNTIF(N675:V675,\"=8\")*20+COUNTIF(N675:V675,\"=9\")*0)/COUNTA(N675:V675)/100,\"N/A\")","v":"N/A"},{"$f":"IF(COUNTA(W675:AA675)>0,(COUNTIF(W675:AA675,\"=0\")*0+COUNTIF(W675:AA675,\"=1\")*100+COUNTIF(W675:AA675,\"=2\")*80+COUNTIF(W675:AA675,\"=3\")*50+COUNTIF(W675:AA675,\"=8\")*20+COUNTIF(W675:AA675,\"=9\")*0)/COUNTA(W675:AA675)/100,\"N/A\")","v":"N/A"},{"$f":"IF(COUNTA(AB675:AC675)>0,(COUNTIF(AB675:AC675,\"=0\")*0+COUNTIF(AB675:AC675,\"=1\")*100+COUNTIF(AB675:AC675,\"=2\")*80+COUNTIF(AB675:AC675,\"=3\")*50+COUNTIF(AB675:AC675,\"=8\")*20+COUNTIF(AB675:AC675,\"=9\")*0)/COUNTA(AB675:AC675)/100,\"N/A\")","v":"N/A"},{"$f":"IF(COUNTA((AD675:AF675))>0,(COUNTIF((AD675:AF675),\"=0\")*0+COUNTIF((AD675:AF675),\"=1\")*100+COUNTIF((AD675:AF675),\"=2\")*80+COUNTIF((AD675:AF675),\"=3\")*50+COUNTIF((AD675:AF675),\"=8\")*20+COUNTIF((AD675:AF675),\"=9\")*0)/COUNTA((AD675:AF675))/100,\"N/A\")","v":"N/A"},{"$f":"IF(COUNTA(AG675:AH675)>0,(COUNTIF(AG675:AH675,\"=0\")*0+COUNTIF(AG675:AH675,\"=1\")*100+COUNTIF(AG675:AH675,\"=2\")*80+COUNTIF(AG675:AH675,\"=3\")*50+COUNTIF(AG675:AH675,\"=8\")*20+COUNTIF(AG675:AH675,\"=9\")*0)/COUNTA(AG675:AH675)/100,\"N/A\")","v":"N/A"},{"$f":"IF(AND(COUNTA(E675:AH675)<>0,B675<>\"\"),AVERAGE(AL675:AP675,AI675),\"N/A\")","v":"N/A"},1,1,{"$f":"IF(AK675=\"N/A\",1,\"\")","v":1},{"$f":"IF(AL675=\"N/A\",1,\"\")","v":1},{"$f":"IF(AM675=\"N/A\",1,\"\")","v":1},{"$f":"IF(AN675=\"N/A\",1,\"\")","v":1},{"$f":"IF(AO675=\"N/A\",1,\"\")","v":1},1,1]
[null,null,null,null,null,null,null,null,null,null,null,null,null,null,null,null,null,null,null,null,null,null,null,null,null,null,null,null,null,null,null,null,null,null,{"$f":"IF(COUNTA(E676:G676)>0,(COUNTIF(E676:G676,\"=0\")*0+COUNTIF(E676:G676,\"=1\")*100+COUNTIF(E676:G676,\"=2\")*80+COUNTIF(E676:G676,\"=3\")*50+COUNTIF(E676:G676,\"=8\")*20+COUNTIF(E676:G676,\"=9\")*0)/COUNTA(E676:G676)/100,\"N/A\")","v":"N/A"},{"$f":"IF(COUNTA(H676:J676)>0,(COUNTIF(H676:J676,\"=0\")*0+COUNTIF(H676:J676,\"=1\")*100+COUNTIF(H676:J676,\"=2\")*80+COUNTIF(H676:J676,\"=3\")*50+COUNTIF(H676:J676,\"=8\")*20+COUNTIF(H676:J676,\"=9\")*0)/COUNTA(H676:J676)/100,\"N/A\")","v":"N/A"},{"$f":"IF(COUNTA(K676:M676)>0,(COUNTIF(K676:M676,\"=0\")*0+COUNTIF(K676:M676,\"=1\")*100+COUNTIF(K676:M676,\"=2\")*80+COUNTIF(K676:M676,\"=3\")*50+COUNTIF(K676:M676,\"=8\")*20+COUNTIF(K676:M676,\"=9\")*0)/COUNTA(K676:M676)/100,\"N/A\")","v":"N/A"},{"$f":"IF(COUNTA(N676:V676)>0,(COUNTIF(N676:V676,\"=0\")*0+COUNTIF(N676:V676,\"=1\")*100+COUNTIF(N676:V676,\"=2\")*80+COUNTIF(N676:V676,\"=3\")*50+COUNTIF(N676:V676,\"=8\")*20+COUNTIF(N676:V676,\"=9\")*0)/COUNTA(N676:V676)/100,\"N/A\")","v":"N/A"},{"$f":"IF(COUNTA(W676:AA676)>0,(COUNTIF(W676:AA676,\"=0\")*0+COUNTIF(W676:AA676,\"=1\")*100+COUNTIF(W676:AA676,\"=2\")*80+COUNTIF(W676:AA676,\"=3\")*50+COUNTIF(W676:AA676,\"=8\")*20+COUNTIF(W676:AA676,\"=9\")*0)/COUNTA(W676:AA676)/100,\"N/A\")","v":"N/A"},{"$f":"IF(COUNTA(AB676:AC676)>0,(COUNTIF(AB676:AC676,\"=0\")*0+COUNTIF(AB676:AC676,\"=1\")*100+COUNTIF(AB676:AC676,\"=2\")*80+COUNTIF(AB676:AC676,\"=3\")*50+COUNTIF(AB676:AC676,\"=8\")*20+COUNTIF(AB676:AC676,\"=9\")*0)/COUNTA(AB676:AC676)/100,\"N/A\")","v":"N/A"},{"$f":"IF(COUNTA((AD676:AF676))>0,(COUNTIF((AD676:AF676),\"=0\")*0+COUNTIF((AD676:AF676),\"=1\")*100+COUNTIF((AD676:AF676),\"=2\")*80+COUNTIF((AD676:AF676),\"=3\")*50+COUNTIF((AD676:AF676),\"=8\")*20+COUNTIF((AD676:AF676),\"=9\")*0)/COUNTA((AD676:AF676))/100,\"N/A\")","v":"N/A"},{"$f":"IF(COUNTA(AG676:AH676)>0,(COUNTIF(AG676:AH676,\"=0\")*0+COUNTIF(AG676:AH676,\"=1\")*100+COUNTIF(AG676:AH676,\"=2\")*80+COUNTIF(AG676:AH676,\"=3\")*50+COUNTIF(AG676:AH676,\"=8\")*20+COUNTIF(AG676:AH676,\"=9\")*0)/COUNTA(AG676:AH676)/100,\"N/A\")","v":"N/A"},{"$f":"IF(AND(COUNTA(E676:AH676)<>0,B676<>\"\"),AVERAGE(AL676:AP676,AI676),\"N/A\")","v":"N/A"},1,1,1,1,1,1,1,1,1]
[null,null,null,null,null,null,null,null,null,null,null,null,null,null,null,null,null,null,null,null,null,null,null,null,null,null,null,null,null,null,null,null,null,null,"N/A","N/A","N/A","N/A","N/A","N/A","N/A","N/A","N/A",1,1,1,1,1,1,1,1,1]
[null,null,null,null,null,null,null,null,null,null,null,null,null,null,null,null,null,null,null,null,null,null,null,null,null,null,null,null,null,null,null,null,null,null,"N/A","N/A","N/A","N/A","N/A","N/A","N/A","N/A","N/A",1,1,1,1,1,1,1,1,1]
[null,null,null,null,null,null,null,null,null,null,null,null,null,null,null,null,null,null,null,null,null,null,null,null,null,null,null,null,null,null,null,null,null,null,"N/A","N/A","N/A","N/A","N/A","N/A","N/A","N/A","N/A",1,1,1,1,1,1,1,1,{"$f":"IF(AQ679=\"N/A\",1,\"\")","v":1}]
[null,null,null,null,null,null,null,null,null,null,null,null,null,null,null,null,null,null,null,null,null,null,null,null,null,null,null,null,null,null,null,null,null,null,"N/A","N/A","N/A","N/A","N/A","N/A","N/A","N/A","N/A",1,1,1,1,1,1,1,1,1]
[null,null,null,null,null,null,null,null,null,null,null,null,null,null,null,null,null,null,null,null,null,null,null,null,null,null,null,null,null,null,null,null,null,null,"N/A","N/A","N/A","N/A","N/A","N/A","N/A","N/A","N/A",1,1,1,1,1,1,1,1,1]
[null,null,null,null,null,null,null,null,null,null,null,null,null,null,null,null,null,null,null,null,null,null,null,null,null,null,null,null,null,null,null,null,null,null,"N/A","N/A","N/A","N/A","N/A","N/A","N/A","N/A","N/A",1,1,1,1,1,1,1,1,1]
[null,null,null,null,null,null,null,null,null,null,null,null,null,null,null,null,null,null,null,null,null,null,null,null,null,null,null,null,null,null,null,null,null,null,"N/A","N/A","N/A","N/A","N/A","N/A","N/A","N/A","N/A",1,1,1,1,1,1,1,1,1]
[null,null,null,null,null,null,null,null,null,null,null,null,null,null,null,null,null,null,null,null,null,null,null,null,null,null,null,null,null,null,null,null,null,null,"N/A","N/A","N/A","N/A","N/A","N/A","N/A","N/A","N/A",1,1,1,1,1,1,1,1,1]
[null,null,null,null,null,null,null,null,null,null,null,null,null,null,null,null,null,null,null,null,null,null,null,null,null,null,null,null,null,null,null,null,null,null,"N/A","N/A","N/A","N/A","N/A","N/A","N/A","N/A","N/A",1,1,1,1,1,1,1,1,1]
[null,null,null,null,null,null,null,null,null,null,null,null,null,null,null,null,null,null,null,null,null,null,null,null,null,null,null,null,null,null,null,null,null,null,"N/A","N/A","N/A","N/A","N/A","N/A","N/A","N/A","N/A",1,1,1,1,1,1,1,1,1]
[null,null,null,null,null,null,null,null,null,null,null,null,null,null,null,null,null,null,null,null,null,null,null,null,null,null,null,null,null,null,null,null,null,null,"N/A","N/A","N/A","N/A","N/A","N/A","N/A","N/A","N/A",1,1,1,1,1,1,1,1,1]
[null,null,null,null,null,null,null,null,null,null,null,null,null,null,null,null,null,null,null,null,null,null,null,null,null,null,null,null,null,null,null,null,null,null,"N/A","N/A","N/A","N/A","N/A","N/A","N/A","N/A","N/A",1,1,1,1,1,1,1,1,1]
[null,null,null,null,null,null,null,null,null,null,null,null,null,null,null,null,null,null,null,null,null,null,null,null,null,null,null,null,null,null,null,null,null,null,"N/A","N/A","N/A","N/A","N/A","N/A","N/A","N/A","N/A",1,1,1,1,1,1,1,1,1]
[null,null,null,null,null,null,null,null,null,null,null,null,null,null,null,null,null,null,null,null,null,null,null,null,null,null,null,null,null,null,null,null,null,null,"N/A","N/A","N/A","N/A","N/A","N/A","N/A","N/A","N/A",1,1,1,1,1,1,1,1,1]
[null,null,null,null,null,null,null,null,null,null,null,null,null,null,null,null,null,null,null,null,null,null,null,null,null,null,null,null,null,null,null,null,null,null,"N/A","N/A","N/A","N/A","N/A","N/A","N/A","N/A","N/A",1,1,1,1,1,1,1,1,1]
[null,null,null,null,null,null,null,null,null,null,null,null,null,null,null,null,null,null,null,null,null,null,null,null,null,null,null,null,null,null,null,null,null,null,"N/A","N/A","N/A","N/A","N/A","N/A","N/A","N/A","N/A",1,1,1,1,1,1,1,1,1]
[null,null,null,null,null,null,null,null,null,null,null,null,null,null,null,null,null,null,null,null,null,null,null,null,null,null,null,null,null,null,null,null,null,null,"N/A","N/A","N/A","N/A","N/A","N/A","N/A","N/A","N/A",1,{"$f":"IF(AJ693=\"N/A\",1,\"\")","v":1},1,1,1,1,1,1,1]
[null,null,null,null,null,null,null,null,null,null,null,null,null,null,null,null,null,null,null,null,null,null,null,null,null,null,null,null,null,null,null,null,null,null,"N/A","N/A","N/A","N/A","N/A","N/A","N/A","N/A","N/A",{"$f":"IF(AI694=\"N/A\",1,\"\")","v":1},1,1,1,1,1,1,1,1]
[null,null,null,null,null,null,null,null,null,null,null,null,null,null,null,null,null,null,null,null,null,null,null,null,null,null,null,null,null,null,null,null,null,null,"N/A","N/A","N/A","N/A","N/A","N/A","N/A","N/A","N/A",1,1,1,1,1,1,1,1,1]
[null,null,null,null,null,null,null,null,null,null,null,null,null,null,null,null,null,null,null,null,null,null,null,null,null,null,null,null,null,null,null,null,null,null,"N/A","N/A","N/A","N/A","N/A","N/A","N/A","N/A","N/A",1,1,1,1,1,1,1,1,1]
[null,null,null,null,null,null,null,null,null,null,null,null,null,null,null,null,null,null,null,null,null,null,null,null,null,null,null,null,null,null,null,null,null,null,"N/A","N/A","N/A","N/A","N/A","N/A","N/A","N/A","N/A",1,1,1,1,1,1,1,1,1]
[null,null,null,null,null,null,null,null,null,null,null,null,null,null,null,null,null,null,null,null,null,null,null,null,null,null,null,null,null,null,null,null,null,null,"N/A","N/A","N/A","N/A","N/A","N/A","N/A","N/A","N/A",1,1,1,1,1,1,1,1,1]
[null,null,null,null,null,null,null,null,null,null,null,null,null,null,null,null,null,null,null,null,null,null,null,null,null,null,null,null,null,null,null,null,null,null,"N/A","N/A","N/A","N/A","N/A","N/A","N/A","N/A","N/A",1,1,1,1,1,1,1,1,1]
[null,null,null,null,null,null,null,null,null,null,null,null,null,null,null,null,null,null,null,null,null,null,null,null,null,null,null,null,null,null,null,null,null,null,"N/A","N/A","N/A","N/A","N/A","N/A","N/A","N/A","N/A",1,1,1,1,1,1,1,1,1]
[null,null,null,null,null,null,null,null,null,null,null,null,null,null,null,null,null,null,null,null,null,null,null,null,null,null,null,null,null,null,null,null,null,null,"N/A","N/A","N/A","N/A","N/A","N/A","N/A","N/A","N/A",1,1,1,1,1,1,1,1,1]
[null,null,null,null,null,null,null,null,null,null,null,null,null,null,null,null,null,null,null,null,null,null,null,null,null,null,null,null,null,null,null,null,null,null,"N/A","N/A","N/A","N/A","N/A","N/A","N/A","N/A","N/A",1,1,1,1,1,1,1,1,1]
[null,null,null,null,null,null,null,null,null,null,null,null,null,null,null,null,null,null,null,null,null,null,null,null,null,null,null,null,null,null,null,null,null,null,"N/A","N/A","N/A","N/A","N/A","N/A","N/A","N/A","N/A",1,1,1,1,1,1,1,1,1]
[null,null,null,null,null,null,null,null,null,null,null,null,null,null,null,null,null,null,null,null,null,null,null,null,null,null,null,null,null,null,null,null,null,null,"N/A","N/A","N/A","N/A","N/A","N/A","N/A","N/A","N/A",1,1,1,1,1,1,1,1,1]
[null,null,null,null,null,null,null,null,null,null,null,null,null,null,null,null,null,null,null,null,null,null,null,null,null,null,null,null,null,null,null,null,null,null,"N/A","N/A","N/A","N/A","N/A","N/A","N/A","N/A","N/A",1,1,1,1,1,1,1,1,1]
[null,null,null,null,null,null,null,null,null,null,null,null,null,null,null,null,null,null,null,null,null,null,null,null,null,null,null,null,null,null,null,null,null,null,"N/A","N/A","N/A","N/A","N/A","N/A","N/A","N/A","N/A",1,1,1,1,1,1,1,1,1]
[null,null,null,null,null,null,null,null,null,null,null,null,null,null,null,null,null,null,null,null,null,null,null,null,null,null,null,null,null,null,null,null,null,null,"N/A","N/A","N/A","N/A","N/A","N/A","N/A","N/A","N/A",1,1,1,1,1,1,1,1,1]
[null,null,null,null,null,null,null,null,null,null,null,null,null,null,null,null,null,null,null,null,null,null,null,null,null,null,null,null,null,null,null,null,null,null,"N/A","N/A","N/A","N/A","N/A","N/A","N/A","N/A","N/A",1,1,1,1,1,1,1,1,1]
[null,null,null,null,null,null,null,null,null,null,null,null,null,null,null,null,null,null,null,null,null,null,null,null,null,null,null,null,null,null,null,null,null,null,"N/A","N/A","N/A","N/A","N/A","N/A","N/A","N/A","N/A",1,1,1,1,1,1,1,1,1]
[null,null,null,null,null,null,null,null,null,null,null,null,null,null,null,null,null,null,null,null,null,null,null,null,null,null,null,null,null,null,null,null,null,null,"N/A","N/A","N/A","N/A","N/A","N/A","N/A","N/A","N/A",1,1,1,1,1,1,1,1,1]
[null,null,null,null,null,null,null,null,null,null,null,null,null,null,null,null,null,null,null,null,null,null,null,null,null,null,null,null,null,null,null,null,null,null,"N/A","N/A","N/A","N/A","N/A","N/A","N/A","N/A","N/A",1,1,1,1,1,1,1,1,1]
[null,null,null,null,null,null,null,null,null,null,null,null,null,null,null,null,null,null,null,null,null,null,null,null,null,null,null,null,null,null,null,null,null,null,"N/A","N/A","N/A","N/A","N/A","N/A","N/A","N/A","N/A",1,1,1,1,1,1,1,1,1]
[null,null,null,null,null,null,null,null,null,null,null,null,null,null,null,null,null,null,null,null,null,null,null,null,null,null,null,null,null,null,null,null,null,null,"N/A","N/A","N/A","N/A","N/A","N/A","N/A","N/A","N/A",1,1,1,1,1,1,1,1,1]
[null,null,null,null,null,null,null,null,null,null,null,null,null,null,null,null,null,null,null,null,null,null,null,null,null,null,null,null,null,null,null,null,null,null,"N/A","N/A","N/A","N/A","N/A","N/A","N/A","N/A","N/A",1,1,1,1,1,1,1,1,1]
[null,null,null,null,null,null,null,null,null,null,null,null,null,null,null,null,null,null,null,null,null,null,null,null,null,null,null,null,null,null,null,null,null,null,"N/A","N/A","N/A","N/A","N/A","N/A","N/A","N/A","N/A",1,1,1,1,1,1,1,1,1]
[null,null,null,null,null,null,null,null,null,null,null,null,null,null,null,null,null,null,null,null,null,null,null,null,null,null,null,null,null,null,null,null,null,null,"N/A","N/A","N/A","N/A","N/A","N/A","N/A","N/A","N/A",1,1,1,1,1,1,1,1,1]
[null,null,null,null,null,null,null,null,null,null,null,null,null,null,null,null,null,null,null,null,null,null,null,null,null,null,null,null,null,null,null,null,null,null,"N/A","N/A","N/A","N/A","N/A","N/A","N/A","N/A","N/A",1,1,1,1,1,1,1,1,1]
[null,null,null,null,null,null,null,null,null,null,null,null,null,null,null,null,null,null,null,null,null,null,null,null,null,null,null,null,null,null,null,null,null,null,"N/A","N/A","N/A","N/A","N/A","N/A","N/A","N/A","N/A",1,1,1,1,1,1,1,1,1]
[null,null,null,null,null,null,null,null,null,null,null,null,null,null,null,null,null,null,null,null,null,null,null,null,null,null,null,null,null,null,null,null,null,null,"N/A","N/A","N/A","N/A","N/A","N/A","N/A","N/A","N/A",1,1,1,1,1,1,1,1,1]
[null,null,null,null,null,null,null,null,null,null,null,null,null,null,null,null,null,null,null,null,null,null,null,null,null,null,null,null,null,null,null,null,null,null,"N/A","N/A","N/A","N/A","N/A","N/A","N/A","N/A","N/A",1,1,1,1,1,1,1,1,1]
[null,null,null,null,null,null,null,null,null,null,null,null,null,null,null,null,null,null,null,null,null,null,null,null,null,null,null,null,null,null,null,null,null,null,"N/A","N/A","N/A","N/A","N/A","N/A","N/A","N/A","N/A",1,1,1,1,1,1,1,1,1]
[null,null,null,null,null,null,null,null,null,null,null,null,null,null,null,null,null,null,null,null,null,null,null,null,null,null,null,null,null,null,null,null,null,null,"N/A","N/A","N/A","N/A","N/A","N/A","N/A","N/A","N/A",1,1,1,1,1,1,1,1,1]
[null,null,null,null,null,null,null,null,null,null,null,null,null,null,null,null,null,null,null,null,null,null,null,null,null,null,null,null,null,null,null,null,null,null,"N/A","N/A","N/A","N/A","N/A","N/A","N/A","N/A","N/A",1,1,1,1,1,1,1,{"$f":"IF(AP723=\"N/A\",1,\"\")","v":1},1]
[null,null,null,null,null,null,null,null,null,null,null,null,null,null,null,null,null,null,null,null,null,null,null,null,null,null,null,null,null,null,null,null,null,null,"N/A","N/A","N/A","N/A","N/A","N/A","N/A","N/A","N/A",1,1,1,1,1,1,1,1,1]
[null,null,null,null,null,null,null,null,null,null,null,null,null,null,null,null,null,null,null,null,null,null,null,null,null,null,null,null,null,null,null,null,null,null,"N/A","N/A","N/A","N/A","N/A","N/A","N/A","N/A","N/A",1,1,1,1,1,1,1,1,1]
[null,null,null,null,null,null,null,null,null,null,null,null,null,null,null,null,null,null,null,null,null,null,null,null,null,null,null,null,null,null,null,null,null,null,"N/A","N/A","N/A","N/A","N/A","N/A","N/A","N/A","N/A",1,1,1,1,1,1,1,1,1]
[null,null,null,null,null,null,null,null,null,null,null,null,null,null,null,null,null,null,null,null,null,null,null,null,null,null,null,null,null,null,null,null,null,null,"N/A","N/A","N/A","N/A","N/A","N/A","N/A","N/A","N/A",1,1,1,1,1,1,1,1,1]
[null,null,null,null,null,null,null,null,null,null,null,null,null,null,null,null,null,null,null,null,null,null,null,null,null,null,null,null,null,null,null,null,null,null,"N/A","N/A","N/A","N/A","N/A","N/A","N/A","N/A","N/A",1,1,1,1,1,1,1,1,1]
[null,null,null,null,null,null,null,null,null,null,null,null,null,null,null,null,null,null,null,null,null,null,null,null,null,null,null,null,null,null,null,null,null,null,"N/A","N/A","N/A","N/A","N/A","N/A","N/A","N/A","N/A",1,1,1,1,1,{"$f":"IF(AN729=\"N/A\",1,\"\")","v":1},1,1,1]
[null,null,null,null,null,null,null,null,null,null,null,null,null,null,null,null,null,null,null,null,null,null,null,null,null,null,null,null,null,null,null,null,null,null,"N/A","N/A","N/A","N/A","N/A","N/A","N/A","N/A","N/A",1,1,1,1,1,1,1,1,1]
[null,null,null,null,null,null,null,null,null,null,null,null,null,null,null,null,null,null,null,null,null,null,null,null,null,null,null,null,null,null,null,null,null,null,"N/A","N/A","N/A","N/A","N/A","N/A","N/A","N/A","N/A",1,1,1,1,1,1,1,1,1]
[null,null,null,null,null,null,null,null,null,null,null,null,null,null,null,null,null,null,null,null,null,null,null,null,null,null,null,null,null,null,null,null,null,null,"N/A","N/A","N/A","N/A","N/A","N/A","N/A","N/A","N/A",1,1,1,1,1,1,1,1,1]
[null,null,null,null,null,null,null,null,null,null,null,null,null,null,null,null,null,null,null,null,null,null,null,null,null,null,null,null,null,null,null,null,null,null,"N/A","N/A","N/A","N/A","N/A","N/A","N/A","N/A","N/A",1,1,1,1,1,1,1,1,1]
[null,null,null,null,null,null,null,null,null,null,null,null,null,null,null,null,null,null,null,null,null,null,null,null,null,null,null,null,null,null,null,null,null,null,"N/A","N/A","N/A","N/A","N/A","N/A","N/A","N/A","N/A",1,1,1,1,1,1,1,1,1]
[null,null,null,null,null,null,null,null,null,null,null,null,null,null,null,null,null,null,null,null,null,null,null,null,null,null,null,null,null,null,null,null,null,null,"N/A","N/A","N/A","N/A","N/A","N/A","N/A","N/A","N/A",1,1,1,1,1,1,1,1,1]
[null,null,null,null,null,null,null,null,null,null,null,null,null,null,null,null,null,null,null,null,null,null,null,null,null,null,null,null,null,null,null,null,null,null,"N/A","N/A","N/A","N/A","N/A","N/A","N/A","N/A","N/A",1,1,1,1,1,1,1,1,1]
[null,null,null,null,null,null,null,null,null,null,null,null,null,null,null,null,null,null,null,null,null,null,null,null,null,null,null,null,null,null,null,null,null,null,"N/A","N/A","N/A","N/A","N/A","N/A","N/A","N/A","N/A",1,1,1,1,1,1,1,1,1]
[null,null,null,null,null,null,null,null,null,null,null,null,null,null,null,null,null,null,null,null,null,null,null,null,null,null,null,null,null,null,null,null,null,null,"N/A","N/A","N/A","N/A","N/A","N/A","N/A","N/A","N/A",1,1,1,1,1,1,1,1,1]
[null,null,null,null,null,null,null,null,null,null,null,null,null,null,null,null,null,null,null,null,null,null,null,null,null,null,null,null,null,null,null,null,null,null,"N/A","N/A","N/A","N/A","N/A","N/A","N/A","N/A","N/A",1,1,1,1,1,1,1,1,1]
[null,null,null,null,null,null,null,null,null,null,null,null,null,null,null,null,null,null,null,null,null,null,null,null,null,null,null,null,null,null,null,null,null,null,{"$f":"IF(COUNTA(E740:G740)>0,(COUNTIF(E740:G740,\"=0\")*0+COUNTIF(E740:G740,\"=1\")*100+COUNTIF(E740:G740,\"=2\")*80+COUNTIF(E740:G740,\"=3\")*50+COUNTIF(E740:G740,\"=8\")*20+COUNTIF(E740:G740,\"=9\")*0)/COUNTA(E740:G740)/100,\"N/A\")","v":"N/A"},{"$f":"IF(COUNTA(H740:J740)>0,(COUNTIF(H740:J740,\"=0\")*0+COUNTIF(H740:J740,\"=1\")*100+COUNTIF(H740:J740,\"=2\")*80+COUNTIF(H740:J740,\"=3\")*50+COUNTIF(H740:J740,\"=8\")*20+COUNTIF(H740:J740,\"=9\")*0)/COUNTA(H740:J740)/100,\"N/A\")","v":"N/A"},{"$f":"IF(COUNTA(K740:M740)>0,(COUNTIF(K740:M740,\"=0\")*0+COUNTIF(K740:M740,\"=1\")*100+COUNTIF(K740:M740,\"=2\")*80+COUNTIF(K740:M740,\"=3\")*50+COUNTIF(K740:M740,\"=8\")*20+COUNTIF(K740:M740,\"=9\")*0)/COUNTA(K740:M740)/100,\"N/A\")","v":"N/A"},{"$f":"IF(COUNTA(N740:V740)>0,(COUNTIF(N740:V740,\"=0\")*0+COUNTIF(N740:V740,\"=1\")*100+COUNTIF(N740:V740,\"=2\")*80+COUNTIF(N740:V740,\"=3\")*50+COUNTIF(N740:V740,\"=8\")*20+COUNTIF(N740:V740,\"=9\")*0)/COUNTA(N740:V740)/100,\"N/A\")","v":"N/A"},{"$f":"IF(COUNTA(W740:AA740)>0,(COUNTIF(W740:AA740,\"=0\")*0+COUNTIF(W740:AA740,\"=1\")*100+COUNTIF(W740:AA740,\"=2\")*80+COUNTIF(W740:AA740,\"=3\")*50+COUNTIF(W740:AA740,\"=8\")*20+COUNTIF(W740:AA740,\"=9\")*0)/COUNTA(W740:AA740)/100,\"N/A\")","v":"N/A"},{"$f":"IF(COUNTA(AB740:AC740)>0,(COUNTIF(AB740:AC740,\"=0\")*0+COUNTIF(AB740:AC740,\"=1\")*100+COUNTIF(AB740:AC740,\"=2\")*80+COUNTIF(AB740:AC740,\"=3\")*50+COUNTIF(AB740:AC740,\"=8\")*20+COUNTIF(AB740:AC740,\"=9\")*0)/COUNTA(AB740:AC740)/100,\"N/A\")","v":"N/A"},{"$f":"IF(COUNTA((AD740:AF740))>0,(COUNTIF((AD740:AF740),\"=0\")*0+COUNTIF((AD740:AF740),\"=1\")*100+COUNTIF((AD740:AF740),\"=2\")*80+COUNTIF((AD740:AF740),\"=3\")*50+COUNTIF((AD740:AF740),\"=8\")*20+COUNTIF((AD740:AF740),\"=9\")*0)/COUNTA((AD740:AF740))/100,\"N/A\")","v":"N/A"},{"$f":"IF(COUNTA(AG740:AH740)>0,(COUNTIF(AG740:AH740,\"=0\")*0+COUNTIF(AG740:AH740,\"=1\")*100+COUNTIF(AG740:AH740,\"=2\")*80+COUNTIF(AG740:AH740,\"=3\")*50+COUNTIF(AG740:AH740,\"=8\")*20+COUNTIF(AG740:AH740,\"=9\")*0)/COUNTA(AG740:AH740)/100,\"N/A\")","v":"N/A"},{"$f":"IF(AND(COUNTA(E740:AH740)<>0,B740<>\"\"),AVERAGE(AL740:AP740,AI740),\"N/A\")","v":"N/A"},1,1,1,1,1,1,1,1,1]
[null,null,null,null,null,null,null,null,null,null,null,null,null,null,null,null,null,null,null,null,null,null,null,null,null,null,null,null,null,null,null,null,null,null,"N/A","N/A","N/A","N/A","N/A","N/A","N/A","N/A","N/A",1,1,1,1,1,1,1,1,1]
[null,null,null,null,null,null,null,null,null,null,null,null,null,null,null,null,null,null,null,null,null,null,null,null,null,null,null,null,null,null,null,null,null,null,"N/A","N/A","N/A","N/A","N/A","N/A","N/A","N/A","N/A",1,1,1,1,1,1,1,1,1]
[null,null,null,null,null,null,null,null,null,null,null,null,null,null,null,null,null,null,null,null,null,null,null,null,null,null,null,null,null,null,null,null,null,null,"N/A","N/A","N/A","N/A","N/A","N/A","N/A","N/A","N/A",1,1,1,1,1,1,1,1,1]
[null,null,null,null,null,null,null,null,null,null,null,null,null,null,null,null,null,null,null,null,null,null,null,null,null,null,null,null,null,null,null,null,null,null,"N/A","N/A","N/A","N/A","N/A","N/A","N/A","N/A","N/A",1,1,1,1,1,1,1,1,1]
[null,null,null,null,null,null,null,null,null,null,null,null,null,null,null,null,null,null,null,null,null,null,null,null,null,null,null,null,null,null,null,null,null,null,"N/A","N/A","N/A","N/A","N/A","N/A","N/A","N/A","N/A",1,1,1,1,1,1,1,1,1]
[null,null,null,null,null,null,null,null,null,null,null,null,null,null,null,null,null,null,null,null,null,null,null,null,null,null,null,null,null,null,null,null,null,null,"N/A","N/A","N/A","N/A","N/A","N/A","N/A","N/A","N/A",1,1,1,1,1,1,1,1,1]
[null,null,null,null,null,null,null,null,null,null,null,null,null,null,null,null,null,null,null,null,null,null,null,null,null,null,null,null,null,null,null,null,null,null,"N/A","N/A","N/A","N/A","N/A","N/A","N/A","N/A","N/A",1,1,1,1,1,1,1,1,1]
[null,null,null,null,null,null,null,null,null,null,null,null,null,null,null,null,null,null,null,null,null,null,null,null,null,null,null,null,null,null,null,null,null,null,"N/A","N/A","N/A","N/A","N/A","N/A","N/A","N/A","N/A",1,1,1,1,1,1,1,1,1]
[null,null,null,null,null,null,null,null,null,null,null,null,null,null,null,null,null,null,null,null,null,null,null,null,null,null,null,null,null,null,null,null,null,null,"N/A","N/A","N/A","N/A","N/A","N/A","N/A","N/A","N/A",1,1,1,1,1,1,1,1,1]
[null,null,null,null,null,null,null,null,null,null,null,null,null,null,null,null,null,null,null,null,null,null,null,null,null,null,null,null,null,null,null,null,null,null,"N/A","N/A","N/A","N/A","N/A","N/A","N/A","N/A","N/A",1,1,1,1,1,1,1,1,1]
[null,null,null,null,null,null,null,null,null,null,null,null,null,null,null,null,null,null,null,null,null,null,null,null,null,null,null,null,null,null,null,null,null,null,"N/A","N/A","N/A","N/A","N/A","N/A","N/A","N/A","N/A",1,1,1,1,1,1,1,1,1]
[null,null,null,null,null,null,null,null,null,null,null,null,null,null,null,null,null,null,null,null,null,null,null,null,null,null,null,null,null,null,null,null,null,null,"N/A","N/A","N/A","N/A","N/A","N/A","N/A","N/A","N/A",1,1,1,1,1,1,1,1,1]
[null,null,null,null,null,null,null,null,null,null,null,null,null,null,null,null,null,null,null,null,null,null,null,null,null,null,null,null,null,null,null,null,null,null,"N/A","N/A","N/A","N/A","N/A","N/A","N/A","N/A","N/A",1,1,1,1,1,1,1,1,1]
[null,null,null,null,null,null,null,null,null,null,null,null,null,null,null,null,null,null,null,null,null,null,null,null,null,null,null,null,null,null,null,null,null,null,"N/A","N/A","N/A","N/A","N/A","N/A","N/A","N/A","N/A",1,1,1,1,1,1,1,1,1]
[null,null,null,null,null,null,null,null,null,null,null,null,null,null,null,null,null,null,null,null,null,null,null,null,null,null,null,null,null,null,null,null,null,null,"N/A","N/A","N/A","N/A","N/A","N/A","N/A","N/A","N/A",1,1,1,1,1,1,1,1,1]
[null,null,null,null,null,null,null,null,null,null,null,null,null,null,null,null,null,null,null,null,null,null,null,null,null,null,null,null,null,null,null,null,null,null,"N/A","N/A","N/A","N/A","N/A","N/A","N/A","N/A","N/A",1,1,1,1,1,1,1,1,1]
[null,null,null,null,null,null,null,null,null,null,null,null,null,null,null,null,null,null,null,null,null,null,null,null,null,null,null,null,null,null,null,null,null,null,"N/A","N/A","N/A","N/A","N/A","N/A","N/A","N/A","N/A",1,1,1,1,1,1,1,1,1]
[null,null,null,null,null,null,null,null,null,null,null,null,null,null,null,null,null,null,null,null,null,null,null,null,null,null,null,null,null,null,null,null,null,null,"N/A","N/A","N/A","N/A","N/A","N/A","N/A","N/A","N/A",{"$f":"IF(AI758=\"N/A\",1,\"\")","v":1},1,1,1,1,1,1,1,1]
[null,null,null,null,null,null,null,null,null,null,null,null,null,null,null,null,null,null,null,null,null,null,null,null,null,null,null,null,null,null,null,null,null,null,"N/A","N/A","N/A","N/A","N/A","N/A","N/A","N/A","N/A",1,1,1,1,1,1,1,1,1]
[null,null,null,null,null,null,null,null,null,null,null,null,null,null,null,null,null,null,null,null,null,null,null,null,null,null,null,null,null,null,null,null,null,null,"N/A","N/A","N/A","N/A","N/A","N/A","N/A","N/A","N/A",1,1,1,1,1,1,1,1,1]
[null,null,null,null,null,null,null,null,null,null,null,null,null,null,null,null,null,null,null,null,null,null,null,null,null,null,null,null,null,null,null,null,null,null,"N/A","N/A","N/A","N/A","N/A","N/A","N/A","N/A","N/A",1,1,1,1,1,1,1,1,1]
[null,null,null,null,null,null,null,null,null,null,null,null,null,null,null,null,null,null,null,null,null,null,null,null,null,null,null,null,null,null,null,null,null,null,"N/A","N/A","N/A","N/A","N/A","N/A","N/A","N/A","N/A",1,1,1,1,1,1,1,1,1]
[null,null,null,null,null,null,null,null,null,null,null,null,null,null,null,null,null,null,null,null,null,null,null,null,null,null,null,null,null,null,null,null,null,null,"N/A","N/A","N/A","N/A","N/A","N/A","N/A","N/A","N/A",1,1,1,1,1,1,1,1,1]
[null,null,null,null,null,null,null,null,null,null,null,null,null,null,null,null,null,null,null,null,null,null,null,null,null,null,null,null,null,null,null,null,null,null,"N/A","N/A","N/A","N/A","N/A","N/A","N/A","N/A","N/A",1,1,1,1,1,1,1,1,1]
[null,null,null,null,null,null,null,null,null,null,null,null,null,null,null,null,null,null,null,null,null,null,null,null,null,null,null,null,null,null,null,null,null,null,"N/A","N/A","N/A","N/A","N/A","N/A","N/A","N/A","N/A",1,1,1,1,1,1,1,1,1]
[null,null,null,null,null,null,null,null,null,null,null,null,null,null,null,null,null,null,null,null,null,null,null,null,null,null,null,null,null,null,null,null,null,null,"N/A","N/A","N/A","N/A","N/A","N/A","N/A","N/A","N/A",1,1,1,1,1,1,1,1,1]
[null,null,null,null,null,null,null,null,null,null,null,null,null,null,null,null,null,null,null,null,null,null,null,null,null,null,null,null,null,null,null,null,null,null,"N/A","N/A","N/A","N/A","N/A","N/A","N/A","N/A","N/A",1,1,1,1,1,1,1,1,1]
[null,null,null,null,null,null,null,null,null,null,null,null,null,null,null,null,null,null,null,null,null,null,null,null,null,null,null,null,null,null,null,null,null,null,"N/A","N/A","N/A","N/A","N/A","N/A","N/A","N/A","N/A",1,1,1,1,1,1,1,1,1]
[null,null,null,null,null,null,null,null,null,null,null,null,null,null,null,null,null,null,null,null,null,null,null,null,null,null,null,null,null,null,null,null,null,null,"N/A","N/A","N/A","N/A","N/A","N/A","N/A","N/A","N/A",1,1,1,1,1,1,1,1,1]
[null,null,null,null,null,null,null,null,null,null,null,null,null,null,null,null,null,null,null,null,null,null,null,null,null,null,null,null,null,null,null,null,null,null,"N/A","N/A","N/A","N/A","N/A","N/A","N/A","N/A","N/A",1,1,1,1,1,1,1,1,1]
[null,null,null,null,null,null,null,null,null,null,null,null,null,null,null,null,null,null,null,null,null,null,null,null,null,null,null,null,null,null,null,null,null,null,"N/A","N/A","N/A","N/A","N/A","N/A","N/A","N/A","N/A",1,1,1,1,1,1,1,1,1]
[null,null,null,null,null,null,null,null,null,null,null,null,null,null,null,null,null,null,null,null,null,null,null,null,null,null,null,null,null,null,null,null,null,null,"N/A","N/A","N/A","N/A","N/A","N/A","N/A","N/A","N/A",1,1,1,1,1,1,1,1,1]
[null,null,null,null,null,null,null,null,null,null,null,null,null,null,null,null,null,null,null,null,null,null,null,null,null,null,null,null,null,null,null,null,null,null,"N/A","N/A","N/A","N/A","N/A","N/A","N/A","N/A","N/A",1,1,1,1,1,1,1,1,1]
[null,null,null,null,null,null,null,null,null,null,null,null,null,null,null,null,null,null,null,null,null,null,null,null,null,null,null,null,null,null,null,null,null,null,"N/A","N/A","N/A","N/A","N/A","N/A","N/A","N/A","N/A",1,1,1,1,1,1,1,1,1]
[null,null,null,null,null,null,null,null,null,null,null,null,null,null,null,null,null,null,null,null,null,null,null,null,null,null,null,null,null,null,null,null,null,null,"N/A","N/A","N/A","N/A","N/A","N/A","N/A","N/A","N/A",1,1,1,1,1,1,1,1,1]
[null,null,null,null,null,null,null,null,null,null,null,null,null,null,null,null,null,null,null,null,null,null,null,null,null,null,null,null,null,null,null,null,null,null,"N/A","N/A","N/A","N/A","N/A","N/A","N/A","N/A","N/A",1,1,1,1,1,1,1,1,1]
[null,null,null,null,null,null,null,null,null,null,null,null,null,null,null,null,null,null,null,null,null,null,null,null,null,null,null,null,null,null,null,null,null,null,"N/A","N/A","N/A","N/A","N/A","N/A","N/A","N/A","N/A",1,1,1,1,1,1,1,1,1]
[null,null,null,null,null,null,null,null,null,null,null,null,null,null,null,null,null,null,null,null,null,null,null,null,null,null,null,null,null,null,null,null,null,null,"N/A","N/A","N/A","N/A","N/A","N/A","N/A","N/A","N/A",1,1,1,1,1,1,1,1,1]
[null,null,null,null,null,null,null,null,null,null,null,null,null,null,null,null,null,null,null,null,null,null,null,null,null,null,null,null,null,null,null,null,null,null,"N/A","N/A","N/A","N/A","N/A","N/A","N/A","N/A","N/A",1,1,1,1,1,1,1,1,1]
[null,null,null,null,null,null,null,null,null,null,null,null,null,null,null,null,null,null,null,null,null,null,null,null,null,null,null,null,null,null,null,null,null,null,"N/A","N/A","N/A","N/A","N/A","N/A","N/A","N/A","N/A",1,1,1,1,1,1,1,1,1]
[null,null,null,null,null,null,null,null,null,null,null,null,null,null,null,null,null,null,null,null,null,null,null,null,null,null,null,null,null,null,null,null,null,null,"N/A","N/A","N/A","N/A","N/A","N/A","N/A","N/A","N/A",1,1,1,1,1,1,1,1,1]
[null,null,null,null,null,null,null,null,null,null,null,null,null,null,null,null,null,null,null,null,null,null,null,null,null,null,null,null,null,null,null,null,null,null,"N/A","N/A","N/A","N/A","N/A","N/A","N/A","N/A","N/A",1,1,1,1,1,1,1,1,1]
[null,null,null,null,null,null,null,null,null,null,null,null,null,null,null,null,null,null,null,null,null,null,null,null,null,null,null,null,null,null,null,null,null,null,"N/A","N/A","N/A","N/A","N/A","N/A","N/A","N/A","N/A",1,1,1,1,1,1,1,1,1]
[null,null,null,null,null,null,null,null,null,null,null,null,null,null,null,null,null,null,null,null,null,null,null,null,null,null,null,null,null,null,null,null,null,null,"N/A","N/A","N/A","N/A","N/A","N/A","N/A","N/A","N/A",1,1,1,1,1,1,1,1,1]
[null,null,null,null,null,null,null,null,null,null,null,null,null,null,null,null,null,null,null,null,null,null,null,null,null,null,null,null,null,null,null,null,null,null,"N/A","N/A","N/A","N/A","N/A","N/A","N/A","N/A","N/A",1,1,1,1,1,1,1,1,1]
[null,null,null,null,null,null,null,null,null,null,null,null,null,null,null,null,null,null,null,null,null,null,null,null,null,null,null,null,null,null,null,null,null,null,"N/A","N/A","N/A","N/A","N/A","N/A","N/A","N/A","N/A",1,1,1,1,1,1,1,1,1]
[null,null,null,null,null,null,null,null,null,null,null,null,null,null,null,null,null,null,null,null,null,null,null,null,null,null,null,null,null,null,null,null,null,null,"N/A","N/A","N/A","N/A","N/A","N/A","N/A","N/A","N/A",1,1,1,1,1,1,1,1,1]
[null,null,null,null,null,null,null,null,null,null,null,null,null,null,null,null,null,null,null,null,null,null,null,null,null,null,null,null,null,null,null,null,null,null,"N/A","N/A","N/A","N/A","N/A","N/A","N/A","N/A","N/A",1,1,1,1,1,1,1,1,1]
[null,null,null,null,null,null,null,null,null,null,null,null,null,null,null,null,null,null,null,null,null,null,null,null,null,null,null,null,null,null,null,null,null,null,"N/A","N/A","N/A","N/A","N/A","N/A","N/A","N/A","N/A",1,1,1,1,1,1,1,1,1]
[null,null,null,null,null,null,null,null,null,null,null,null,null,null,null,null,null,null,null,null,null,null,null,null,null,null,null,null,null,null,null,null,null,null,"N/A","N/A","N/A","N/A","N/A","N/A","N/A","N/A","N/A",1,1,1,1,1,1,1,1,1]
[null,null,null,null,null,null,null,null,null,null,null,null,null,null,null,null,null,null,null,null,null,null,null,null,null,null,null,null,null,null,null,null,null,null,"N/A","N/A","N/A","N/A","N/A","N/A","N/A","N/A","N/A",1,1,1,1,1,1,1,1,1]
[null,null,null,null,null,null,null,null,null,null,null,null,null,null,null,null,null,null,null,null,null,null,null,null,null,null,null,null,null,null,null,null,null,null,"N/A","N/A","N/A","N/A","N/A","N/A","N/A","N/A","N/A",1,1,1,1,1,1,1,1,1]
[null,null,null,null,null,null,null,null,null,null,null,null,null,null,null,null,null,null,null,null,null,null,null,null,null,null,null,null,null,null,null,null,null,null,"N/A","N/A","N/A","N/A","N/A","N/A","N/A","N/A","N/A",1,1,1,1,1,1,1,1,1]
[null,null,null,null,null,null,null,null,null,null,null,null,null,null,null,null,null,null,null,null,null,null,null,null,null,null,null,null,null,null,null,null,null,null,"N/A","N/A","N/A","N/A","N/A","N/A","N/A","N/A","N/A",1,1,1,1,1,1,1,1,1]
[null,null,null,null,null,null,null,null,null,null,null,null,null,null,null,null,null,null,null,null,null,null,null,null,null,null,null,null,null,null,null,null,null,null,"N/A","N/A","N/A","N/A","N/A","N/A","N/A","N/A","N/A",1,1,1,1,1,1,1,1,1]
[null,null,null,null,null,null,null,null,null,null,null,null,null,null,null,null,null,null,null,null,null,null,null,null,null,null,null,null,null,null,null,null,null,null,"N/A","N/A","N/A","N/A","N/A","N/A","N/A","N/A","N/A",1,1,1,1,1,1,1,1,1]
[null,null,null,null,null,null,null,null,null,null,null,null,null,null,null,null,null,null,null,null,null,null,null,null,null,null,null,null,null,null,null,null,null,null,"N/A","N/A","N/A","N/A","N/A","N/A","N/A","N/A","N/A",1,1,1,1,1,1,1,1,1]
[null,null,null,null,null,null,null,null,null,null,null,null,null,null,null,null,null,null,null,null,null,null,null,null,null,null,null,null,null,null,null,null,null,null,"N/A","N/A","N/A","N/A","N/A","N/A","N/A","N/A","N/A",1,1,1,1,1,1,1,1,1]
[null,null,null,null,null,null,null,null,null,null,null,null,null,null,null,null,null,null,null,null,null,null,null,null,null,null,null,null,null,null,null,null,null,null,"N/A","N/A","N/A","N/A","N/A","N/A","N/A","N/A","N/A",1,1,1,1,1,1,1,1,1]
[null,null,null,null,null,null,null,null,null,null,null,null,null,null,null,null,null,null,null,null,null,null,null,null,null,null,null,null,null,null,null,null,null,null,"N/A","N/A","N/A","N/A","N/A","N/A","N/A","N/A","N/A",1,1,1,1,1,1,1,1,1]
[null,null,null,null,null,null,null,null,null,null,null,null,null,null,null,null,null,null,null,null,null,null,null,null,null,null,null,null,null,null,null,null,null,null,"N/A","N/A","N/A","N/A","N/A","N/A","N/A","N/A","N/A",1,1,1,1,1,1,1,1,{"$f":"IF(AQ801=\"N/A\",1,\"\")","v":1}]
[null,null,null,null,null,null,null,null,null,null,null,null,null,null,null,null,null,null,null,null,null,null,null,null,null,null,null,null,null,null,null,null,null,null,"N/A","N/A","N/A","N/A","N/A","N/A","N/A","N/A","N/A",{"$f":"IF(AI802=\"N/A\",1,\"\")","v":1},1,1,1,1,1,1,1,1]
[null,null,null,null,null,null,null,null,null,null,null,null,null,null,null,null,null,null,null,null,null,null,null,null,null,null,null,null,null,null,null,null,null,null,"N/A","N/A","N/A","N/A","N/A","N/A","N/A","N/A","N/A",1,1,1,1,1,1,1,1,1]
[null,null,null,null,null,null,null,null,null,null,null,null,null,null,null,null,null,null,null,null,null,null,null,null,null,null,null,null,null,null,null,null,null,null,{"$f":"IF(COUNTA(E804:G804)>0,(COUNTIF(E804:G804,\"=0\")*0+COUNTIF(E804:G804,\"=1\")*100+COUNTIF(E804:G804,\"=2\")*80+COUNTIF(E804:G804,\"=3\")*50+COUNTIF(E804:G804,\"=8\")*20+COUNTIF(E804:G804,\"=9\")*0)/COUNTA(E804:G804)/100,\"N/A\")","v":"N/A"},{"$f":"IF(COUNTA(H804:J804)>0,(COUNTIF(H804:J804,\"=0\")*0+COUNTIF(H804:J804,\"=1\")*100+COUNTIF(H804:J804,\"=2\")*80+COUNTIF(H804:J804,\"=3\")*50+COUNTIF(H804:J804,\"=8\")*20+COUNTIF(H804:J804,\"=9\")*0)/COUNTA(H804:J804)/100,\"N/A\")","v":"N/A"},{"$f":"IF(COUNTA(K804:M804)>0,(COUNTIF(K804:M804,\"=0\")*0+COUNTIF(K804:M804,\"=1\")*100+COUNTIF(K804:M804,\"=2\")*80+COUNTIF(K804:M804,\"=3\")*50+COUNTIF(K804:M804,\"=8\")*20+COUNTIF(K804:M804,\"=9\")*0)/COUNTA(K804:M804)/100,\"N/A\")","v":"N/A"},{"$f":"IF(COUNTA(N804:V804)>0,(COUNTIF(N804:V804,\"=0\")*0+COUNTIF(N804:V804,\"=1\")*100+COUNTIF(N804:V804,\"=2\")*80+COUNTIF(N804:V804,\"=3\")*50+COUNTIF(N804:V804,\"=8\")*20+COUNTIF(N804:V804,\"=9\")*0)/COUNTA(N804:V804)/100,\"N/A\")","v":"N/A"},{"$f":"IF(COUNTA(W804:AA804)>0,(COUNTIF(W804:AA804,\"=0\")*0+COUNTIF(W804:AA804,\"=1\")*100+COUNTIF(W804:AA804,\"=2\")*80+COUNTIF(W804:AA804,\"=3\")*50+COUNTIF(W804:AA804,\"=8\")*20+COUNTIF(W804:AA804,\"=9\")*0)/COUNTA(W804:AA804)/100,\"N/A\")","v":"N/A"},{"$f":"IF(COUNTA(AB804:AC804)>0,(COUNTIF(AB804:AC804,\"=0\")*0+COUNTIF(AB804:AC804,\"=1\")*100+COUNTIF(AB804:AC804,\"=2\")*80+COUNTIF(AB804:AC804,\"=3\")*50+COUNTIF(AB804:AC804,\"=8\")*20+COUNTIF(AB804:AC804,\"=9\")*0)/COUNTA(AB804:AC804)/100,\"N/A\")","v":"N/A"},{"$f":"IF(COUNTA((AD804:AF804))>0,(COUNTIF((AD804:AF804),\"=0\")*0+COUNTIF((AD804:AF804),\"=1\")*100+COUNTIF((AD804:AF804),\"=2\")*80+COUNTIF((AD804:AF804),\"=3\")*50+COUNTIF((AD804:AF804),\"=8\")*20+COUNTIF((AD804:AF804),\"=9\")*0)/COUNTA((AD804:AF804))/100,\"N/A\")","v":"N/A"},{"$f":"IF(COUNTA(AG804:AH804)>0,(COUNTIF(AG804:AH804,\"=0\")*0+COUNTIF(AG804:AH804,\"=1\")*100+COUNTIF(AG804:AH804,\"=2\")*80+COUNTIF(AG804:AH804,\"=3\")*50+COUNTIF(AG804:AH804,\"=8\")*20+COUNTIF(AG804:AH804,\"=9\")*0)/COUNTA(AG804:AH804)/100,\"N/A\")","v":"N/A"},{"$f":"IF(AND(COUNTA(E804:AH804)<>0,B804<>\"\"),AVERAGE(AL804:AP804,AI804),\"N/A\")","v":"N/A"},1,1,1,1,1,1,1,1,1]
[null,null,null,null,null,null,null,null,null,null,null,null,null,null,null,null,null,null,null,null,null,null,null,null,null,null,null,null,null,null,null,null,null,null,"N/A","N/A","N/A","N/A","N/A","N/A","N/A","N/A","N/A",1,1,1,1,1,1,1,1,1]
[null,null,null,null,null,null,null,null,null,null,null,null,null,null,null,null,null,null,null,null,null,null,null,null,null,null,null,null,null,null,null,null,null,null,"N/A","N/A","N/A","N/A","N/A","N/A","N/A","N/A","N/A",1,1,1,1,1,1,1,1,1]
[null,null,null,null,null,null,null,null,null,null,null,null,null,null,null,null,null,null,null,null,null,null,null,null,null,null,null,null,null,null,null,null,null,null,"N/A","N/A","N/A","N/A","N/A","N/A","N/A","N/A","N/A",1,1,1,1,1,1,1,1,1]
[null,null,null,null,null,null,null,null,null,null,null,null,null,null,null,null,null,null,null,null,null,null,null,null,null,null,null,null,null,null,null,null,null,null,"N/A","N/A","N/A","N/A","N/A","N/A","N/A","N/A","N/A",1,1,1,1,1,1,1,1,1]
[null,null,null,null,null,null,null,null,null,null,null,null,null,null,null,null,null,null,null,null,null,null,null,null,null,null,null,null,null,null,null,null,null,null,"N/A","N/A","N/A","N/A","N/A","N/A","N/A","N/A","N/A",1,1,1,1,1,1,1,1,1]
[null,null,null,null,null,null,null,null,null,null,null,null,null,null,null,null,null,null,null,null,null,null,null,null,null,null,null,null,null,null,null,null,null,null,"N/A","N/A","N/A","N/A","N/A","N/A","N/A","N/A","N/A",1,1,1,1,1,1,1,1,1]
[null,null,null,null,null,null,null,null,null,null,null,null,null,null,null,null,null,null,null,null,null,null,null,null,null,null,null,null,null,null,null,null,null,null,"N/A","N/A","N/A","N/A","N/A","N/A","N/A","N/A","N/A",1,1,1,1,1,1,1,1,1]
[null,null,null,null,null,null,null,null,null,null,null,null,null,null,null,null,null,null,null,null,null,null,null,null,null,null,null,null,null,null,null,null,null,null,"N/A","N/A","N/A","N/A","N/A","N/A","N/A","N/A","N/A",1,1,1,1,1,1,1,1,1]
[null,null,null,null,null,null,null,null,null,null,null,null,null,null,null,null,null,null,null,null,null,null,null,null,null,null,null,null,null,null,null,null,null,null,"N/A","N/A","N/A","N/A","N/A","N/A","N/A","N/A","N/A",1,1,1,1,1,1,1,1,1]
[null,null,null,null,null,null,null,null,null,null,null,null,null,null,null,null,null,null,null,null,null,null,null,null,null,null,null,null,null,null,null,null,null,null,"N/A","N/A","N/A","N/A","N/A","N/A","N/A","N/A","N/A",1,1,1,1,1,1,1,1,1]
[null,null,null,null,null,null,null,null,null,null,null,null,null,null,null,null,null,null,null,null,null,null,null,null,null,null,null,null,null,null,null,null,null,null,"N/A","N/A","N/A","N/A","N/A","N/A","N/A","N/A","N/A",1,1,1,1,1,1,1,1,1]
[null,null,null,null,null,null,null,null,null,null,null,null,null,null,null,null,null,null,null,null,null,null,null,null,null,null,null,null,null,null,null,null,null,null,"N/A","N/A","N/A","N/A","N/A","N/A","N/A","N/A","N/A",1,1,1,1,1,1,1,1,1]
[null,null,null,null,null,null,null,null,null,null,null,null,null,null,null,null,null,null,null,null,null,null,null,null,null,null,null,null,null,null,null,null,null,null,"N/A","N/A","N/A","N/A","N/A","N/A","N/A","N/A","N/A",1,1,1,1,1,1,1,1,1]
[null,null,null,null,null,null,null,null,null,null,null,null,null,null,null,null,null,null,null,null,null,null,null,null,null,null,null,null,null,null,null,null,null,null,"N/A","N/A","N/A","N/A","N/A","N/A","N/A","N/A","N/A",1,1,1,1,1,1,1,1,1]
[null,null,null,null,null,null,null,null,null,null,null,null,null,null,null,null,null,null,null,null,null,null,null,null,null,null,null,null,null,null,null,null,null,null,"N/A","N/A","N/A","N/A","N/A","N/A","N/A","N/A","N/A",1,1,1,1,1,1,1,1,1]
[null,null,null,null,null,null,null,null,null,null,null,null,null,null,null,null,null,null,null,null,null,null,null,null,null,null,null,null,null,null,null,null,null,null,"N/A","N/A","N/A","N/A","N/A","N/A","N/A","N/A","N/A",1,1,1,1,1,1,1,1,1]
[null,null,null,null,null,null,null,null,null,null,null,null,null,null,null,null,null,null,null,null,null,null,null,null,null,null,null,null,null,null,null,null,null,null,"N/A","N/A","N/A","N/A","N/A","N/A","N/A","N/A","N/A",1,1,1,1,1,1,1,1,1]
[null,null,null,null,null,null,null,null,null,null,null,null,null,null,null,null,null,null,null,null,null,null,null,null,null,null,null,null,null,null,null,null,null,null,"N/A","N/A","N/A","N/A","N/A","N/A","N/A","N/A","N/A",1,1,1,1,1,1,1,1,1]
[null,null,null,null,null,null,null,null,null,null,null,null,null,null,null,null,null,null,null,null,null,null,null,null,null,null,null,null,null,null,null,null,null,null,"N/A","N/A","N/A","N/A","N/A","N/A","N/A","N/A","N/A",1,1,1,1,1,1,1,1,1]
[null,null,null,null,null,null,null,null,null,null,null,null,null,null,null,null,null,null,null,null,null,null,null,null,null,null,null,null,null,null,null,null,null,null,"N/A","N/A","N/A","N/A","N/A","N/A","N/A","N/A","N/A",1,1,1,1,1,1,1,1,1]
[null,null,null,null,null,null,null,null,null,null,null,null,null,null,null,null,null,null,null,null,null,null,null,null,null,null,null,null,null,null,null,null,null,null,"N/A","N/A","N/A","N/A","N/A","N/A","N/A","N/A","N/A",1,1,1,1,1,1,1,1,1]
[null,null,null,null,null,null,null,null,null,null,null,null,null,null,null,null,null,null,null,null,null,null,null,null,null,null,null,null,null,null,null,null,null,null,"N/A","N/A","N/A","N/A","N/A","N/A","N/A","N/A","N/A",1,1,1,1,1,1,1,1,1]
[null,null,null,null,null,null,null,null,null,null,null,null,null,null,null,null,null,null,null,null,null,null,null,null,null,null,null,null,null,null,null,null,null,null,"N/A","N/A","N/A","N/A","N/A","N/A","N/A","N/A","N/A",1,1,1,1,1,1,1,1,1]
[null,null,null,null,null,null,null,null,null,null,null,null,null,null,null,null,null,null,null,null,null,null,null,null,null,null,null,null,null,null,null,null,null,null,"N/A","N/A","N/A","N/A","N/A","N/A","N/A","N/A","N/A",1,1,1,1,1,1,1,1,1]
[null,null,null,null,null,null,null,null,null,null,null,null,null,null,null,null,null,null,null,null,null,null,null,null,null,null,null,null,null,null,null,null,null,null,"N/A","N/A","N/A","N/A","N/A","N/A","N/A","N/A","N/A",1,1,1,1,1,1,1,1,1]
[null,null,null,null,null,null,null,null,null,null,null,null,null,null,null,null,null,null,null,null,null,null,null,null,null,null,null,null,null,null,null,null,null,null,"N/A","N/A","N/A","N/A","N/A","N/A","N/A","N/A","N/A",1,1,1,1,1,1,1,1,1]
[null,null,null,null,null,null,null,null,null,null,null,null,null,null,null,null,null,null,null,null,null,null,null,null,null,null,null,null,null,null,null,null,null,null,"N/A","N/A","N/A","N/A","N/A","N/A","N/A","N/A","N/A",1,1,1,1,1,1,1,1,1]
[null,null,null,null,null,null,null,null,null,null,null,null,null,null,null,null,null,null,null,null,null,null,null,null,null,null,null,null,null,null,null,null,null,null,"N/A","N/A","N/A","N/A","N/A","N/A","N/A","N/A","N/A",1,1,1,1,1,1,1,1,1]
[null,null,null,null,null,null,null,null,null,null,null,null,null,null,null,null,null,null,null,null,null,null,null,null,null,null,null,null,null,null,null,null,null,null,"N/A","N/A","N/A","N/A","N/A","N/A","N/A","N/A","N/A",1,1,1,1,1,1,1,{"$f":"IF(AP833=\"N/A\",1,\"\")","v":1},1]
[null,null,null,null,null,null,null,null,null,null,null,null,null,null,null,null,null,null,null,null,null,null,null,null,null,null,null,null,null,null,null,null,null,null,"N/A","N/A","N/A","N/A","N/A","N/A","N/A","N/A","N/A",{"$f":"IF(AI834=\"N/A\",1,\"\")","v":1},1,1,1,1,1,1,1,1]
[null,null,null,null,null,null,null,null,null,null,null,null,null,null,null,null,null,null,null,null,null,null,null,null,null,null,null,null,null,null,null,null,null,null,"N/A","N/A","N/A","N/A","N/A","N/A","N/A","N/A","N/A",1,1,1,1,1,1,1,1,1]
[null,null,null,null,null,null,null,null,null,null,null,null,null,null,null,null,null,null,null,null,null,null,null,null,null,null,null,null,null,null,null,null,null,null,"N/A","N/A","N/A","N/A","N/A","N/A","N/A","N/A","N/A",1,1,1,1,1,1,1,1,1]
[null,null,null,null,null,null,null,null,null,null,null,null,null,null,null,null,null,null,null,null,null,null,null,null,null,null,null,null,null,null,null,null,null,null,"N/A","N/A","N/A","N/A","N/A","N/A","N/A","N/A","N/A",1,1,1,1,1,1,1,1,1]
[null,null,null,null,null,null,null,null,null,null,null,null,null,null,null,null,null,null,null,null,null,null,null,null,null,null,null,null,null,null,null,null,null,null,"N/A","N/A","N/A","N/A","N/A","N/A","N/A","N/A","N/A",1,1,1,1,1,1,1,1,1]
[null,null,null,null,null,null,null,null,null,null,null,null,null,null,null,null,null,null,null,null,null,null,null,null,null,null,null,null,null,null,null,null,null,null,"N/A","N/A","N/A","N/A","N/A","N/A","N/A","N/A","N/A",1,1,1,1,1,1,1,1,1]
[null,null,null,null,null,null,null,null,null,null,null,null,null,null,null,null,null,null,null,null,null,null,null,null,null,null,null,null,null,null,null,null,null,null,"N/A","N/A","N/A","N/A","N/A","N/A","N/A","N/A","N/A",1,1,1,1,1,1,1,1,1]
[null,null,null,null,null,null,null,null,null,null,null,null,null,null,null,null,null,null,null,null,null,null,null,null,null,null,null,null,null,null,null,null,null,null,"N/A","N/A","N/A","N/A","N/A","N/A","N/A","N/A","N/A",1,1,1,1,1,1,1,1,1]
[null,null,null,null,null,null,null,null,null,null,null,null,null,null,null,null,null,null,null,null,null,null,null,null,null,null,null,null,null,null,null,null,null,null,"N/A","N/A","N/A","N/A","N/A","N/A","N/A","N/A","N/A",1,1,1,1,1,1,1,1,1]
[null,null,null,null,null,null,null,null,null,null,null,null,null,null,null,null,null,null,null,null,null,null,null,null,null,null,null,null,null,null,null,null,null,null,"N/A","N/A","N/A","N/A","N/A","N/A","N/A","N/A","N/A",1,1,1,1,1,1,1,1,1]
[null,null,null,null,null,null,null,null,null,null,null,null,null,null,null,null,null,null,null,null,null,null,null,null,null,null,null,null,null,null,null,null,null,null,"N/A","N/A","N/A","N/A","N/A","N/A","N/A","N/A","N/A",1,1,1,1,1,1,1,1,1]
[null,null,null,null,null,null,null,null,null,null,null,null,null,null,null,null,null,null,null,null,null,null,null,null,null,null,null,null,null,null,null,null,null,null,"N/A","N/A","N/A","N/A","N/A","N/A","N/A","N/A","N/A",1,1,1,1,1,1,1,1,1]
[null,null,null,null,null,null,null,null,null,null,null,null,null,null,null,null,null,null,null,null,null,null,null,null,null,null,null,null,null,null,null,null,null,null,"N/A","N/A","N/A","N/A","N/A","N/A","N/A","N/A","N/A",1,1,1,1,1,1,1,1,1]
[null,null,null,null,null,null,null,null,null,null,null,null,null,null,null,null,null,null,null,null,null,null,null,null,null,null,null,null,null,null,null,null,null,null,"N/A","N/A","N/A","N/A","N/A","N/A","N/A","N/A","N/A",1,1,1,1,1,1,1,1,1]
[null,null,null,null,null,null,null,null,null,null,null,null,null,null,null,null,null,null,null,null,null,null,null,null,null,null,null,null,null,null,null,null,null,null,"N/A","N/A","N/A","N/A","N/A","N/A","N/A","N/A","N/A",1,1,1,1,1,1,1,1,1]
[null,null,null,null,null,null,null,null,null,null,null,null,null,null,null,null,null,null,null,null,null,null,null,null,null,null,null,null,null,null,null,null,null,null,"N/A","N/A","N/A","N/A","N/A","N/A","N/A","N/A","N/A",1,1,1,1,1,1,1,1,1]
[null,null,null,null,null,null,null,null,null,null,null,null,null,null,null,null,null,null,null,null,null,null,null,null,null,null,null,null,null,null,null,null,null,null,"N/A","N/A","N/A","N/A","N/A","N/A","N/A","N/A","N/A",1,1,1,1,1,1,1,1,1]
[null,null,null,null,null,null,null,null,null,null,null,null,null,null,null,null,null,null,null,null,null,null,null,null,null,null,null,null,null,null,null,null,null,null,"N/A","N/A","N/A","N/A","N/A","N/A","N/A","N/A","N/A",1,1,1,1,1,1,1,1,1]
[null,null,null,null,null,null,null,null,null,null,null,null,null,null,null,null,null,null,null,null,null,null,null,null,null,null,null,null,null,null,null,null,null,null,"N/A","N/A","N/A","N/A","N/A","N/A","N/A","N/A","N/A",1,1,1,1,1,1,1,1,1]
[null,null,null,null,null,null,null,null,null,null,null,null,null,null,null,null,null,null,null,null,null,null,null,null,null,null,null,null,null,null,null,null,null,null,"N/A","N/A","N/A","N/A","N/A","N/A","N/A","N/A","N/A",1,1,1,1,1,1,1,1,1]
[null,null,null,null,null,null,null,null,null,null,null,null,null,null,null,null,null,null,null,null,null,null,null,null,null,null,null,null,null,null,null,null,null,null,"N/A","N/A","N/A","N/A","N/A","N/A","N/A","N/A","N/A",1,1,1,1,1,1,1,1,1]
[null,null,null,null,null,null,null,null,null,null,null,null,null,null,null,null,null,null,null,null,null,null,null,null,null,null,null,null,null,null,null,null,null,null,"N/A","N/A","N/A","N/A","N/A","N/A","N/A","N/A","N/A",1,1,1,1,1,1,1,1,1]
[null,null,null,null,null,null,null,null,null,null,null,null,null,null,null,null,null,null,null,null,null,null,null,null,null,null,null,null,null,null,null,null,null,null,"N/A","N/A","N/A","N/A","N/A","N/A","N/A","N/A","N/A",1,1,1,1,1,1,1,1,1]
[null,null,null,null,null,null,null,null,null,null,null,null,null,null,null,null,null,null,null,null,null,null,null,null,null,null,null,null,null,null,null,null,null,null,"N/A","N/A","N/A","N/A","N/A","N/A","N/A","N/A","N/A",1,1,1,1,1,1,1,1,1]
[null,null,null,null,null,null,null,null,null,null,null,null,null,null,null,null,null,null,null,null,null,null,null,null,null,null,null,null,null,null,null,null,null,null,"N/A","N/A","N/A","N/A","N/A","N/A","N/A","N/A","N/A",1,1,1,1,1,1,1,1,1]
[null,null,null,null,null,null,null,null,null,null,null,null,null,null,null,null,null,null,null,null,null,null,null,null,null,null,null,null,null,null,null,null,null,null,"N/A","N/A","N/A","N/A","N/A","N/A","N/A","N/A","N/A",1,1,1,1,1,1,1,1,1]
[null,null,null,null,null,null,null,null,null,null,null,null,null,null,null,null,null,null,null,null,null,null,null,null,null,null,null,null,null,null,null,null,null,null,"N/A","N/A","N/A","N/A","N/A","N/A","N/A","N/A","N/A",1,1,1,1,1,1,1,1,1]
[null,null,null,null,null,null,null,null,null,null,null,null,null,null,null,null,null,null,null,null,null,null,null,null,null,null,null,null,null,null,null,null,null,null,"N/A","N/A","N/A","N/A","N/A","N/A","N/A","N/A","N/A",1,1,1,1,1,1,1,1,1]
[null,null,null,null,null,null,null,null,null,null,null,null,null,null,null,null,null,null,null,null,null,null,null,null,null,null,null,null,null,null,null,null,null,null,"N/A","N/A","N/A","N/A","N/A","N/A","N/A","N/A","N/A",1,1,1,1,1,1,1,1,1]
[null,null,null,null,null,null,null,null,null,null,null,null,null,null,null,null,null,null,null,null,null,null,null,null,null,null,null,null,null,null,null,null,null,null,"N/A","N/A","N/A","N/A","N/A","N/A","N/A","N/A","N/A",1,1,1,1,1,1,1,1,1]
[null,null,null,null,null,null,null,null,null,null,null,null,null,null,null,null,null,null,null,null,null,null,null,null,null,null,null,null,null,null,null,null,null,null,"N/A","N/A","N/A","N/A","N/A","N/A","N/A","N/A","N/A",1,1,1,1,1,1,1,1,1]
[null,null,null,null,null,null,null,null,null,null,null,null,null,null,null,null,null,null,null,null,null,null,null,null,null,null,null,null,null,null,null,null,null,null,"N/A","N/A","N/A","N/A","N/A","N/A","N/A","N/A","N/A",1,1,1,1,1,1,1,1,1]
[null,null,null,null,null,null,null,null,null,null,null,null,null,null,null,null,null,null,null,null,null,null,null,null,null,null,null,null,null,null,null,null,null,null,"N/A","N/A","N/A","N/A","N/A","N/A","N/A","N/A","N/A",1,1,1,1,1,1,1,1,1]
[null,null,null,null,null,null,null,null,null,null,null,null,null,null,null,null,null,null,null,null,null,null,null,null,null,null,null,null,null,null,null,null,null,null,"N/A","N/A","N/A","N/A","N/A","N/A","N/A","N/A","N/A",1,1,1,1,1,1,1,1,1]
[null,null,null,null,null,null,null,null,null,null,null,null,null,null,null,null,null,null,null,null,null,null,null,null,null,null,null,null,null,null,null,null,null,null,{"$f":"IF(COUNTA(E868:G868)>0,(COUNTIF(E868:G868,\"=0\")*0+COUNTIF(E868:G868,\"=1\")*100+COUNTIF(E868:G868,\"=2\")*80+COUNTIF(E868:G868,\"=3\")*50+COUNTIF(E868:G868,\"=8\")*20+COUNTIF(E868:G868,\"=9\")*0)/COUNTA(E868:G868)/100,\"N/A\")","v":"N/A"},{"$f":"IF(COUNTA(H868:J868)>0,(COUNTIF(H868:J868,\"=0\")*0+COUNTIF(H868:J868,\"=1\")*100+COUNTIF(H868:J868,\"=2\")*80+COUNTIF(H868:J868,\"=3\")*50+COUNTIF(H868:J868,\"=8\")*20+COUNTIF(H868:J868,\"=9\")*0)/COUNTA(H868:J868)/100,\"N/A\")","v":"N/A"},{"$f":"IF(COUNTA(K868:M868)>0,(COUNTIF(K868:M868,\"=0\")*0+COUNTIF(K868:M868,\"=1\")*100+COUNTIF(K868:M868,\"=2\")*80+COUNTIF(K868:M868,\"=3\")*50+COUNTIF(K868:M868,\"=8\")*20+COUNTIF(K868:M868,\"=9\")*0)/COUNTA(K868:M868)/100,\"N/A\")","v":"N/A"},{"$f":"IF(COUNTA(N868:V868)>0,(COUNTIF(N868:V868,\"=0\")*0+COUNTIF(N868:V868,\"=1\")*100+COUNTIF(N868:V868,\"=2\")*80+COUNTIF(N868:V868,\"=3\")*50+COUNTIF(N868:V868,\"=8\")*20+COUNTIF(N868:V868,\"=9\")*0)/COUNTA(N868:V868)/100,\"N/A\")","v":"N/A"},{"$f":"IF(COUNTA(W868:AA868)>0,(COUNTIF(W868:AA868,\"=0\")*0+COUNTIF(W868:AA868,\"=1\")*100+COUNTIF(W868:AA868,\"=2\")*80+COUNTIF(W868:AA868,\"=3\")*50+COUNTIF(W868:AA868,\"=8\")*20+COUNTIF(W868:AA868,\"=9\")*0)/COUNTA(W868:AA868)/100,\"N/A\")","v":"N/A"},{"$f":"IF(COUNTA(AB868:AC868)>0,(COUNTIF(AB868:AC868,\"=0\")*0+COUNTIF(AB868:AC868,\"=1\")*100+COUNTIF(AB868:AC868,\"=2\")*80+COUNTIF(AB868:AC868,\"=3\")*50+COUNTIF(AB868:AC868,\"=8\")*20+COUNTIF(AB868:AC868,\"=9\")*0)/COUNTA(AB868:AC868)/100,\"N/A\")","v":"N/A"},{"$f":"IF(COUNTA((AD868:AF868))>0,(COUNTIF((AD868:AF868),\"=0\")*0+COUNTIF((AD868:AF868),\"=1\")*100+COUNTIF((AD868:AF868),\"=2\")*80+COUNTIF((AD868:AF868),\"=3\")*50+COUNTIF((AD868:AF868),\"=8\")*20+COUNTIF((AD868:AF868),\"=9\")*0)/COUNTA((AD868:AF868))/100,\"N/A\")","v":"N/A"},{"$f":"IF(COUNTA(AG868:AH868)>0,(COUNTIF(AG868:AH868,\"=0\")*0+COUNTIF(AG868:AH868,\"=1\")*100+COUNTIF(AG868:AH868,\"=2\")*80+COUNTIF(AG868:AH868,\"=3\")*50+COUNTIF(AG868:AH868,\"=8\")*20+COUNTIF(AG868:AH868,\"=9\")*0)/COUNTA(AG868:AH868)/100,\"N/A\")","v":"N/A"},{"$f":"IF(AND(COUNTA(E868:AH868)<>0,B868<>\"\"),AVERAGE(AL868:AP868,AI868),\"N/A\")","v":"N/A"},1,1,1,1,1,1,1,1,1]
[null,null,null,null,null,null,null,null,null,null,null,null,null,null,null,null,null,null,null,null,null,null,null,null,null,null,null,null,null,null,null,null,null,null,"N/A","N/A","N/A","N/A","N/A","N/A","N/A","N/A","N/A",1,1,1,1,1,1,1,1,1]
[null,null,null,null,null,null,null,null,null,null,null,null,null,null,null,null,null,null,null,null,null,null,null,null,null,null,null,null,null,null,null,null,null,null,"N/A","N/A","N/A","N/A","N/A","N/A","N/A","N/A","N/A",1,1,1,{"$f":"IF(AL870=\"N/A\",1,\"\")","v":1},1,1,1,1,1]
[null,null,null,null,null,null,null,null,null,null,null,null,null,null,null,null,null,null,null,null,null,null,null,null,null,null,null,null,null,null,null,null,null,null,"N/A","N/A","N/A","N/A","N/A","N/A","N/A","N/A","N/A",{"$f":"IF(AI871=\"N/A\",1,\"\")","v":1},1,1,1,1,1,1,1,1]
[null,null,null,null,null,null,null,null,null,null,null,null,null,null,null,null,null,null,null,null,null,null,null,null,null,null,null,null,null,null,null,null,null,null,"N/A","N/A","N/A","N/A","N/A","N/A","N/A","N/A","N/A",1,1,1,1,1,1,1,1,1]
[null,null,null,null,null,null,null,null,null,null,null,null,null,null,null,null,null,null,null,null,null,null,null,null,null,null,null,null,null,null,null,null,null,null,"N/A","N/A","N/A","N/A","N/A","N/A","N/A","N/A","N/A",1,1,1,1,1,1,1,1,1]
[null,null,null,null,null,null,null,null,null,null,null,null,null,null,null,null,null,null,null,null,null,null,null,null,null,null,null,null,null,null,null,null,null,null,"N/A","N/A","N/A","N/A","N/A","N/A","N/A","N/A","N/A",1,1,1,1,1,1,1,1,1]
[null,null,null,null,null,null,null,null,null,null,null,null,null,null,null,null,null,null,null,null,null,null,null,null,null,null,null,null,null,null,null,null,null,null,"N/A","N/A","N/A","N/A","N/A","N/A","N/A","N/A","N/A",1,1,1,1,1,1,1,1,1]
[null,null,null,null,null,null,null,null,null,null,null,null,null,null,null,null,null,null,null,null,null,null,null,null,null,null,null,null,null,null,null,null,null,null,"N/A","N/A","N/A","N/A","N/A","N/A","N/A","N/A","N/A",1,1,1,1,1,{"$f":"IF(AN876=\"N/A\",1,\"\")","v":1},1,1,1]
[null,null,null,null,null,null,null,null,null,null,null,null,null,null,null,null,null,null,null,null,null,null,null,null,null,null,null,null,null,null,null,null,null,null,"N/A","N/A","N/A","N/A","N/A","N/A","N/A","N/A","N/A",1,1,1,1,1,{"$f":"IF(AN877=\"N/A\",1,\"\")","v":1},1,1,1]
[null,null,null,null,null,null,null,null,null,null,null,null,null,null,null,null,null,null,null,null,null,null,null,null,null,null,null,null,null,null,null,null,null,null,"N/A","N/A","N/A","N/A","N/A","N/A","N/A","N/A","N/A",1,1,1,1,1,{"$f":"IF(AN878=\"N/A\",1,\"\")","v":1},1,1,1]
[null,null,null,null,null,null,null,null,null,null,null,null,null,null,null,null,null,null,null,null,null,null,null,null,null,null,null,null,null,null,null,null,null,null,"N/A","N/A","N/A","N/A","N/A","N/A","N/A","N/A","N/A",1,1,1,1,1,{"$f":"IF(AN879=\"N/A\",1,\"\")","v":1},1,1,1]
[null,null,null,null,null,null,null,null,null,null,null,null,null,null,null,null,null,null,null,null,null,null,null,null,null,null,null,null,null,null,null,null,null,null,"N/A","N/A","N/A","N/A","N/A","N/A","N/A","N/A","N/A",1,1,1,1,1,1,1,1,1]
[null,null,null,null,null,null,null,null,null,null,null,null,null,null,null,null,null,null,null,null,null,null,null,null,null,null,null,null,null,null,null,null,null,null,"N/A","N/A","N/A","N/A","N/A","N/A","N/A","N/A","N/A",1,1,1,1,1,1,1,1,1]
[null,null,null,null,null,null,null,null,null,null,null,null,null,null,null,null,null,null,null,null,null,null,null,null,null,null,null,null,null,null,null,null,null,null,"N/A","N/A","N/A","N/A","N/A","N/A","N/A","N/A","N/A",1,1,1,1,1,1,1,1,1]
[null,null,null,null,null,null,null,null,null,null,null,null,null,null,null,null,null,null,null,null,null,null,null,null,null,null,null,null,null,null,null,null,null,null,"N/A","N/A","N/A","N/A","N/A","N/A","N/A","N/A","N/A",1,1,1,1,1,1,1,1,1]
[null,null,null,null,null,null,null,null,null,null,null,null,null,null,null,null,null,null,null,null,null,null,null,null,null,null,null,null,null,null,null,null,null,null,"N/A","N/A","N/A","N/A","N/A","N/A","N/A","N/A","N/A",1,1,1,1,1,1,1,1,1]
[null,null,null,null,null,null,null,null,null,null,null,null,null,null,null,null,null,null,null,null,null,null,null,null,null,null,null,null,null,null,null,null,null,null,"N/A","N/A","N/A","N/A","N/A","N/A","N/A","N/A","N/A",1,1,1,1,1,1,1,1,1]
[null,null,null,null,null,null,null,null,null,null,null,null,null,null,null,null,null,null,null,null,null,null,null,null,null,null,null,null,null,null,null,null,null,null,"N/A","N/A","N/A","N/A","N/A","N/A","N/A","N/A","N/A",1,1,1,1,1,1,1,1,1]
[null,null,null,null,null,null,null,null,null,null,null,null,null,null,null,null,null,null,null,null,null,null,null,null,null,null,null,null,null,null,null,null,null,null,"N/A","N/A","N/A","N/A","N/A","N/A","N/A","N/A","N/A",1,1,1,1,1,1,1,1,1]
[null,null,null,null,null,null,null,null,null,null,null,null,null,null,null,null,null,null,null,null,null,null,null,null,null,null,null,null,null,null,null,null,null,null,"N/A","N/A","N/A","N/A","N/A","N/A","N/A","N/A","N/A",1,1,1,1,1,1,1,1,1]
[null,null,null,null,null,null,null,null,null,null,null,null,null,null,null,null,null,null,null,null,null,null,null,null,null,null,null,null,null,null,null,null,null,null,"N/A","N/A","N/A","N/A","N/A","N/A","N/A","N/A","N/A",1,1,1,1,1,1,1,1,1]
[null,null,null,null,null,null,null,null,null,null,null,null,null,null,null,null,null,null,null,null,null,null,null,null,null,null,null,null,null,null,null,null,null,null,"N/A","N/A","N/A","N/A","N/A","N/A","N/A","N/A","N/A",1,1,1,1,1,1,1,1,1]
[null,null,null,null,null,null,null,null,null,null,null,null,null,null,null,null,null,null,null,null,null,null,null,null,null,null,null,null,null,null,null,null,null,null,"N/A","N/A","N/A","N/A","N/A","N/A","N/A","N/A","N/A",1,1,1,1,1,1,1,1,1]
[null,null,null,null,null,null,null,null,null,null,null,null,null,null,null,null,null,null,null,null,null,null,null,null,null,null,null,null,null,null,null,null,null,null,"N/A","N/A","N/A","N/A","N/A","N/A","N/A","N/A","N/A",1,1,1,1,1,1,1,1,1]
[null,null,null,null,null,null,null,null,null,null,null,null,null,null,null,null,null,null,null,null,null,null,null,null,null,null,null,null,null,null,null,null,null,null,"N/A","N/A","N/A","N/A","N/A","N/A","N/A","N/A","N/A",1,1,1,1,1,1,1,1,1]
[null,null,null,null,null,null,null,null,null,null,null,null,null,null,null,null,null,null,null,null,null,null,null,null,null,null,null,null,null,null,null,null,null,null,"N/A","N/A","N/A","N/A","N/A","N/A","N/A","N/A","N/A",1,1,1,1,1,1,1,1,1]
[null,null,null,null,null,null,null,null,null,null,null,null,null,null,null,null,null,null,null,null,null,null,null,null,null,null,null,null,null,null,null,null,null,null,"N/A","N/A","N/A","N/A","N/A","N/A","N/A","N/A","N/A",1,1,1,1,1,1,1,1,1]
[null,null,null,null,null,null,null,null,null,null,null,null,null,null,null,null,null,null,null,null,null,null,null,null,null,null,null,null,null,null,null,null,null,null,"N/A","N/A","N/A","N/A","N/A","N/A","N/A","N/A","N/A",1,1,1,1,1,1,1,1,1]
[null,null,null,null,null,null,null,null,null,null,null,null,null,null,null,null,null,null,null,null,null,null,null,null,null,null,null,null,null,null,null,null,null,null,"N/A","N/A","N/A","N/A","N/A","N/A","N/A","N/A","N/A",1,1,1,1,1,1,1,1,1]
[null,null,null,null,null,null,null,null,null,null,null,null,null,null,null,null,null,null,null,null,null,null,null,null,null,null,null,null,null,null,null,null,null,null,"N/A","N/A","N/A","N/A","N/A","N/A","N/A","N/A","N/A",1,1,1,1,1,1,1,1,1]
[null,null,null,null,null,null,null,null,null,null,null,null,null,null,null,null,null,null,null,null,null,null,null,null,null,null,null,null,null,null,null,null,null,null,"N/A","N/A","N/A","N/A","N/A","N/A","N/A","N/A","N/A",1,1,1,1,1,1,1,1,1]
[null,null,null,null,null,null,null,null,null,null,null,null,null,null,null,null,null,null,null,null,null,null,null,null,null,null,null,null,null,null,null,null,null,null,"N/A","N/A","N/A","N/A","N/A","N/A","N/A","N/A","N/A",1,1,1,1,1,1,1,1,1]
[null,null,null,null,null,null,null,null,null,null,null,null,null,null,null,null,null,null,null,null,null,null,null,null,null,null,null,null,null,null,null,null,null,null,"N/A","N/A","N/A","N/A","N/A","N/A","N/A","N/A","N/A",1,1,1,1,1,1,1,1,1]
[null,null,null,null,null,null,null,null,null,null,null,null,null,null,null,null,null,null,null,null,null,null,null,null,null,null,null,null,null,null,null,null,null,null,"N/A","N/A","N/A","N/A","N/A","N/A","N/A","N/A","N/A",1,1,1,1,1,1,1,1,1]
[null,null,null,null,null,null,null,null,null,null,null,null,null,null,null,null,null,null,null,null,null,null,null,null,null,null,null,null,null,null,null,null,null,null,"N/A","N/A","N/A","N/A","N/A","N/A","N/A","N/A","N/A",1,1,1,1,1,1,1,1,1]
[null,null,null,null,null,null,null,null,null,null,null,null,null,null,null,null,null,null,null,null,null,null,null,null,null,null,null,null,null,null,null,null,null,null,"N/A","N/A","N/A","N/A","N/A","N/A","N/A","N/A","N/A",1,1,1,1,1,1,1,1,1]
[null,null,null,null,null,null,null,null,null,null,null,null,null,null,null,null,null,null,null,null,null,null,null,null,null,null,null,null,null,null,null,null,null,null,"N/A","N/A","N/A","N/A","N/A","N/A","N/A","N/A","N/A",1,1,1,1,1,1,1,1,1]
[null,null,null,null,null,null,null,null,null,null,null,null,null,null,null,null,null,null,null,null,null,null,null,null,null,null,null,null,null,null,null,null,null,null,"N/A","N/A","N/A","N/A","N/A","N/A","N/A","N/A","N/A",1,1,1,1,1,1,1,1,1]
[null,null,null,null,null,null,null,null,null,null,null,null,null,null,null,null,null,null,null,null,null,null,null,null,null,null,null,null,null,null,null,null,null,null,"N/A","N/A","N/A","N/A","N/A","N/A","N/A","N/A","N/A",1,1,1,1,1,1,1,1,1]
[null,null,null,null,null,null,null,null,null,null,null,null,null,null,null,null,null,null,null,null,null,null,null,null,null,null,null,null,null,null,null,null,null,null,"N/A","N/A","N/A","N/A","N/A","N/A","N/A","N/A","N/A",1,1,1,1,1,1,1,1,1]
[null,null,null,null,null,null,null,null,null,null,null,null,null,null,null,null,null,null,null,null,null,null,null,null,null,null,null,null,null,null,null,null,null,null,"N/A","N/A","N/A","N/A","N/A","N/A","N/A","N/A","N/A",1,1,1,1,1,1,1,1,1]
[null,null,null,null,null,null,null,null,null,null,null,null,null,null,null,null,null,null,null,null,null,null,null,null,null,null,null,null,null,null,null,null,null,null,"N/A","N/A","N/A","N/A","N/A","N/A","N/A","N/A","N/A",1,1,1,1,1,1,1,1,1]
[null,null,null,null,null,null,null,null,null,null,null,null,null,null,null,null,null,null,null,null,null,null,null,null,null,null,null,null,null,null,null,null,null,null,"N/A","N/A","N/A","N/A","N/A","N/A","N/A","N/A","N/A",1,1,1,1,1,1,1,1,1]
[null,null,null,null,null,null,null,null,null,null,null,null,null,null,null,null,null,null,null,null,null,null,null,null,null,null,null,null,null,null,null,null,null,null,"N/A","N/A","N/A","N/A","N/A","N/A","N/A","N/A","N/A",1,1,1,1,1,1,1,1,1]
[null,null,null,null,null,null,null,null,null,null,null,null,null,null,null,null,null,null,null,null,null,null,null,null,null,null,null,null,null,null,null,null,null,null,"N/A","N/A","N/A","N/A","N/A","N/A","N/A","N/A","N/A",1,1,1,1,1,1,1,1,1]
[null,null,null,null,null,null,null,null,null,null,null,null,null,null,null,null,null,null,null,null,null,null,null,null,null,null,null,null,null,null,null,null,null,null,"N/A","N/A","N/A","N/A","N/A","N/A","N/A","N/A","N/A",1,1,1,1,1,1,1,1,1]
[null,null,null,null,null,null,null,null,null,null,null,null,null,null,null,null,null,null,null,null,null,null,null,null,null,null,null,null,null,null,null,null,null,null,"N/A","N/A","N/A","N/A","N/A","N/A","N/A","N/A","N/A",1,1,1,1,1,1,1,1,1]
[null,null,null,null,null,null,null,null,null,null,null,null,null,null,null,null,null,null,null,null,null,null,null,null,null,null,null,null,null,null,null,null,null,null,"N/A","N/A","N/A","N/A","N/A","N/A","N/A","N/A","N/A",1,1,1,1,1,1,1,1,1]
[null,null,null,null,null,null,null,null,null,null,null,null,null,null,null,null,null,null,null,null,null,null,null,null,null,null,null,null,null,null,null,null,null,null,"N/A","N/A","N/A","N/A","N/A","N/A","N/A","N/A","N/A",1,1,1,1,1,1,1,1,1]
[null,null,null,null,null,null,null,null,null,null,null,null,null,null,null,null,null,null,null,null,null,null,null,null,null,null,null,null,null,null,null,null,null,null,"N/A","N/A","N/A","N/A","N/A","N/A","N/A","N/A","N/A",1,1,1,1,1,1,1,1,1]
[null,null,null,null,null,null,null,null,null,null,null,null,null,null,null,null,null,null,null,null,null,null,null,null,null,null,null,null,null,null,null,null,null,null,"N/A","N/A","N/A","N/A","N/A","N/A","N/A","N/A","N/A",1,1,1,1,1,1,1,1,1]
[null,null,null,null,null,null,null,null,null,null,null,null,null,null,null,null,null,null,null,null,null,null,null,null,null,null,null,null,null,null,null,null,null,null,"N/A","N/A","N/A","N/A","N/A","N/A","N/A","N/A","N/A",1,1,1,1,1,1,1,1,1]
[null,null,null,null,null,null,null,null,null,null,null,null,null,null,null,null,null,null,null,null,null,null,null,null,null,null,null,null,null,null,null,null,null,null,"N/A","N/A","N/A","N/A","N/A","N/A","N/A","N/A","N/A",1,1,1,1,1,1,1,1,1]
[null,null,null,null,null,null,null,null,null,null,null,null,null,null,null,null,null,null,null,null,null,null,null,null,null,null,null,null,null,null,null,null,null,null,"N/A","N/A","N/A","N/A","N/A","N/A","N/A","N/A","N/A",1,1,1,1,{"$f":"IF(AM922=\"N/A\",1,\"\")","v":1},1,1,1,1]
[null,null,null,null,null,null,null,null,null,null,null,null,null,null,null,null,null,null,null,null,null,null,null,null,null,null,null,null,null,null,null,null,null,null,"N/A","N/A","N/A","N/A","N/A","N/A","N/A","N/A","N/A",1,1,1,1,1,1,1,1,1]
[null,null,null,null,null,null,null,null,null,null,null,null,null,null,null,null,null,null,null,null,null,null,null,null,null,null,null,null,null,null,null,null,null,null,"N/A","N/A","N/A","N/A","N/A","N/A","N/A","N/A","N/A",1,1,1,1,1,1,1,1,1]
[null,null,null,null,null,null,null,null,null,null,null,null,null,null,null,null,null,null,null,null,null,null,null,null,null,null,null,null,null,null,null,null,null,null,"N/A","N/A","N/A","N/A","N/A","N/A","N/A","N/A","N/A",1,1,1,1,1,1,1,1,1]
[null,null,null,null,null,null,null,null,null,null,null,null,null,null,null,null,null,null,null,null,null,null,null,null,null,null,null,null,null,null,null,null,null,null,"N/A","N/A","N/A","N/A","N/A","N/A","N/A","N/A","N/A",1,1,1,1,1,1,1,1,1]
[null,null,null,null,null,null,null,null,null,null,null,null,null,null,null,null,null,null,null,null,null,null,null,null,null,null,null,null,null,null,null,null,null,null,"N/A","N/A","N/A","N/A","N/A","N/A","N/A","N/A","N/A",1,1,1,1,1,1,1,1,1]
[null,null,null,null,null,null,null,null,null,null,null,null,null,null,null,null,null,null,null,null,null,null,null,null,null,null,null,null,null,null,null,null,null,null,"N/A","N/A","N/A","N/A","N/A","N/A","N/A","N/A","N/A",1,1,1,1,1,1,1,1,1]
[null,null,null,null,null,null,null,null,null,null,null,null,null,null,null,null,null,null,null,null,null,null,null,null,null,null,null,null,null,null,null,null,null,null,"N/A","N/A","N/A","N/A","N/A","N/A","N/A","N/A","N/A",1,1,1,1,1,1,1,1,1]
[null,null,null,null,null,null,null,null,null,null,null,null,null,null,null,null,null,null,null,null,null,null,null,null,null,null,null,null,null,null,null,null,null,null,"N/A","N/A","N/A","N/A","N/A","N/A","N/A","N/A","N/A",1,1,1,1,1,1,1,1,1]
[null,null,null,null,null,null,null,null,null,null,null,null,null,null,null,null,null,null,null,null,null,null,null,null,null,null,null,null,null,null,null,null,null,null,"N/A","N/A","N/A","N/A","N/A","N/A","N/A","N/A","N/A",1,1,1,1,1,1,1,1,1]
[null,null,null,null,null,null,null,null,null,null,null,null,null,null,null,null,null,null,null,null,null,null,null,null,null,null,null,null,null,null,null,null,null,null,{"$f":"IF(COUNTA(E932:G932)>0,(COUNTIF(E932:G932,\"=0\")*0+COUNTIF(E932:G932,\"=1\")*100+COUNTIF(E932:G932,\"=2\")*80+COUNTIF(E932:G932,\"=3\")*50+COUNTIF(E932:G932,\"=8\")*20+COUNTIF(E932:G932,\"=9\")*0)/COUNTA(E932:G932)/100,\"N/A\")","v":"N/A"},{"$f":"IF(COUNTA(H932:J932)>0,(COUNTIF(H932:J932,\"=0\")*0+COUNTIF(H932:J932,\"=1\")*100+COUNTIF(H932:J932,\"=2\")*80+COUNTIF(H932:J932,\"=3\")*50+COUNTIF(H932:J932,\"=8\")*20+COUNTIF(H932:J932,\"=9\")*0)/COUNTA(H932:J932)/100,\"N/A\")","v":"N/A"},{"$f":"IF(COUNTA(K932:M932)>0,(COUNTIF(K932:M932,\"=0\")*0+COUNTIF(K932:M932,\"=1\")*100+COUNTIF(K932:M932,\"=2\")*80+COUNTIF(K932:M932,\"=3\")*50+COUNTIF(K932:M932,\"=8\")*20+COUNTIF(K932:M932,\"=9\")*0)/COUNTA(K932:M932)/100,\"N/A\")","v":"N/A"},{"$f":"IF(COUNTA(N932:V932)>0,(COUNTIF(N932:V932,\"=0\")*0+COUNTIF(N932:V932,\"=1\")*100+COUNTIF(N932:V932,\"=2\")*80+COUNTIF(N932:V932,\"=3\")*50+COUNTIF(N932:V932,\"=8\")*20+COUNTIF(N932:V932,\"=9\")*0)/COUNTA(N932:V932)/100,\"N/A\")","v":"N/A"},{"$f":"IF(COUNTA(W932:AA932)>0,(COUNTIF(W932:AA932,\"=0\")*0+COUNTIF(W932:AA932,\"=1\")*100+COUNTIF(W932:AA932,\"=2\")*80+COUNTIF(W932:AA932,\"=3\")*50+COUNTIF(W932:AA932,\"=8\")*20+COUNTIF(W932:AA932,\"=9\")*0)/COUNTA(W932:AA932)/100,\"N/A\")","v":"N/A"},{"$f":"IF(COUNTA(AB932:AC932)>0,(COUNTIF(AB932:AC932,\"=0\")*0+COUNTIF(AB932:AC932,\"=1\")*100+COUNTIF(AB932:AC932,\"=2\")*80+COUNTIF(AB932:AC932,\"=3\")*50+COUNTIF(AB932:AC932,\"=8\")*20+COUNTIF(AB932:AC932,\"=9\")*0)/COUNTA(AB932:AC932)/100,\"N/A\")","v":"N/A"},{"$f":"IF(COUNTA((AD932:AF932))>0,(COUNTIF((AD932:AF932),\"=0\")*0+COUNTIF((AD932:AF932),\"=1\")*100+COUNTIF((AD932:AF932),\"=2\")*80+COUNTIF((AD932:AF932),\"=3\")*50+COUNTIF((AD932:AF932),\"=8\")*20+COUNTIF((AD932:AF932),\"=9\")*0)/COUNTA((AD932:AF932))/100,\"N/A\")","v":"N/A"},{"$f":"IF(COUNTA(AG932:AH932)>0,(COUNTIF(AG932:AH932,\"=0\")*0+COUNTIF(AG932:AH932,\"=1\")*100+COUNTIF(AG932:AH932,\"=2\")*80+COUNTIF(AG932:AH932,\"=3\")*50+COUNTIF(AG932:AH932,\"=8\")*20+COUNTIF(AG932:AH932,\"=9\")*0)/COUNTA(AG932:AH932)/100,\"N/A\")","v":"N/A"},{"$f":"IF(AND(COUNTA(E932:AH932)<>0,B932<>\"\"),AVERAGE(AL932:AP932,AI932),\"N/A\")","v":"N/A"},1,1,1,1,1,1,1,1,1]
[null,null,null,null,null,null,null,null,null,null,null,null,null,null,null,null,null,null,null,null,null,null,null,null,null,null,null,null,null,null,null,null,null,null,"N/A","N/A","N/A","N/A","N/A","N/A","N/A","N/A","N/A",1,1,1,1,1,1,1,1,1]
[null,null,null,null,null,null,null,null,null,null,null,null,null,null,null,null,null,null,null,null,null,null,null,null,null,null,null,null,null,null,null,null,null,null,"N/A","N/A","N/A","N/A","N/A","N/A","N/A","N/A","N/A",1,1,1,1,1,1,1,1,1]
[null,null,null,null,null,null,null,null,null,null,null,null,null,null,null,null,null,null,null,null,null,null,null,null,null,null,null,null,null,null,null,null,null,null,"N/A","N/A","N/A","N/A","N/A","N/A","N/A","N/A","N/A",{"$f":"IF(AI935=\"N/A\",1,\"\")","v":1},1,1,1,1,1,1,1,1]
[null,null,null,null,null,null,null,null,null,null,null,null,null,null,null,null,null,null,null,null,null,null,null,null,null,null,null,null,null,null,null,null,null,null,"N/A","N/A","N/A","N/A","N/A","N/A","N/A","N/A","N/A",1,1,1,1,1,1,1,1,1]
[null,null,null,null,null,null,null,null,null,null,null,null,null,null,null,null,null,null,null,null,null,null,null,null,null,null,null,null,null,null,null,null,null,null,"N/A","N/A","N/A","N/A","N/A","N/A","N/A","N/A","N/A",1,1,1,1,1,1,1,1,1]
[null,null,null,null,null,null,null,null,null,null,null,null,null,null,null,null,null,null,null,null,null,null,null,null,null,null,null,null,null,null,null,null,null,null,"N/A","N/A","N/A","N/A","N/A","N/A","N/A","N/A","N/A",1,1,1,1,1,1,1,1,1]
[null,null,null,null,null,null,null,null,null,null,null,null,null,null,null,null,null,null,null,null,null,null,null,null,null,null,null,null,null,null,null,null,null,null,"N/A","N/A","N/A","N/A","N/A","N/A","N/A","N/A","N/A",1,1,1,1,1,1,1,1,1]
[null,null,null,null,null,null,null,null,null,null,null,null,null,null,null,null,null,null,null,null,null,null,null,null,null,null,null,null,null,null,null,null,null,null,"N/A","N/A","N/A","N/A","N/A","N/A","N/A","N/A","N/A",1,1,1,1,1,1,1,1,1]
[null,null,null,null,null,null,null,null,null,null,null,null,null,null,null,null,null,null,null,null,null,null,null,null,null,null,null,null,null,null,null,null,null,null,"N/A","N/A","N/A","N/A","N/A","N/A","N/A","N/A","N/A",1,1,1,1,1,1,1,1,1]
[null,null,null,null,null,null,null,null,null,null,null,null,null,null,null,null,null,null,null,null,null,null,null,null,null,null,null,null,null,null,null,null,null,null,"N/A","N/A","N/A","N/A","N/A","N/A","N/A","N/A","N/A",1,1,1,1,1,1,1,1,1]
[null,null,null,null,null,null,null,null,null,null,null,null,null,null,null,null,null,null,null,null,null,null,null,null,null,null,null,null,null,null,null,null,null,null,"N/A","N/A","N/A","N/A","N/A","N/A","N/A","N/A","N/A",1,1,1,1,1,1,1,1,1]
[null,null,null,null,null,null,null,null,null,null,null,null,null,null,null,null,null,null,null,null,null,null,null,null,null,null,null,null,null,null,null,null,null,null,"N/A","N/A","N/A","N/A","N/A","N/A","N/A","N/A","N/A",1,1,1,1,1,1,1,1,1]
[null,null,null,null,null,null,null,null,null,null,null,null,null,null,null,null,null,null,null,null,null,null,null,null,null,null,null,null,null,null,null,null,null,null,"N/A","N/A","N/A","N/A","N/A","N/A","N/A","N/A","N/A",1,1,1,1,1,1,1,1,1]
[null,null,null,null,null,null,null,null,null,null,null,null,null,null,null,null,null,null,null,null,null,null,null,null,null,null,null,null,null,null,null,null,null,null,"N/A","N/A","N/A","N/A","N/A","N/A","N/A","N/A","N/A",1,1,1,1,1,1,1,1,1]
[null,null,null,null,null,null,null,null,null,null,null,null,null,null,null,null,null,null,null,null,null,null,null,null,null,null,null,null,null,null,null,null,null,null,"N/A","N/A","N/A","N/A","N/A","N/A","N/A","N/A","N/A",1,1,1,1,1,1,1,1,1]
[null,null,null,null,null,null,null,null,null,null,null,null,null,null,null,null,null,null,null,null,null,null,null,null,null,null,null,null,null,null,null,null,null,null,"N/A","N/A","N/A","N/A","N/A","N/A","N/A","N/A","N/A",1,1,1,1,1,1,1,1,1]
[null,null,null,null,null,null,null,null,null,null,null,null,null,null,null,null,null,null,null,null,null,null,null,null,null,null,null,null,null,null,null,null,null,null,"N/A","N/A","N/A","N/A","N/A","N/A","N/A","N/A","N/A",1,1,1,1,1,1,1,1,1]
[null,null,null,null,null,null,null,null,null,null,null,null,null,null,null,null,null,null,null,null,null,null,null,null,null,null,null,null,null,null,null,null,null,null,"N/A","N/A","N/A","N/A","N/A","N/A","N/A","N/A","N/A",1,1,1,1,1,1,1,1,1]
[null,null,null,null,null,null,null,null,null,null,null,null,null,null,null,null,null,null,null,null,null,null,null,null,null,null,null,null,null,null,null,null,null,null,"N/A","N/A","N/A","N/A","N/A","N/A","N/A","N/A","N/A",1,1,1,1,1,1,1,1,1]
[null,null,null,null,null,null,null,null,null,null,null,null,null,null,null,null,null,null,null,null,null,null,null,null,null,null,null,null,null,null,null,null,null,null,"N/A","N/A","N/A","N/A","N/A","N/A","N/A","N/A","N/A",1,1,1,1,1,1,1,1,1]
[null,null,null,null,null,null,null,null,null,null,null,null,null,null,null,null,null,null,null,null,null,null,null,null,null,null,null,null,null,null,null,null,null,null,"N/A","N/A","N/A","N/A","N/A","N/A","N/A","N/A","N/A",1,1,1,1,1,1,1,1,1]
[null,null,null,null,null,null,null,null,null,null,null,null,null,null,null,null,null,null,null,null,null,null,null,null,null,null,null,null,null,null,null,null,null,null,"N/A","N/A","N/A","N/A","N/A","N/A","N/A","N/A","N/A",1,1,1,1,1,1,1,1,1]
[null,null,null,null,null,null,null,null,null,null,null,null,null,null,null,null,null,null,null,null,null,null,null,null,null,null,null,null,null,null,null,null,null,null,"N/A","N/A","N/A","N/A","N/A","N/A","N/A","N/A","N/A",1,1,1,1,1,1,1,1,1]
[null,null,null,null,null,null,null,null,null,null,null,null,null,null,null,null,null,null,null,null,null,null,null,null,null,null,null,null,null,null,null,null,null,null,"N/A","N/A","N/A","N/A","N/A","N/A","N/A","N/A","N/A",1,1,1,1,1,1,1,1,1]
[null,null,null,null,null,null,null,null,null,null,null,null,null,null,null,null,null,null,null,null,null,null,null,null,null,null,null,null,null,null,null,null,null,null,"N/A","N/A","N/A","N/A","N/A","N/A","N/A","N/A","N/A",1,1,1,1,1,1,1,1,1]
[null,null,null,null,null,null,null,null,null,null,null,null,null,null,null,null,null,null,null,null,null,null,null,null,null,null,null,null,null,null,null,null,null,null,"N/A","N/A","N/A","N/A","N/A","N/A","N/A","N/A","N/A",1,1,1,1,1,1,1,1,1]
[null,null,null,null,null,null,null,null,null,null,null,null,null,null,null,null,null,null,null,null,null,null,null,null,null,null,null,null,null,null,null,null,null,null,"N/A","N/A","N/A","N/A","N/A","N/A","N/A","N/A","N/A",1,1,1,1,1,1,1,1,1]
[null,null,null,null,null,null,null,null,null,null,null,null,null,null,null,null,null,null,null,null,null,null,null,null,null,null,null,null,null,null,null,null,null,null,"N/A","N/A","N/A","N/A","N/A","N/A","N/A","N/A","N/A",1,1,1,1,1,1,1,1,1]
[null,null,null,null,null,null,null,null,null,null,null,null,null,null,null,null,null,null,null,null,null,null,null,null,null,null,null,null,null,null,null,null,null,null,"N/A","N/A","N/A","N/A","N/A","N/A","N/A","N/A","N/A",1,1,1,1,1,1,1,1,1]
[null,null,null,null,null,null,null,null,null,null,null,null,null,null,null,null,null,null,null,null,null,null,null,null,null,null,null,null,null,null,null,null,null,null,"N/A","N/A","N/A","N/A","N/A","N/A","N/A","N/A","N/A",1,1,1,1,1,1,1,1,1]
[null,null,null,null,null,null,null,null,null,null,null,null,null,null,null,null,null,null,null,null,null,null,null,null,null,null,null,null,null,null,null,null,null,null,"N/A","N/A","N/A","N/A","N/A","N/A","N/A","N/A","N/A",1,1,1,1,1,1,1,1,1]
[null,null,null,null,null,null,null,null,null,null,null,null,null,null,null,null,null,null,null,null,null,null,null,null,null,null,null,null,null,null,null,null,null,null,"N/A","N/A","N/A","N/A","N/A","N/A","N/A","N/A","N/A",1,1,1,1,1,1,1,1,1]
[null,null,null,null,null,null,null,null,null,null,null,null,null,null,null,null,null,null,null,null,null,null,null,null,null,null,null,null,null,null,null,null,null,null,"N/A","N/A","N/A","N/A","N/A","N/A","N/A","N/A","N/A",1,1,1,1,1,1,1,1,1]
[null,null,null,null,null,null,null,null,null,null,null,null,null,null,null,null,null,null,null,null,null,null,null,null,null,null,null,null,null,null,null,null,null,null,"N/A","N/A","N/A","N/A","N/A","N/A","N/A","N/A","N/A",1,1,1,1,1,1,1,1,1]
[null,null,null,null,null,null,null,null,null,null,null,null,null,null,null,null,null,null,null,null,null,null,null,null,null,null,null,null,null,null,null,null,null,null,"N/A","N/A","N/A","N/A","N/A","N/A","N/A","N/A","N/A",1,1,1,1,1,1,1,1,1]
[null,null,null,null,null,null,null,null,null,null,null,null,null,null,null,null,null,null,null,null,null,null,null,null,null,null,null,null,null,null,null,null,null,null,"N/A","N/A","N/A","N/A","N/A","N/A","N/A","N/A","N/A",1,1,1,1,1,1,1,1,1]
[null,null,null,null,null,null,null,null,null,null,null,null,null,null,null,null,null,null,null,null,null,null,null,null,null,null,null,null,null,null,null,null,null,null,"N/A","N/A","N/A","N/A","N/A","N/A","N/A","N/A","N/A",1,1,1,1,1,1,1,1,1]
[null,null,null,null,null,null,null,null,null,null,null,null,null,null,null,null,null,null,null,null,null,null,null,null,null,null,null,null,null,null,null,null,null,null,"N/A","N/A","N/A","N/A","N/A","N/A","N/A","N/A","N/A",1,1,1,1,1,1,1,1,1]
[null,null,null,null,null,null,null,null,null,null,null,null,null,null,null,null,null,null,null,null,null,null,null,null,null,null,null,null,null,null,null,null,null,null,"N/A","N/A","N/A","N/A","N/A","N/A","N/A","N/A","N/A",1,1,1,1,1,1,1,1,1]
[null,null,null,null,null,null,null,null,null,null,null,null,null,null,null,null,null,null,null,null,null,null,null,null,null,null,null,null,null,null,null,null,null,null,"N/A","N/A","N/A","N/A","N/A","N/A","N/A","N/A","N/A",1,1,1,1,1,1,1,1,1]
[null,null,null,null,null,null,null,null,null,null,null,null,null,null,null,null,null,null,null,null,null,null,null,null,null,null,null,null,null,null,null,null,null,null,"N/A","N/A","N/A","N/A","N/A","N/A","N/A","N/A","N/A",1,1,1,1,1,1,1,1,1]
[null,null,null,null,null,null,null,null,null,null,null,null,null,null,null,null,null,null,null,null,null,null,null,null,null,null,null,null,null,null,null,null,null,null,"N/A","N/A","N/A","N/A","N/A","N/A","N/A","N/A","N/A",1,1,1,1,1,1,1,1,1]
[null,null,null,null,null,null,null,null,null,null,null,null,null,null,null,null,null,null,null,null,null,null,null,null,null,null,null,null,null,null,null,null,null,null,"N/A","N/A","N/A","N/A","N/A","N/A","N/A","N/A","N/A",1,1,1,1,1,1,1,1,1]
[null,null,null,null,null,null,null,null,null,null,null,null,null,null,null,null,null,null,null,null,null,null,null,null,null,null,null,null,null,null,null,null,null,null,"N/A","N/A","N/A","N/A","N/A","N/A","N/A","N/A","N/A",1,1,1,1,1,1,1,1,1]
[null,null,null,null,null,null,null,null,null,null,null,null,null,null,null,null,null,null,null,null,null,null,null,null,null,null,null,null,null,null,null,null,null,null,"N/A","N/A","N/A","N/A","N/A","N/A","N/A","N/A","N/A",1,1,1,1,1,1,1,1,1]
[null,null,null,null,null,null,null,null,null,null,null,null,null,null,null,null,null,null,null,null,null,null,null,null,null,null,null,null,null,null,null,null,null,null,"N/A","N/A","N/A","N/A","N/A","N/A","N/A","N/A","N/A",1,1,1,1,1,1,1,1,1]
[null,null,null,null,null,null,null,null,null,null,null,null,null,null,null,null,null,null,null,null,null,null,null,null,null,null,null,null,null,null,null,null,null,null,"N/A","N/A","N/A","N/A","N/A","N/A","N/A","N/A","N/A",1,1,1,1,1,1,1,1,1]
[null,null,null,null,null,null,null,null,null,null,null,null,null,null,null,null,null,null,null,null,null,null,null,null,null,null,null,null,null,null,null,null,null,null,"N/A","N/A","N/A","N/A","N/A","N/A","N/A","N/A","N/A",1,1,1,1,1,1,1,1,1]
[null,null,null,null,null,null,null,null,null,null,null,null,null,null,null,null,null,null,null,null,null,null,null,null,null,null,null,null,null,null,null,null,null,null,"N/A","N/A","N/A","N/A","N/A","N/A","N/A","N/A","N/A",1,1,1,1,1,1,1,1,1]
[null,null,null,null,null,null,null,null,null,null,null,null,null,null,null,null,null,null,null,null,null,null,null,null,null,null,null,null,null,null,null,null,null,null,"N/A","N/A","N/A","N/A","N/A","N/A","N/A","N/A","N/A",1,1,1,1,1,1,1,1,1]
[null,null,null,null,null,null,null,null,null,null,null,null,null,null,null,null,null,null,null,null,null,null,null,null,null,null,null,null,null,null,null,null,null,null,"N/A","N/A","N/A","N/A","N/A","N/A","N/A","N/A","N/A",1,1,1,1,1,1,1,1,1]
[null,null,null,null,null,null,null,null,null,null,null,null,null,null,null,null,null,null,null,null,null,null,null,null,null,null,null,null,null,null,null,null,null,null,"N/A","N/A","N/A","N/A","N/A","N/A","N/A","N/A","N/A",1,1,1,1,{"$f":"IF(AM984=\"N/A\",1,\"\")","v":1},1,1,1,1]
[null,null,null,null,null,null,null,null,null,null,null,null,null,null,null,null,null,null,null,null,null,null,null,null,null,null,null,null,null,null,null,null,null,null,"N/A","N/A","N/A","N/A","N/A","N/A","N/A","N/A","N/A",{"$f":"IF(AI985=\"N/A\",1,\"\")","v":1},1,1,1,1,1,1,1,1]
[null,null,null,null,null,null,null,null,null,null,null,null,null,null,null,null,null,null,null,null,null,null,null,null,null,null,null,null,null,null,null,null,null,null,"N/A","N/A","N/A","N/A","N/A","N/A","N/A","N/A","N/A",1,1,1,1,1,1,1,1,1]
[null,null,null,null,null,null,null,null,null,null,null,null,null,null,null,null,null,null,null,null,null,null,null,null,null,null,null,null,null,null,null,null,null,null,"N/A","N/A","N/A","N/A","N/A","N/A","N/A","N/A","N/A",1,1,1,1,1,1,1,1,1]
[null,null,null,null,null,null,null,null,null,null,null,null,null,null,null,null,null,null,null,null,null,null,null,null,null,null,null,null,null,null,null,null,null,null,"N/A","N/A","N/A","N/A","N/A","N/A","N/A","N/A","N/A",1,1,1,1,1,1,1,1,1]
[null,null,null,null,null,null,null,null,null,null,null,null,null,null,null,null,null,null,null,null,null,null,null,null,null,null,null,null,null,null,null,null,null,null,"N/A","N/A","N/A","N/A","N/A","N/A","N/A","N/A","N/A",1,1,1,1,1,1,1,1,1]
[null,null,null,null,null,null,null,null,null,null,null,null,null,null,null,null,null,null,null,null,null,null,null,null,null,null,null,null,null,null,null,null,null,null,"N/A","N/A","N/A","N/A","N/A","N/A","N/A","N/A","N/A",1,1,1,1,1,1,1,1,1]
[null,null,null,null,null,null,null,null,null,null,null,null,null,null,null,null,null,null,null,null,null,null,null,null,null,null,null,null,null,null,null,null,null,null,"N/A","N/A","N/A","N/A","N/A","N/A","N/A","N/A","N/A",1,1,1,1,1,1,1,1,1]
[null,null,null,null,null,null,null,null,null,null,null,null,null,null,null,null,null,null,null,null,null,null,null,null,null,null,null,null,null,null,null,null,null,null,"N/A","N/A","N/A","N/A","N/A","N/A","N/A","N/A","N/A",1,1,1,1,1,1,1,1,1]
[null,null,null,null,null,null,null,null,null,null,null,null,null,null,null,null,null,null,null,null,null,null,null,null,null,null,null,null,null,null,null,null,null,null,"N/A","N/A","N/A","N/A","N/A","N/A","N/A","N/A","N/A",1,1,1,1,1,1,1,1,1]
[null,null,null,null,null,null,null,null,null,null,null,null,null,null,null,null,null,null,null,null,null,null,null,null,null,null,null,null,null,null,null,null,null,null,"N/A","N/A","N/A","N/A","N/A","N/A","N/A","N/A","N/A",1,1,1,1,1,1,1,1,1]
[null,null,null,null,null,null,null,null,null,null,null,null,null,null,null,null,null,null,null,null,null,null,null,null,null,null,null,null,null,null,null,null,null,null,"N/A","N/A","N/A","N/A","N/A","N/A","N/A","N/A","N/A",1,1,1,1,1,1,1,1,1]
[null,null,null,null,null,null,null,null,null,null,null,null,null,null,null,null,null,null,null,null,null,null,null,null,null,null,null,null,null,null,null,null,null,null,{"$f":"IF(COUNTA(E996:G996)>0,(COUNTIF(E996:G996,\"=0\")*0+COUNTIF(E996:G996,\"=1\")*100+COUNTIF(E996:G996,\"=2\")*80+COUNTIF(E996:G996,\"=3\")*50+COUNTIF(E996:G996,\"=8\")*20+COUNTIF(E996:G996,\"=9\")*0)/COUNTA(E996:G996)/100,\"N/A\")","v":"N/A"},{"$f":"IF(COUNTA(H996:J996)>0,(COUNTIF(H996:J996,\"=0\")*0+COUNTIF(H996:J996,\"=1\")*100+COUNTIF(H996:J996,\"=2\")*80+COUNTIF(H996:J996,\"=3\")*50+COUNTIF(H996:J996,\"=8\")*20+COUNTIF(H996:J996,\"=9\")*0)/COUNTA(H996:J996)/100,\"N/A\")","v":"N/A"},{"$f":"IF(COUNTA(K996:M996)>0,(COUNTIF(K996:M996,\"=0\")*0+COUNTIF(K996:M996,\"=1\")*100+COUNTIF(K996:M996,\"=2\")*80+COUNTIF(K996:M996,\"=3\")*50+COUNTIF(K996:M996,\"=8\")*20+COUNTIF(K996:M996,\"=9\")*0)/COUNTA(K996:M996)/100,\"N/A\")","v":"N/A"},{"$f":"IF(COUNTA(N996:V996)>0,(COUNTIF(N996:V996,\"=0\")*0+COUNTIF(N996:V996,\"=1\")*100+COUNTIF(N996:V996,\"=2\")*80+COUNTIF(N996:V996,\"=3\")*50+COUNTIF(N996:V996,\"=8\")*20+COUNTIF(N996:V996,\"=9\")*0)/COUNTA(N996:V996)/100,\"N/A\")","v":"N/A"},{"$f":"IF(COUNTA(W996:AA996)>0,(COUNTIF(W996:AA996,\"=0\")*0+COUNTIF(W996:AA996,\"=1\")*100+COUNTIF(W996:AA996,\"=2\")*80+COUNTIF(W996:AA996,\"=3\")*50+COUNTIF(W996:AA996,\"=8\")*20+COUNTIF(W996:AA996,\"=9\")*0)/COUNTA(W996:AA996)/100,\"N/A\")","v":"N/A"},{"$f":"IF(COUNTA(AB996:AC996)>0,(COUNTIF(AB996:AC996,\"=0\")*0+COUNTIF(AB996:AC996,\"=1\")*100+COUNTIF(AB996:AC996,\"=2\")*80+COUNTIF(AB996:AC996,\"=3\")*50+COUNTIF(AB996:AC996,\"=8\")*20+COUNTIF(AB996:AC996,\"=9\")*0)/COUNTA(AB996:AC996)/100,\"N/A\")","v":"N/A"},{"$f":"IF(COUNTA((AD996:AF996))>0,(COUNTIF((AD996:AF996),\"=0\")*0+COUNTIF((AD996:AF996),\"=1\")*100+COUNTIF((AD996:AF996),\"=2\")*80+COUNTIF((AD996:AF996),\"=3\")*50+COUNTIF((AD996:AF996),\"=8\")*20+COUNTIF((AD996:AF996),\"=9\")*0)/COUNTA((AD996:AF996))/100,\"N/A\")","v":"N/A"},{"$f":"IF(COUNTA(AG996:AH996)>0,(COUNTIF(AG996:AH996,\"=0\")*0+COUNTIF(AG996:AH996,\"=1\")*100+COUNTIF(AG996:AH996,\"=2\")*80+COUNTIF(AG996:AH996,\"=3\")*50+COUNTIF(AG996:AH996,\"=8\")*20+COUNTIF(AG996:AH996,\"=9\")*0)/COUNTA(AG996:AH996)/100,\"N/A\")","v":"N/A"},{"$f":"IF(AND(COUNTA(E996:AH996)<>0,B996<>\"\"),AVERAGE(AL996:AP996,AI996),\"N/A\")","v":"N/A"},1,1,1,1,1,1,1,1,1]
[null,null,null,null,null,null,null,null,null,null,null,null,null,null,null,null,null,null,null,null,null,null,null,null,null,null,null,null,null,null,null,null,null,null,"N/A","N/A","N/A","N/A","N/A","N/A","N/A","N/A","N/A",1,1,1,1,1,1,1,1,1]
[null,null,null,null,null,null,null,null,null,null,null,null,null,null,null,null,null,null,null,null,null,null,null,null,null,null,null,null,null,null,null,null,null,null,"N/A","N/A","N/A","N/A","N/A","N/A","N/A","N/A","N/A",1,1,1,1,1,1,1,1,1]
[null,null,null,null,null,null,null,null,null,null,null,null,null,null,null,null,null,null,null,null,null,null,null,null,null,null,null,null,null,null,null,null,null,null,"N/A","N/A","N/A","N/A","N/A","N/A","N/A","N/A","N/A",1,1,1,1,1,1,1,1,1]
[null,null,null,null,null,null,null,null,null,null,null,null,null,null,null,null,null,null,null,null,null,null,null,null,null,null,null,null,null,null,null,null,null,null,"N/A","N/A","N/A","N/A","N/A","N/A","N/A","N/A","N/A",1,1,1,1,1,1,1,1,1]
[null,null,null,null,null,null,null,null,null,null,null,null,null,null,null,null,null,null,null,null,null,null,null,null,null,null,null,null,null,null,null,null,null,null,"N/A","N/A","N/A","N/A","N/A","N/A","N/A","N/A","N/A",1,1,1,1,1,1,1,1,1]
[null,null,null,null,null,null,null,null,null,null,null,null,null,null,null,null,null,null,null,null,null,null,null,null,null,null,null,null,null,null,null,null,null,null,"N/A","N/A","N/A","N/A","N/A","N/A","N/A","N/A","N/A",1,1,1,1,1,1,1,1,1]
[null,null,null,null,null,null,null,null,null,null,null,null,null,null,null,null,null,null,null,null,null,null,null,null,null,null,null,null,null,null,null,null,null,null,"N/A","N/A","N/A","N/A","N/A","N/A","N/A","N/A","N/A",1,1,1,1,1,1,1,1,1]
[null,null,null,null,null,null,null,null,null,null,null,null,null,null,null,null,null,null,null,null,null,null,null,null,null,null,null,null,null,null,null,null,null,null,"N/A","N/A","N/A","N/A","N/A","N/A","N/A","N/A","N/A",1,1,1,1,1,1,1,1,1]
[null,null,null,null,null,null,null,null,null,null,null,null,null,null,null,null,null,null,null,null,null,null,null,null,null,null,null,null,null,null,null,null,null,null,{"$f":"IF(COUNTA(E1005:G1005)>0,(COUNTIF(E1005:G1005,\"=0\")*0+COUNTIF(E1005:G1005,\"=1\")*100+COUNTIF(E1005:G1005,\"=2\")*80+COUNTIF(E1005:G1005,\"=3\")*50+COUNTIF(E1005:G1005,\"=8\")*20+COUNTIF(E1005:G1005,\"=9\")*0)/COUNTA(E1005:G1005)/100,\"N/A\")","v":"N/A"},{"$f":"IF(COUNTA(H1005:J1005)>0,(COUNTIF(H1005:J1005,\"=0\")*0+COUNTIF(H1005:J1005,\"=1\")*100+COUNTIF(H1005:J1005,\"=2\")*80+COUNTIF(H1005:J1005,\"=3\")*50+COUNTIF(H1005:J1005,\"=8\")*20+COUNTIF(H1005:J1005,\"=9\")*0)/COUNTA(H1005:J1005)/100,\"N/A\")","v":"N/A"},{"$f":"IF(COUNTA(K1005:M1005)>0,(COUNTIF(K1005:M1005,\"=0\")*0+COUNTIF(K1005:M1005,\"=1\")*100+COUNTIF(K1005:M1005,\"=2\")*80+COUNTIF(K1005:M1005,\"=3\")*50+COUNTIF(K1005:M1005,\"=8\")*20+COUNTIF(K1005:M1005,\"=9\")*0)/COUNTA(K1005:M1005)/100,\"N/A\")","v":"N/A"},{"$f":"IF(COUNTA(N1005:V1005)>0,(COUNTIF(N1005:V1005,\"=0\")*0+COUNTIF(N1005:V1005,\"=1\")*100+COUNTIF(N1005:V1005,\"=2\")*80+COUNTIF(N1005:V1005,\"=3\")*50+COUNTIF(N1005:V1005,\"=8\")*20+COUNTIF(N1005:V1005,\"=9\")*0)/COUNTA(N1005:V1005)/100,\"N/A\")","v":"N/A"},{"$f":"IF(COUNTA(W1005:AA1005)>0,(COUNTIF(W1005:AA1005,\"=0\")*0+COUNTIF(W1005:AA1005,\"=1\")*100+COUNTIF(W1005:AA1005,\"=2\")*80+COUNTIF(W1005:AA1005,\"=3\")*50+COUNTIF(W1005:AA1005,\"=8\")*20+COUNTIF(W1005:AA1005,\"=9\")*0)/COUNTA(W1005:AA1005)/100,\"N/A\")","v":"N/A"},{"$f":"IF(COUNTA(AB1005:AC1005)>0,(COUNTIF(AB1005:AC1005,\"=0\")*0+COUNTIF(AB1005:AC1005,\"=1\")*100+COUNTIF(AB1005:AC1005,\"=2\")*80+COUNTIF(AB1005:AC1005,\"=3\")*50+COUNTIF(AB1005:AC1005,\"=8\")*20+COUNTIF(AB1005:AC1005,\"=9\")*0)/COUNTA(AB1005:AC1005)/100,\"N/A\")","v":"N/A"},{"$f":"IF(COUNTA((AD1005:AF1005))>0,(COUNTIF((AD1005:AF1005),\"=0\")*0+COUNTIF((AD1005:AF1005),\"=1\")*100+COUNTIF((AD1005:AF1005),\"=2\")*80+COUNTIF((AD1005:AF1005),\"=3\")*50+COUNTIF((AD1005:AF1005),\"=8\")*20+COUNTIF((AD1005:AF1005),\"=9\")*0)/COUNTA((AD1005:AF1005))/100,\"N/A\")","v":"N/A"},{"$f":"IF(COUNTA(AG1005:AH1005)>0,(COUNTIF(AG1005:AH1005,\"=0\")*0+COUNTIF(AG1005:AH1005,\"=1\")*100+COUNTIF(AG1005:AH1005,\"=2\")*80+COUNTIF(AG1005:AH1005,\"=3\")*50+COUNTIF(AG1005:AH1005,\"=8\")*20+COUNTIF(AG1005:AH1005,\"=9\")*0)/COUNTA(AG1005:AH1005)/100,\"N/A\")","v":"N/A"},{"$f":"IF(AND(COUNTA(E1005:AH1005)<>0,B1005<>\"\"),AVERAGE(AL1005:AP1005,AI1005),\"N/A\")","v":"N/A"},1,1,{"$f":"IF(AK1005=\"N/A\",1,\"\")","v":1},{"$f":"IF(AL1005=\"N/A\",1,\"\")","v":1},{"$f":"IF(AM1005=\"N/A\",1,\"\")","v":1},{"$f":"IF(AN1005=\"N/A\",1,\"\")","v":1},{"$f":"IF(AO1005=\"N/A\",1,\"\")","v":1},1,1]
[null,null,null,null,null,null,null,null,null,null,null,null,null,null,null,null,null,null,null,null,null,null,null,null,null,null,null,null,null,null,null,null,null,null,{"$f":"IF(COUNTA(E1006:G1006)>0,(COUNTIF(E1006:G1006,\"=0\")*0+COUNTIF(E1006:G1006,\"=1\")*100+COUNTIF(E1006:G1006,\"=2\")*80+COUNTIF(E1006:G1006,\"=3\")*50+COUNTIF(E1006:G1006,\"=8\")*20+COUNTIF(E1006:G1006,\"=9\")*0)/COUNTA(E1006:G1006)/100,\"N/A\")","v":"N/A"},{"$f":"IF(COUNTA(H1006:J1006)>0,(COUNTIF(H1006:J1006,\"=0\")*0+COUNTIF(H1006:J1006,\"=1\")*100+COUNTIF(H1006:J1006,\"=2\")*80+COUNTIF(H1006:J1006,\"=3\")*50+COUNTIF(H1006:J1006,\"=8\")*20+COUNTIF(H1006:J1006,\"=9\")*0)/COUNTA(H1006:J1006)/100,\"N/A\")","v":"N/A"},{"$f":"IF(COUNTA(K1006:M1006)>0,(COUNTIF(K1006:M1006,\"=0\")*0+COUNTIF(K1006:M1006,\"=1\")*100+COUNTIF(K1006:M1006,\"=2\")*80+COUNTIF(K1006:M1006,\"=3\")*50+COUNTIF(K1006:M1006,\"=8\")*20+COUNTIF(K1006:M1006,\"=9\")*0)/COUNTA(K1006:M1006)/100,\"N/A\")","v":"N/A"},{"$f":"IF(COUNTA(N1006:V1006)>0,(COUNTIF(N1006:V1006,\"=0\")*0+COUNTIF(N1006:V1006,\"=1\")*100+COUNTIF(N1006:V1006,\"=2\")*80+COUNTIF(N1006:V1006,\"=3\")*50+COUNTIF(N1006:V1006,\"=8\")*20+COUNTIF(N1006:V1006,\"=9\")*0)/COUNTA(N1006:V1006)/100,\"N/A\")","v":"N/A"},{"$f":"IF(COUNTA(W1006:AA1006)>0,(COUNTIF(W1006:AA1006,\"=0\")*0+COUNTIF(W1006:AA1006,\"=1\")*100+COUNTIF(W1006:AA1006,\"=2\")*80+COUNTIF(W1006:AA1006,\"=3\")*50+COUNTIF(W1006:AA1006,\"=8\")*20+COUNTIF(W1006:AA1006,\"=9\")*0)/COUNTA(W1006:AA1006)/100,\"N/A\")","v":"N/A"},{"$f":"IF(COUNTA(AB1006:AC1006)>0,(COUNTIF(AB1006:AC1006,\"=0\")*0+COUNTIF(AB1006:AC1006,\"=1\")*100+COUNTIF(AB1006:AC1006,\"=2\")*80+COUNTIF(AB1006:AC1006,\"=3\")*50+COUNTIF(AB1006:AC1006,\"=8\")*20+COUNTIF(AB1006:AC1006,\"=9\")*0)/COUNTA(AB1006:AC1006)/100,\"N/A\")","v":"N/A"},{"$f":"IF(COUNTA((AD1006:AF1006))>0,(COUNTIF((AD1006:AF1006),\"=0\")*0+COUNTIF((AD1006:AF1006),\"=1\")*100+COUNTIF((AD1006:AF1006),\"=2\")*80+COUNTIF((AD1006:AF1006),\"=3\")*50+COUNTIF((AD1006:AF1006),\"=8\")*20+COUNTIF((AD1006:AF1006),\"=9\")*0)/COUNTA((AD1006:AF1006))/100,\"N/A\")","v":"N/A"},{"$f":"IF(COUNTA(AG1006:AH1006)>0,(COUNTIF(AG1006:AH1006,\"=0\")*0+COUNTIF(AG1006:AH1006,\"=1\")*100+COUNTIF(AG1006:AH1006,\"=2\")*80+COUNTIF(AG1006:AH1006,\"=3\")*50+COUNTIF(AG1006:AH1006,\"=8\")*20+COUNTIF(AG1006:AH1006,\"=9\")*0)/COUNTA(AG1006:AH1006)/100,\"N/A\")","v":"N/A"},{"$f":"IF(AND(COUNTA(E1006:AH1006)<>0,B1006<>\"\"),AVERAGE(AL1006:AP1006,AI1006),\"N/A\")","v":"N/A"},1,1,1,1,1,1,1,1,1]
[null,null,null,null,null,null,null,null,null,null,null,null,null,null,null,null,null,null,null,null,null,null,null,null,null,null,null,null,null,null,null,null,null,null,"N/A","N/A","N/A","N/A","N/A","N/A","N/A","N/A","N/A",1,1,1,1,1,1,1,1,1]
[null,null,null,null,null,null,null,null,null,null,null,null,null,null,null,null,null,null,null,null,null,null,null,null,null,null,null,null,null,null,null,null,null,null,"N/A","N/A","N/A","N/A","N/A","N/A","N/A","N/A","N/A",1,1,1,1,1,1,1,1,1]
[null,null,null,null,null,null,null,null,null,null,null,null,null,null,null,null,null,null,null,null,null,null,null,null,null,null,null,null,null,null,null,null,null,null,"N/A","N/A","N/A","N/A","N/A","N/A","N/A","N/A","N/A",1,1,1,1,1,1,1,1,1]
[null,null,null,null,null,null,null,null,null,null,null,null,null,null,null,null,null,null,null,null,null,null,null,null,null,null,null,null,null,null,null,null,null,null,"N/A","N/A","N/A","N/A","N/A","N/A","N/A","N/A","N/A",1,1,1,1,1,1,1,1,1]
[null,null,null,null,null,null,null,null,null,null,null,null,null,null,null,null,null,null,null,null,null,null,null,null,null,null,null,null,null,null,null,null,null,null,"N/A","N/A","N/A","N/A","N/A","N/A","N/A","N/A","N/A",1,1,1,1,1,1,1,1,1]
[null,null,null,null,null,null,null,null,null,null,null,null,null,null,null,null,null,null,null,null,null,null,null,null,null,null,null,null,null,null,null,null,null,null,"N/A","N/A","N/A","N/A","N/A","N/A","N/A","N/A","N/A",1,1,1,1,1,1,1,1,1]
[null,null,null,null,null,null,null,null,null,null,null,null,null,null,null,null,null,null,null,null,null,null,null,null,null,null,null,null,null,null,null,null,null,null,"N/A","N/A","N/A","N/A","N/A","N/A","N/A","N/A","N/A",1,1,1,1,1,1,1,1,1]
[null,null,null,null,null,null,null,null,null,null,null,null,null,null,null,null,null,null,null,null,null,null,null,null,null,null,null,null,null,null,null,null,null,null,"N/A","N/A","N/A","N/A","N/A","N/A","N/A","N/A","N/A",1,1,1,1,1,1,1,1,1]
[null,null,null,null,null,null,null,null,null,null,null,null,null,null,null,null,null,null,null,null,null,null,null,null,null,null,null,null,null,null,null,null,null,null,"N/A","N/A","N/A","N/A","N/A","N/A","N/A","N/A","N/A",1,1,1,1,1,1,1,1,1]
[null,null,null,null,null,null,null,null,null,null,null,null,null,null,null,null,null,null,null,null,null,null,null,null,null,null,null,null,null,null,null,null,null,null,"N/A","N/A","N/A","N/A","N/A","N/A","N/A","N/A","N/A",1,1,1,1,1,1,1,1,1]
[null,null,null,null,null,null,null,null,null,null,null,null,null,null,null,null,null,null,null,null,null,null,null,null,null,null,null,null,null,null,null,null,null,null,"N/A","N/A","N/A","N/A","N/A","N/A","N/A","N/A","N/A",1,1,1,1,1,1,1,1,1]
[null,null,null,null,null,null,null,null,null,null,null,null,null,null,null,null,null,null,null,null,null,null,null,null,null,null,null,null,null,null,null,null,null,null,"N/A","N/A","N/A","N/A","N/A","N/A","N/A","N/A","N/A",1,1,1,1,1,1,1,1,1]
[null,null,null,null,null,null,null,null,null,null,null,null,null,null,null,null,null,null,null,null,null,null,null,null,null,null,null,null,null,null,null,null,null,null,"N/A","N/A","N/A","N/A","N/A","N/A","N/A","N/A","N/A",1,1,1,1,1,1,1,1,1]
[null,null,null,null,null,null,null,null,null,null,null,null,null,null,null,null,null,null,null,null,null,null,null,null,null,null,null,null,null,null,null,null,null,null,"N/A","N/A","N/A","N/A","N/A","N/A","N/A","N/A","N/A",1,1,1,1,1,1,1,1,1]
[null,null,null,null,null,null,null,null,null,null,null,null,null,null,null,null,null,null,null,null,null,null,null,null,null,null,null,null,null,null,null,null,null,null,"N/A","N/A","N/A","N/A","N/A","N/A","N/A","N/A","N/A",1,1,1,1,1,1,1,1,1]
[null,null,null,null,null,null,null,null,null,null,null,null,null,null,null,null,null,null,null,null,null,null,null,null,null,null,null,null,null,null,null,null,null,null,"N/A","N/A","N/A","N/A","N/A","N/A","N/A","N/A","N/A",1,1,1,1,1,1,1,1,1]
[null,null,null,null,null,null,null,null,null,null,null,null,null,null,null,null,null,null,null,null,null,null,null,null,null,null,null,null,null,null,null,null,null,null,"N/A","N/A","N/A","N/A","N/A","N/A","N/A","N/A","N/A",1,1,1,1,1,1,1,1,1]
[null,null,null,null,null,null,null,null,null,null,null,null,null,null,null,null,null,null,null,null,null,null,null,null,null,null,null,null,null,null,null,null,null,null,"N/A","N/A","N/A","N/A","N/A","N/A","N/A","N/A","N/A",1,1,1,1,1,1,1,1,1]
[null,null,null,null,null,null,null,null,null,null,null,null,null,null,null,null,null,null,null,null,null,null,null,null,null,null,null,null,null,null,null,null,null,null,"N/A","N/A","N/A","N/A","N/A","N/A","N/A","N/A","N/A",1,1,1,1,1,1,1,1,1]
[null,null,null,null,null,null,null,null,null,null,null,null,null,null,null,null,null,null,null,null,null,null,null,null,null,null,null,null,null,null,null,null,null,null,"N/A","N/A","N/A","N/A","N/A","N/A","N/A","N/A","N/A",1,1,1,1,1,1,1,1,1]
[null,null,null,null,null,null,null,null,null,null,null,null,null,null,null,null,null,null,null,null,null,null,null,null,null,null,null,null,null,null,null,null,null,null,"N/A","N/A","N/A","N/A","N/A","N/A","N/A","N/A","N/A",1,1,1,1,1,1,1,1,1]
[null,null,null,null,null,null,null,null,null,null,null,null,null,null,null,null,null,null,null,null,null,null,null,null,null,null,null,null,null,null,null,null,null,null,"N/A","N/A","N/A","N/A","N/A","N/A","N/A","N/A","N/A",1,1,1,1,1,1,1,1,1]
[null,null,null,null,null,null,null,null,null,null,null,null,null,null,null,null,null,null,null,null,null,null,null,null,null,null,null,null,null,null,null,null,null,null,"N/A","N/A","N/A","N/A","N/A","N/A","N/A","N/A","N/A",1,1,1,1,1,1,1,1,1]
[null,null,null,null,null,null,null,null,null,null,null,null,null,null,null,null,null,null,null,null,null,null,null,null,null,null,null,null,null,null,null,null,null,null,"N/A","N/A","N/A","N/A","N/A","N/A","N/A","N/A","N/A",1,1,1,1,1,{"$f":"IF(AN1030=\"N/A\",1,\"\")","v":1},1,1,1]
[null,null,null,null,null,null,null,null,null,null,null,null,null,null,null,null,null,null,null,null,null,null,null,null,null,null,null,null,null,null,null,null,null,null,"N/A","N/A","N/A","N/A","N/A","N/A","N/A","N/A","N/A",{"$f":"IF(AI1031=\"N/A\",1,\"\")","v":1},1,1,1,1,1,1,1,1]
[null,null,null,null,null,null,null,null,null,null,null,null,null,null,null,null,null,null,null,null,null,null,null,null,null,null,null,null,null,null,null,null,null,null,"N/A","N/A","N/A","N/A","N/A","N/A","N/A","N/A","N/A",1,1,1,1,1,1,1,1,1]
[null,null,null,null,null,null,null,null,null,null,null,null,null,null,null,null,null,null,null,null,null,null,null,null,null,null,null,null,null,null,null,null,null,null,"N/A","N/A","N/A","N/A","N/A","N/A","N/A","N/A","N/A",1,1,1,1,1,1,1,1,1]
[null,null,null,null,null,null,null,null,null,null,null,null,null,null,null,null,null,null,null,null,null,null,null,null,null,null,null,null,null,null,null,null,null,null,"N/A","N/A","N/A","N/A","N/A","N/A","N/A","N/A","N/A",1,1,1,1,1,1,1,1,1]
[null,null,null,null,null,null,null,null,null,null,null,null,null,null,null,null,null,null,null,null,null,null,null,null,null,null,null,null,null,null,null,null,null,null,"N/A","N/A","N/A","N/A","N/A","N/A","N/A","N/A","N/A",1,1,1,1,1,1,1,1,1]
[null,null,null,null,null,null,null,null,null,null,null,null,null,null,null,null,null,null,null,null,null,null,null,null,null,null,null,null,null,null,null,null,null,null,"N/A","N/A","N/A","N/A","N/A","N/A","N/A","N/A","N/A",1,1,1,1,1,1,1,1,1]
[null,null,null,null,null,null,null,null,null,null,null,null,null,null,null,null,null,null,null,null,null,null,null,null,null,null,null,null,null,null,null,null,null,null,"N/A","N/A","N/A","N/A","N/A","N/A","N/A","N/A","N/A",1,1,1,1,1,1,1,1,1]
[null,null,null,null,null,null,null,null,null,null,null,null,null,null,null,null,null,null,null,null,null,null,null,null,null,null,null,null,null,null,null,null,null,null,"N/A","N/A","N/A","N/A","N/A","N/A","N/A","N/A","N/A",1,1,1,1,1,1,1,1,1]
[null,null,null,null,null,null,null,null,null,null,null,null,null,null,null,null,null,null,null,null,null,null,null,null,null,null,null,null,null,null,null,null,null,null,"N/A","N/A","N/A","N/A","N/A","N/A","N/A","N/A","N/A",1,1,1,1,1,1,1,1,1]
[null,null,null,null,null,null,null,null,null,null,null,null,null,null,null,null,null,null,null,null,null,null,null,null,null,null,null,null,null,null,null,null,null,null,"N/A","N/A","N/A","N/A","N/A","N/A","N/A","N/A","N/A",1,1,1,1,1,1,1,1,1]
[null,null,null,null,null,null,null,null,null,null,null,null,null,null,null,null,null,null,null,null,null,null,null,null,null,null,null,null,null,null,null,null,null,null,"N/A","N/A","N/A","N/A","N/A","N/A","N/A","N/A","N/A",1,1,1,1,1,1,1,1,1]
[null,null,null,null,null,null,null,null,null,null,null,null,null,null,null,null,null,null,null,null,null,null,null,null,null,null,null,null,null,null,null,null,null,null,"N/A","N/A","N/A","N/A","N/A","N/A","N/A","N/A","N/A",1,1,1,1,1,1,1,1,1]
[null,null,null,null,null,null,null,null,null,null,null,null,null,null,null,null,null,null,null,null,null,null,null,null,null,null,null,null,null,null,null,null,null,null,"N/A","N/A","N/A","N/A","N/A","N/A","N/A","N/A","N/A",1,1,1,1,1,1,1,1,1]
[null,null,null,null,null,null,null,null,null,null,null,null,null,null,null,null,null,null,null,null,null,null,null,null,null,null,null,null,null,null,null,null,null,null,"N/A","N/A","N/A","N/A","N/A","N/A","N/A","N/A","N/A",1,1,1,1,1,1,1,1,1]
[null,null,null,null,null,null,null,null,null,null,null,null,null,null,null,null,null,null,null,null,null,null,null,null,null,null,null,null,null,null,null,null,null,null,"N/A","N/A","N/A","N/A","N/A","N/A","N/A","N/A","N/A",1,1,1,1,1,1,1,1,1]
[null,null,null,null,null,null,null,null,null,null,null,null,null,null,null,null,null,null,null,null,null,null,null,null,null,null,null,null,null,null,null,null,null,null,"N/A","N/A","N/A","N/A","N/A","N/A","N/A","N/A","N/A",1,1,1,1,1,1,1,1,1]
[null,null,null,null,null,null,null,null,null,null,null,null,null,null,null,null,null,null,null,null,null,null,null,null,null,null,null,null,null,null,null,null,null,null,"N/A","N/A","N/A","N/A","N/A","N/A","N/A","N/A","N/A",1,1,1,1,1,1,1,1,1]
[null,null,null,null,null,null,null,null,null,null,null,null,null,null,null,null,null,null,null,null,null,null,null,null,null,null,null,null,null,null,null,null,null,null,"N/A","N/A","N/A","N/A","N/A","N/A","N/A","N/A","N/A",1,1,1,1,1,1,1,1,1]
[null,null,null,null,null,null,null,null,null,null,null,null,null,null,null,null,null,null,null,null,null,null,null,null,null,null,null,null,null,null,null,null,null,null,"N/A","N/A","N/A","N/A","N/A","N/A","N/A","N/A","N/A",1,1,1,1,1,1,1,1,1]
[null,null,null,null,null,null,null,null,null,null,null,null,null,null,null,null,null,null,null,null,null,null,null,null,null,null,null,null,null,null,null,null,null,null,"N/A","N/A","N/A","N/A","N/A","N/A","N/A","N/A","N/A",1,1,1,1,1,1,1,1,1]
[null,null,null,null,null,null,null,null,null,null,null,null,null,null,null,null,null,null,null,null,null,null,null,null,null,null,null,null,null,null,null,null,null,null,"N/A","N/A","N/A","N/A","N/A","N/A","N/A","N/A","N/A",1,1,1,1,1,1,1,1,1]
[null,null,null,null,null,null,null,null,null,null,null,null,null,null,null,null,null,null,null,null,null,null,null,null,null,null,null,null,null,null,null,null,null,null,"N/A","N/A","N/A","N/A","N/A","N/A","N/A","N/A","N/A",1,1,1,1,1,1,1,1,1]
[null,null,null,null,null,null,null,null,null,null,null,null,null,null,null,null,null,null,null,null,null,null,null,null,null,null,null,null,null,null,null,null,null,null,"N/A","N/A","N/A","N/A","N/A","N/A","N/A","N/A","N/A",1,1,1,1,1,1,1,{"$f":"IF(AP1053=\"N/A\",1,\"\")","v":1},1]
[null,null,null,null,null,null,null,null,null,null,null,null,null,null,null,null,null,null,null,null,null,null,null,null,null,null,null,null,null,null,null,null,null,null,"N/A","N/A","N/A","N/A","N/A","N/A","N/A","N/A","N/A",1,1,1,1,1,1,1,1,1]
[null,null,null,null,null,null,null,null,null,null,null,null,null,null,null,null,null,null,null,null,null,null,null,null,null,null,null,null,null,null,null,null,null,null,"N/A","N/A","N/A","N/A","N/A","N/A","N/A","N/A","N/A",1,1,1,1,1,1,1,1,1]
[null,null,null,null,null,null,null,null,null,null,null,null,null,null,null,null,null,null,null,null,null,null,null,null,null,null,null,null,null,null,null,null,null,null,"N/A","N/A","N/A","N/A","N/A","N/A","N/A","N/A","N/A",1,1,1,1,1,1,1,1,1]
[null,null,null,null,null,null,null,null,null,null,null,null,null,null,null,null,null,null,null,null,null,null,null,null,null,null,null,null,null,null,null,null,null,null,"N/A","N/A","N/A","N/A","N/A","N/A","N/A","N/A","N/A",1,1,1,1,1,1,1,1,1]
[null,null,null,null,null,null,null,null,null,null,null,null,null,null,null,null,null,null,null,null,null,null,null,null,null,null,null,null,null,null,null,null,null,null,"N/A","N/A","N/A","N/A","N/A","N/A","N/A","N/A","N/A",1,1,1,1,1,1,1,1,1]
[null,null,null,null,null,null,null,null,null,null,null,null,null,null,null,null,null,null,null,null,null,null,null,null,null,null,null,null,null,null,null,null,null,null,"N/A","N/A","N/A","N/A","N/A","N/A","N/A","N/A","N/A",1,1,1,1,1,1,1,1,1]
[null,null,null,null,null,null,null,null,null,null,null,null,null,null,null,null,null,null,null,null,null,null,null,null,null,null,null,null,null,null,null,null,null,null,"N/A","N/A","N/A","N/A","N/A","N/A","N/A","N/A","N/A",1,1,1,1,1,1,1,1,1]
[null,null,null,null,null,null,null,null,null,null,null,null,null,null,null,null,null,null,null,null,null,null,null,null,null,null,null,null,null,null,null,null,null,null,"N/A","N/A","N/A","N/A","N/A","N/A","N/A","N/A","N/A",1,1,1,1,1,1,1,1,1]
[null,null,null,null,null,null,null,null,null,null,null,null,null,null,null,null,null,null,null,null,null,null,null,null,null,null,null,null,null,null,null,null,null,null,"N/A","N/A","N/A","N/A","N/A","N/A","N/A","N/A","N/A",1,1,1,1,1,1,1,1,1]
[null,null,null,null,null,null,null,null,null,null,null,null,null,null,null,null,null,null,null,null,null,null,null,null,null,null,null,null,null,null,null,null,null,null,"N/A","N/A","N/A","N/A","N/A","N/A","N/A","N/A","N/A",1,1,1,1,1,1,1,1,1]
[null,null,null,null,null,null,null,null,null,null,null,null,null,null,null,null,null,null,null,null,null,null,null,null,null,null,null,null,null,null,null,null,null,null,"N/A","N/A","N/A","N/A","N/A","N/A","N/A","N/A","N/A",1,1,1,1,1,1,1,1,1]
[null,null,null,null,null,null,null,null,null,null,null,null,null,null,null,null,null,null,null,null,null,null,null,null,null,null,null,null,null,null,null,null,null,null,"N/A","N/A","N/A","N/A","N/A","N/A","N/A","N/A","N/A",1,1,1,1,1,1,1,1,1]
[null,null,null,null,null,null,null,null,null,null,null,null,null,null,null,null,null,null,null,null,null,null,null,null,null,null,null,null,null,null,null,null,null,null,"N/A","N/A","N/A","N/A","N/A","N/A","N/A","N/A","N/A",1,1,1,1,1,1,1,1,1]
[null,null,null,null,null,null,null,null,null,null,null,null,null,null,null,null,null,null,null,null,null,null,null,null,null,null,null,null,null,null,null,null,null,null,"N/A","N/A","N/A","N/A","N/A","N/A","N/A","N/A","N/A",1,1,1,1,1,1,1,1,1]
[null,null,null,null,null,null,null,null,null,null,null,null,null,null,null,null,null,null,null,null,null,null,null,null,null,null,null,null,null,null,null,null,null,null,"N/A","N/A","N/A","N/A","N/A","N/A","N/A","N/A","N/A",1,1,1,1,1,1,1,1,1]
[null,null,null,null,null,null,null,null,null,null,null,null,null,null,null,null,null,null,null,null,null,null,null,null,null,null,null,null,null,null,null,null,null,null,"N/A","N/A","N/A","N/A","N/A","N/A","N/A","N/A","N/A",1,1,1,1,1,1,1,1,1]
[null,null,null,null,null,null,null,null,null,null,null,null,null,null,null,null,null,null,null,null,null,null,null,null,null,null,null,null,null,null,null,null,null,null,{"$f":"IF(COUNTA(E1070:G1070)>0,(COUNTIF(E1070:G1070,\"=0\")*0+COUNTIF(E1070:G1070,\"=1\")*100+COUNTIF(E1070:G1070,\"=2\")*80+COUNTIF(E1070:G1070,\"=3\")*50+COUNTIF(E1070:G1070,\"=8\")*20+COUNTIF(E1070:G1070,\"=9\")*0)/COUNTA(E1070:G1070)/100,\"N/A\")","v":"N/A"},{"$f":"IF(COUNTA(H1070:J1070)>0,(COUNTIF(H1070:J1070,\"=0\")*0+COUNTIF(H1070:J1070,\"=1\")*100+COUNTIF(H1070:J1070,\"=2\")*80+COUNTIF(H1070:J1070,\"=3\")*50+COUNTIF(H1070:J1070,\"=8\")*20+COUNTIF(H1070:J1070,\"=9\")*0)/COUNTA(H1070:J1070)/100,\"N/A\")","v":"N/A"},{"$f":"IF(COUNTA(K1070:M1070)>0,(COUNTIF(K1070:M1070,\"=0\")*0+COUNTIF(K1070:M1070,\"=1\")*100+COUNTIF(K1070:M1070,\"=2\")*80+COUNTIF(K1070:M1070,\"=3\")*50+COUNTIF(K1070:M1070,\"=8\")*20+COUNTIF(K1070:M1070,\"=9\")*0)/COUNTA(K1070:M1070)/100,\"N/A\")","v":"N/A"},{"$f":"IF(COUNTA(N1070:V1070)>0,(COUNTIF(N1070:V1070,\"=0\")*0+COUNTIF(N1070:V1070,\"=1\")*100+COUNTIF(N1070:V1070,\"=2\")*80+COUNTIF(N1070:V1070,\"=3\")*50+COUNTIF(N1070:V1070,\"=8\")*20+COUNTIF(N1070:V1070,\"=9\")*0)/COUNTA(N1070:V1070)/100,\"N/A\")","v":"N/A"},{"$f":"IF(COUNTA(W1070:AA1070)>0,(COUNTIF(W1070:AA1070,\"=0\")*0+COUNTIF(W1070:AA1070,\"=1\")*100+COUNTIF(W1070:AA1070,\"=2\")*80+COUNTIF(W1070:AA1070,\"=3\")*50+COUNTIF(W1070:AA1070,\"=8\")*20+COUNTIF(W1070:AA1070,\"=9\")*0)/COUNTA(W1070:AA1070)/100,\"N/A\")","v":"N/A"},{"$f":"IF(COUNTA(AB1070:AC1070)>0,(COUNTIF(AB1070:AC1070,\"=0\")*0+COUNTIF(AB1070:AC1070,\"=1\")*100+COUNTIF(AB1070:AC1070,\"=2\")*80+COUNTIF(AB1070:AC1070,\"=3\")*50+COUNTIF(AB1070:AC1070,\"=8\")*20+COUNTIF(AB1070:AC1070,\"=9\")*0)/COUNTA(AB1070:AC1070)/100,\"N/A\")","v":"N/A"},{"$f":"IF(COUNTA((AD1070:AF1070))>0,(COUNTIF((AD1070:AF1070),\"=0\")*0+COUNTIF((AD1070:AF1070),\"=1\")*100+COUNTIF((AD1070:AF1070),\"=2\")*80+COUNTIF((AD1070:AF1070),\"=3\")*50+COUNTIF((AD1070:AF1070),\"=8\")*20+COUNTIF((AD1070:AF1070),\"=9\")*0)/COUNTA((AD1070:AF1070))/100,\"N/A\")","v":"N/A"},{"$f":"IF(COUNTA(AG1070:AH1070)>0,(COUNTIF(AG1070:AH1070,\"=0\")*0+COUNTIF(AG1070:AH1070,\"=1\")*100+COUNTIF(AG1070:AH1070,\"=2\")*80+COUNTIF(AG1070:AH1070,\"=3\")*50+COUNTIF(AG1070:AH1070,\"=8\")*20+COUNTIF(AG1070:AH1070,\"=9\")*0)/COUNTA(AG1070:AH1070)/100,\"N/A\")","v":"N/A"},{"$f":"IF(AND(COUNTA(E1070:AH1070)<>0,B1070<>\"\"),AVERAGE(AL1070:AP1070,AI1070),\"N/A\")","v":"N/A"},1,1,1,1,1,1,1,1,1]
[null,null,null,null,null,null,null,null,null,null,null,null,null,null,null,null,null,null,null,null,null,null,null,null,null,null,null,null,null,null,null,null,null,null,"N/A","N/A","N/A","N/A","N/A","N/A","N/A","N/A","N/A",1,1,1,1,1,1,1,1,1]
[null,null,null,null,null,null,null,null,null,null,null,null,null,null,null,null,null,null,null,null,null,null,null,null,null,null,null,null,null,null,null,null,null,null,"N/A","N/A","N/A","N/A","N/A","N/A","N/A","N/A","N/A",1,1,1,1,1,1,1,1,1]
[null,null,null,null,null,null,null,null,null,null,null,null,null,null,null,null,null,null,null,null,null,null,null,null,null,null,null,null,null,null,null,null,null,null,"N/A","N/A","N/A","N/A","N/A","N/A","N/A","N/A","N/A",1,1,1,1,1,1,1,1,1]
[null,null,null,null,null,null,null,null,null,null,null,null,null,null,null,null,null,null,null,null,null,null,null,null,null,null,null,null,null,null,null,null,null,null,"N/A","N/A","N/A","N/A","N/A","N/A","N/A","N/A","N/A",1,1,1,1,1,1,1,1,1]
[null,null,null,null,null,null,null,null,null,null,null,null,null,null,null,null,null,null,null,null,null,null,null,null,null,null,null,null,null,null,null,null,null,null,"N/A","N/A","N/A","N/A","N/A","N/A","N/A","N/A","N/A",1,1,1,1,1,1,1,1,1]
[null,null,null,null,null,null,null,null,null,null,null,null,null,null,null,null,null,null,null,null,null,null,null,null,null,null,null,null,null,null,null,null,null,null,"N/A","N/A","N/A","N/A","N/A","N/A","N/A","N/A","N/A",1,1,1,1,1,1,1,1,1]
[null,null,null,null,null,null,null,null,null,null,null,null,null,null,null,null,null,null,null,null,null,null,null,null,null,null,null,null,null,null,null,null,null,null,"N/A","N/A","N/A","N/A","N/A","N/A","N/A","N/A","N/A",1,1,1,1,1,1,1,1,1]
[null,null,null,null,null,null,null,null,null,null,null,null,null,null,null,null,null,null,null,null,null,null,null,null,null,null,null,null,null,null,null,null,null,null,"N/A","N/A","N/A","N/A","N/A","N/A","N/A","N/A","N/A",1,1,1,1,1,1,1,1,1]
[null,null,null,null,null,null,null,null,null,null,null,null,null,null,null,null,null,null,null,null,null,null,null,null,null,null,null,null,null,null,null,null,null,null,"N/A","N/A","N/A","N/A","N/A","N/A","N/A","N/A","N/A",1,1,1,1,1,1,1,1,1]
[null,null,null,null,null,null,null,null,null,null,null,null,null,null,null,null,null,null,null,null,null,null,null,null,null,null,null,null,null,null,null,null,null,null,"N/A","N/A","N/A","N/A","N/A","N/A","N/A","N/A","N/A",1,1,1,1,1,1,1,1,1]
[null,null,null,null,null,null,null,null,null,null,null,null,null,null,null,null,null,null,null,null,null,null,null,null,null,null,null,null,null,null,null,null,null,null,"N/A","N/A","N/A","N/A","N/A","N/A","N/A","N/A","N/A",1,1,1,1,1,1,1,1,1]
[null,null,null,null,null,null,null,null,null,null,null,null,null,null,null,null,null,null,null,null,null,null,null,null,null,null,null,null,null,null,null,null,null,null,"N/A","N/A","N/A","N/A","N/A","N/A","N/A","N/A","N/A",{"$f":"IF(AI1082=\"N/A\",1,\"\")","v":1},1,1,1,1,1,1,1,1]
[null,null,null,null,null,null,null,null,null,null,null,null,null,null,null,null,null,null,null,null,null,null,null,null,null,null,null,null,null,null,null,null,null,null,"N/A","N/A","N/A","N/A","N/A","N/A","N/A","N/A","N/A",1,1,1,1,1,1,1,1,1]
[null,null,null,null,null,null,null,null,null,null,null,null,null,null,null,null,null,null,null,null,null,null,null,null,null,null,null,null,null,null,null,null,null,null,"N/A","N/A","N/A","N/A","N/A","N/A","N/A","N/A","N/A",1,1,1,1,1,1,1,1,1]
[null,null,null,null,null,null,null,null,null,null,null,null,null,null,null,null,null,null,null,null,null,null,null,null,null,null,null,null,null,null,null,null,null,null,"N/A","N/A","N/A","N/A","N/A","N/A","N/A","N/A","N/A",1,1,1,1,1,1,1,1,1]
[null,null,null,null,null,null,null,null,null,null,null,null,null,null,null,null,null,null,null,null,null,null,null,null,null,null,null,null,null,null,null,null,null,null,"N/A","N/A","N/A","N/A","N/A","N/A","N/A","N/A","N/A",1,1,1,1,1,1,1,1,1]
[null,null,null,null,null,null,null,null,null,null,null,null,null,null,null,null,null,null,null,null,null,null,null,null,null,null,null,null,null,null,null,null,null,null,"N/A","N/A","N/A","N/A","N/A","N/A","N/A","N/A","N/A",1,1,1,1,1,1,1,1,1]
[null,null,null,null,null,null,null,null,null,null,null,null,null,null,null,null,null,null,null,null,null,null,null,null,null,null,null,null,null,null,null,null,null,null,"N/A","N/A","N/A","N/A","N/A","N/A","N/A","N/A","N/A",1,1,1,1,1,1,1,1,1]
[null,null,null,null,null,null,null,null,null,null,null,null,null,null,null,null,null,null,null,null,null,null,null,null,null,null,null,null,null,null,null,null,null,null,"N/A","N/A","N/A","N/A","N/A","N/A","N/A","N/A","N/A",1,1,1,1,1,1,1,1,1]
[null,null,null,null,null,null,null,null,null,null,null,null,null,null,null,null,null,null,null,null,null,null,null,null,null,null,null,null,null,null,null,null,null,null,"N/A","N/A","N/A","N/A","N/A","N/A","N/A","N/A","N/A",1,1,1,1,1,1,1,1,1]
[null,null,null,null,null,null,null,null,null,null,null,null,null,null,null,null,null,null,null,null,null,null,null,null,null,null,null,null,null,null,null,null,null,null,"N/A","N/A","N/A","N/A","N/A","N/A","N/A","N/A","N/A",1,1,1,1,1,1,1,1,1]
[null,null,null,null,null,null,null,null,null,null,null,null,null,null,null,null,null,null,null,null,null,null,null,null,null,null,null,null,null,null,null,null,null,null,"N/A","N/A","N/A","N/A","N/A","N/A","N/A","N/A","N/A",1,1,1,1,1,1,1,1,1]
[null,null,null,null,null,null,null,null,null,null,null,null,null,null,null,null,null,null,null,null,null,null,null,null,null,null,null,null,null,null,null,null,null,null,"N/A","N/A","N/A","N/A","N/A","N/A","N/A","N/A","N/A",1,1,1,1,1,1,1,1,1]
[null,null,null,null,null,null,null,null,null,null,null,null,null,null,null,null,null,null,null,null,null,null,null,null,null,null,null,null,null,null,null,null,null,null,"N/A","N/A","N/A","N/A","N/A","N/A","N/A","N/A","N/A",1,1,1,1,1,1,1,1,1]
[null,null,null,null,null,null,null,null,null,null,null,null,null,null,null,null,null,null,null,null,null,null,null,null,null,null,null,null,null,null,null,null,null,null,"N/A","N/A","N/A","N/A","N/A","N/A","N/A","N/A","N/A",1,1,1,1,1,1,1,1,1]
[null,null,null,null,null,null,null,null,null,null,null,null,null,null,null,null,null,null,null,null,null,null,null,null,null,null,null,null,null,null,null,null,null,null,"N/A","N/A","N/A","N/A","N/A","N/A","N/A","N/A","N/A",1,1,1,1,1,1,1,1,1]
[null,null,null,null,null,null,null,null,null,null,null,null,null,null,null,null,null,null,null,null,null,null,null,null,null,null,null,null,null,null,null,null,null,null,"N/A","N/A","N/A","N/A","N/A","N/A","N/A","N/A","N/A",1,1,1,1,1,1,1,1,1]
[null,null,null,null,null,null,null,null,null,null,null,null,null,null,null,null,null,null,null,null,null,null,null,null,null,null,null,null,null,null,null,null,null,null,"N/A","N/A","N/A","N/A","N/A","N/A","N/A","N/A","N/A",1,1,1,1,1,1,1,1,1]
[null,null,null,null,null,null,null,null,null,null,null,null,null,null,null,null,null,null,null,null,null,null,null,null,null,null,null,null,null,null,null,null,null,null,"N/A","N/A","N/A","N/A","N/A","N/A","N/A","N/A","N/A",1,1,1,1,1,1,1,1,1]
[null,null,null,null,null,null,null,null,null,null,null,null,null,null,null,null,null,null,null,null,null,null,null,null,null,null,null,null,null,null,null,null,null,null,"N/A","N/A","N/A","N/A","N/A","N/A","N/A","N/A","N/A",1,1,1,1,1,1,1,1,1]
[null,null,null,null,null,null,null,null,null,null,null,null,null,null,null,null,null,null,null,null,null,null,null,null,null,null,null,null,null,null,null,null,null,null,"N/A","N/A","N/A","N/A","N/A","N/A","N/A","N/A","N/A",1,1,1,1,1,1,1,1,1]
[null,null,null,null,null,null,null,null,null,null,null,null,null,null,null,null,null,null,null,null,null,null,null,null,null,null,null,null,null,null,null,null,null,null,"N/A","N/A","N/A","N/A","N/A","N/A","N/A","N/A","N/A",1,1,1,1,1,1,1,1,1]
[null,null,null,null,null,null,null,null,null,null,null,null,null,null,null,null,null,null,null,null,null,null,null,null,null,null,null,null,null,null,null,null,null,null,"N/A","N/A","N/A","N/A","N/A","N/A","N/A","N/A","N/A",1,1,1,1,1,1,1,1,1]
[null,null,null,null,null,null,null,null,null,null,null,null,null,null,null,null,null,null,null,null,null,null,null,null,null,null,null,null,null,null,null,null,null,null,"N/A","N/A","N/A","N/A","N/A","N/A","N/A","N/A","N/A",1,1,1,1,1,1,1,1,1]
[null,null,null,null,null,null,null,null,null,null,null,null,null,null,null,null,null,null,null,null,null,null,null,null,null,null,null,null,null,null,null,null,null,null,"N/A","N/A","N/A","N/A","N/A","N/A","N/A","N/A","N/A",1,1,1,1,1,1,1,1,1]
[null,null,null,null,null,null,null,null,null,null,null,null,null,null,null,null,null,null,null,null,null,null,null,null,null,null,null,null,null,null,null,null,null,null,"N/A","N/A","N/A","N/A","N/A","N/A","N/A","N/A","N/A",1,1,1,1,1,1,1,1,1]
[null,null,null,null,null,null,null,null,null,null,null,null,null,null,null,null,null,null,null,null,null,null,null,null,null,null,null,null,null,null,null,null,null,null,"N/A","N/A","N/A","N/A","N/A","N/A","N/A","N/A","N/A",1,1,1,1,1,1,1,1,1]
[null,null,null,null,null,null,null,null,null,null,null,null,null,null,null,null,null,null,null,null,null,null,null,null,null,null,null,null,null,null,null,null,null,null,"N/A","N/A","N/A","N/A","N/A","N/A","N/A","N/A","N/A",1,1,1,1,1,1,1,1,1]
[null,null,null,null,null,null,null,null,null,null,null,null,null,null,null,null,null,null,null,null,null,null,null,null,null,null,null,null,null,null,null,null,null,null,"N/A","N/A","N/A","N/A","N/A","N/A","N/A","N/A","N/A",1,1,1,1,1,1,1,1,1]
[null,null,null,null,null,null,null,null,null,null,null,null,null,null,null,null,null,null,null,null,null,null,null,null,null,null,null,null,null,null,null,null,null,null,"N/A","N/A","N/A","N/A","N/A","N/A","N/A","N/A","N/A",1,1,1,1,1,1,1,1,1]
[null,null,null,null,null,null,null,null,null,null,null,null,null,null,null,null,null,null,null,null,null,null,null,null,null,null,null,null,null,null,null,null,null,null,"N/A","N/A","N/A","N/A","N/A","N/A","N/A","N/A","N/A",1,1,1,1,1,1,1,1,1]
[null,null,null,null,null,null,null,null,null,null,null,null,null,null,null,null,null,null,null,null,null,null,null,null,null,null,null,null,null,null,null,null,null,null,"N/A","N/A","N/A","N/A","N/A","N/A","N/A","N/A","N/A",1,1,1,1,1,1,1,1,1]
[null,null,null,null,null,null,null,null,null,null,null,null,null,null,null,null,null,null,null,null,null,null,null,null,null,null,null,null,null,null,null,null,null,null,"N/A","N/A","N/A","N/A","N/A","N/A","N/A","N/A","N/A",1,1,1,1,1,1,1,1,1]
[null,null,null,null,null,null,null,null,null,null,null,null,null,null,null,null,null,null,null,null,null,null,null,null,null,null,null,null,null,null,null,null,null,null,"N/A","N/A","N/A","N/A","N/A","N/A","N/A","N/A","N/A",1,1,1,1,1,1,1,1,1]
[null,null,null,null,null,null,null,null,null,null,null,null,null,null,null,null,null,null,null,null,null,null,null,null,null,null,null,null,null,null,null,null,null,null,"N/A","N/A","N/A","N/A","N/A","N/A","N/A","N/A","N/A",1,1,1,1,1,1,{"$f":"IF(AO1115=\"N/A\",1,\"\")","v":1},1,1]
[null,null,null,null,null,null,null,null,null,null,null,null,null,null,null,null,null,null,null,null,null,null,null,null,null,null,null,null,null,null,null,null,null,null,"N/A","N/A","N/A","N/A","N/A","N/A","N/A","N/A","N/A",{"$f":"IF(AI1116=\"N/A\",1,\"\")","v":1},1,1,1,1,1,1,1,1]
[null,null,null,null,null,null,null,null,null,null,null,null,null,null,null,null,null,null,null,null,null,null,null,null,null,null,null,null,null,null,null,null,null,null,"N/A","N/A","N/A","N/A","N/A","N/A","N/A","N/A","N/A",1,1,1,1,1,1,1,1,1]
[null,null,null,null,null,null,null,null,null,null,null,null,null,null,null,null,null,null,null,null,null,null,null,null,null,null,null,null,null,null,null,null,null,null,"N/A","N/A","N/A","N/A","N/A","N/A","N/A","N/A","N/A",1,1,1,1,1,1,1,1,1]
[null,null,null,null,null,null,null,null,null,null,null,null,null,null,null,null,null,null,null,null,null,null,null,null,null,null,null,null,null,null,null,null,null,null,"N/A","N/A","N/A","N/A","N/A","N/A","N/A","N/A","N/A",1,1,1,1,1,1,1,1,1]
[null,null,null,null,null,null,null,null,null,null,null,null,null,null,null,null,null,null,null,null,null,null,null,null,null,null,null,null,null,null,null,null,null,null,"N/A","N/A","N/A","N/A","N/A","N/A","N/A","N/A","N/A",1,1,1,1,1,1,1,1,1]
[null,null,null,null,null,null,null,null,null,null,null,null,null,null,null,null,null,null,null,null,null,null,null,null,null,null,null,null,null,null,null,null,null,null,"N/A","N/A","N/A","N/A","N/A","N/A","N/A","N/A","N/A",1,1,1,1,1,1,1,1,1]
[null,null,null,null,null,null,null,null,null,null,null,null,null,null,null,null,null,null,null,null,null,null,null,null,null,null,null,null,null,null,null,null,null,null,"N/A","N/A","N/A","N/A","N/A","N/A","N/A","N/A","N/A",1,1,1,1,1,1,1,1,1]
[null,null,null,null,null,null,null,null,null,null,null,null,null,null,null,null,null,null,null,null,null,null,null,null,null,null,null,null,null,null,null,null,null,null,"N/A","N/A","N/A","N/A","N/A","N/A","N/A","N/A","N/A",1,1,1,1,1,1,1,1,1]
[null,null,null,null,null,null,null,null,null,null,null,null,null,null,null,null,null,null,null,null,null,null,null,null,null,null,null,null,null,null,null,null,null,null,"N/A","N/A","N/A","N/A","N/A","N/A","N/A","N/A","N/A",1,1,1,1,1,1,1,1,1]
[null,null,null,null,null,null,null,null,null,null,null,null,null,null,null,null,null,null,null,null,null,null,null,null,null,null,null,null,null,null,null,null,null,null,"N/A","N/A","N/A","N/A","N/A","N/A","N/A","N/A","N/A",1,1,1,1,1,1,1,1,1]
[null,null,null,null,null,null,null,null,null,null,null,null,null,null,null,null,null,null,null,null,null,null,null,null,null,null,null,null,null,null,null,null,null,null,"N/A","N/A","N/A","N/A","N/A","N/A","N/A","N/A","N/A",1,1,1,1,1,1,1,1,1]
[null,null,null,null,null,null,null,null,null,null,null,null,null,null,null,null,null,null,null,null,null,null,null,null,null,null,null,null,null,null,null,null,null,null,"N/A","N/A","N/A","N/A","N/A","N/A","N/A","N/A","N/A",1,1,1,1,1,1,1,1,1]
[null,null,null,null,null,null,null,null,null,null,null,null,null,null,null,null,null,null,null,null,null,null,null,null,null,null,null,null,null,null,null,null,null,null,"N/A","N/A","N/A","N/A","N/A","N/A","N/A","N/A","N/A",1,1,1,1,1,1,1,1,1]
[null,null,null,null,null,null,null,null,null,null,null,null,null,null,null,null,null,null,null,null,null,null,null,null,null,null,null,null,null,null,null,null,null,null,"N/A","N/A","N/A","N/A","N/A","N/A","N/A","N/A","N/A",1,1,1,1,1,1,1,1,1]
[null,null,null,null,null,null,null,null,null,null,null,null,null,null,null,null,null,null,null,null,null,null,null,null,null,null,null,null,null,null,null,null,null,null,"N/A","N/A","N/A","N/A","N/A","N/A","N/A","N/A","N/A",1,1,1,1,1,1,1,1,1]
[null,null,null,null,null,null,null,null,null,null,null,null,null,null,null,null,null,null,null,null,null,null,null,null,null,null,null,null,null,null,null,null,null,null,"N/A","N/A","N/A","N/A","N/A","N/A","N/A","N/A","N/A",1,1,1,1,1,1,1,1,1]
[null,null,null,null,null,null,null,null,null,null,null,null,null,null,null,null,null,null,null,null,null,null,null,null,null,null,null,null,null,null,null,null,null,null,"N/A","N/A","N/A","N/A","N/A","N/A","N/A","N/A","N/A",1,1,1,1,1,1,1,1,1]
[null,null,null,null,null,null,null,null,null,null,null,null,null,null,null,null,null,null,null,null,null,null,null,null,null,null,null,null,null,null,null,null,null,null,"N/A","N/A","N/A","N/A","N/A","N/A","N/A","N/A","N/A",1,1,1,1,1,1,1,1,1]
[null,null,null,null,null,null,null,null,null,null,null,null,null,null,null,null,null,null,null,null,null,null,null,null,null,null,null,null,null,null,null,null,null,null,{"$f":"IF(COUNTA(E1134:G1134)>0,(COUNTIF(E1134:G1134,\"=0\")*0+COUNTIF(E1134:G1134,\"=1\")*100+COUNTIF(E1134:G1134,\"=2\")*80+COUNTIF(E1134:G1134,\"=3\")*50+COUNTIF(E1134:G1134,\"=8\")*20+COUNTIF(E1134:G1134,\"=9\")*0)/COUNTA(E1134:G1134)/100,\"N/A\")","v":"N/A"},{"$f":"IF(COUNTA(H1134:J1134)>0,(COUNTIF(H1134:J1134,\"=0\")*0+COUNTIF(H1134:J1134,\"=1\")*100+COUNTIF(H1134:J1134,\"=2\")*80+COUNTIF(H1134:J1134,\"=3\")*50+COUNTIF(H1134:J1134,\"=8\")*20+COUNTIF(H1134:J1134,\"=9\")*0)/COUNTA(H1134:J1134)/100,\"N/A\")","v":"N/A"},{"$f":"IF(COUNTA(K1134:M1134)>0,(COUNTIF(K1134:M1134,\"=0\")*0+COUNTIF(K1134:M1134,\"=1\")*100+COUNTIF(K1134:M1134,\"=2\")*80+COUNTIF(K1134:M1134,\"=3\")*50+COUNTIF(K1134:M1134,\"=8\")*20+COUNTIF(K1134:M1134,\"=9\")*0)/COUNTA(K1134:M1134)/100,\"N/A\")","v":"N/A"},{"$f":"IF(COUNTA(N1134:V1134)>0,(COUNTIF(N1134:V1134,\"=0\")*0+COUNTIF(N1134:V1134,\"=1\")*100+COUNTIF(N1134:V1134,\"=2\")*80+COUNTIF(N1134:V1134,\"=3\")*50+COUNTIF(N1134:V1134,\"=8\")*20+COUNTIF(N1134:V1134,\"=9\")*0)/COUNTA(N1134:V1134)/100,\"N/A\")","v":"N/A"},{"$f":"IF(COUNTA(W1134:AA1134)>0,(COUNTIF(W1134:AA1134,\"=0\")*0+COUNTIF(W1134:AA1134,\"=1\")*100+COUNTIF(W1134:AA1134,\"=2\")*80+COUNTIF(W1134:AA1134,\"=3\")*50+COUNTIF(W1134:AA1134,\"=8\")*20+COUNTIF(W1134:AA1134,\"=9\")*0)/COUNTA(W1134:AA1134)/100,\"N/A\")","v":"N/A"},{"$f":"IF(COUNTA(AB1134:AC1134)>0,(COUNTIF(AB1134:AC1134,\"=0\")*0+COUNTIF(AB1134:AC1134,\"=1\")*100+COUNTIF(AB1134:AC1134,\"=2\")*80+COUNTIF(AB1134:AC1134,\"=3\")*50+COUNTIF(AB1134:AC1134,\"=8\")*20+COUNTIF(AB1134:AC1134,\"=9\")*0)/COUNTA(AB1134:AC1134)/100,\"N/A\")","v":"N/A"},{"$f":"IF(COUNTA((AD1134:AF1134))>0,(COUNTIF((AD1134:AF1134),\"=0\")*0+COUNTIF((AD1134:AF1134),\"=1\")*100+COUNTIF((AD1134:AF1134),\"=2\")*80+COUNTIF((AD1134:AF1134),\"=3\")*50+COUNTIF((AD1134:AF1134),\"=8\")*20+COUNTIF((AD1134:AF1134),\"=9\")*0)/COUNTA((AD1134:AF1134))/100,\"N/A\")","v":"N/A"},{"$f":"IF(COUNTA(AG1134:AH1134)>0,(COUNTIF(AG1134:AH1134,\"=0\")*0+COUNTIF(AG1134:AH1134,\"=1\")*100+COUNTIF(AG1134:AH1134,\"=2\")*80+COUNTIF(AG1134:AH1134,\"=3\")*50+COUNTIF(AG1134:AH1134,\"=8\")*20+COUNTIF(AG1134:AH1134,\"=9\")*0)/COUNTA(AG1134:AH1134)/100,\"N/A\")","v":"N/A"},{"$f":"IF(AND(COUNTA(E1134:AH1134)<>0,B1134<>\"\"),AVERAGE(AL1134:AP1134,AI1134),\"N/A\")","v":"N/A"},1,1,1,1,1,1,1,1,1]
[null,null,null,null,null,null,null,null,null,null,null,null,null,null,null,null,null,null,null,null,null,null,null,null,null,null,null,null,null,null,null,null,null,null,"N/A","N/A","N/A","N/A","N/A","N/A","N/A","N/A","N/A",1,1,1,1,1,1,1,1,1]
[null,null,null,null,null,null,null,null,null,null,null,null,null,null,null,null,null,null,null,null,null,null,null,null,null,null,null,null,null,null,null,null,null,null,"N/A","N/A","N/A","N/A","N/A","N/A","N/A","N/A","N/A",1,1,1,1,1,1,1,1,1]
[null,null,null,null,null,null,null,null,null,null,null,null,null,null,null,null,null,null,null,null,null,null,null,null,null,null,null,null,null,null,null,null,null,null,"N/A","N/A","N/A","N/A","N/A","N/A","N/A","N/A","N/A",1,1,1,1,1,1,1,1,1]
[null,null,null,null,null,null,null,null,null,null,null,null,null,null,null,null,null,null,null,null,null,null,null,null,null,null,null,null,null,null,null,null,null,null,"N/A","N/A","N/A","N/A","N/A","N/A","N/A","N/A","N/A",1,1,1,1,1,1,1,1,1]
[null,null,null,null,null,null,null,null,null,null,null,null,null,null,null,null,null,null,null,null,null,null,null,null,null,null,null,null,null,null,null,null,null,null,"N/A","N/A","N/A","N/A","N/A","N/A","N/A","N/A","N/A",1,1,1,1,1,1,1,1,1]
[null,null,null,null,null,null,null,null,null,null,null,null,null,null,null,null,null,null,null,null,null,null,null,null,null,null,null,null,null,null,null,null,null,null,"N/A","N/A","N/A","N/A","N/A","N/A","N/A","N/A","N/A",1,1,1,1,1,1,1,1,1]
[null,null,null,null,null,null,null,null,null,null,null,null,null,null,null,null,null,null,null,null,null,null,null,null,null,null,null,null,null,null,null,null,null,null,"N/A","N/A","N/A","N/A","N/A","N/A","N/A","N/A","N/A",1,1,1,1,1,1,1,1,1]
[null,null,null,null,null,null,null,null,null,null,null,null,null,null,null,null,null,null,null,null,null,null,null,null,null,null,null,null,null,null,null,null,null,null,"N/A","N/A","N/A","N/A","N/A","N/A","N/A","N/A","N/A",1,1,1,1,1,1,1,1,1]
[null,null,null,null,null,null,null,null,null,null,null,null,null,null,null,null,null,null,null,null,null,null,null,null,null,null,null,null,null,null,null,null,null,null,"N/A","N/A","N/A","N/A","N/A","N/A","N/A","N/A","N/A",1,1,1,1,1,1,1,1,1]
[null,null,null,null,null,null,null,null,null,null,null,null,null,null,null,null,null,null,null,null,null,null,null,null,null,null,null,null,null,null,null,null,null,null,"N/A","N/A","N/A","N/A","N/A","N/A","N/A","N/A","N/A",1,1,1,1,1,1,1,1,1]
[null,null,null,null,null,null,null,null,null,null,null,null,null,null,null,null,null,null,null,null,null,null,null,null,null,null,null,null,null,null,null,null,null,null,"N/A","N/A","N/A","N/A","N/A","N/A","N/A","N/A","N/A",1,1,1,1,1,1,1,1,1]
[null,null,null,null,null,null,null,null,null,null,null,null,null,null,null,null,null,null,null,null,null,null,null,null,null,null,null,null,null,null,null,null,null,null,"N/A","N/A","N/A","N/A","N/A","N/A","N/A","N/A","N/A",1,1,1,1,1,1,1,1,1]
[null,null,null,null,null,null,null,null,null,null,null,null,null,null,null,null,null,null,null,null,null,null,null,null,null,null,null,null,null,null,null,null,null,null,"N/A","N/A","N/A","N/A","N/A","N/A","N/A","N/A","N/A",1,1,1,1,1,1,1,1,1]
[null,null,null,null,null,null,null,null,null,null,null,null,null,null,null,null,null,null,null,null,null,null,null,null,null,null,null,null,null,null,null,null,null,null,"N/A","N/A","N/A","N/A","N/A","N/A","N/A","N/A","N/A",1,1,1,1,1,1,1,1,1]
[null,null,null,null,null,null,null,null,null,null,null,null,null,null,null,null,null,null,null,null,null,null,null,null,null,null,null,null,null,null,null,null,null,null,"N/A","N/A","N/A","N/A","N/A","N/A","N/A","N/A","N/A",1,1,1,1,1,1,1,1,1]
[null,null,null,null,null,null,null,null,null,null,null,null,null,null,null,null,null,null,null,null,null,null,null,null,null,null,null,null,null,null,null,null,null,null,"N/A","N/A","N/A","N/A","N/A","N/A","N/A","N/A","N/A",1,1,1,1,1,1,1,1,1]
[null,null,null,null,null,null,null,null,null,null,null,null,null,null,null,null,null,null,null,null,null,null,null,null,null,null,null,null,null,null,null,null,null,null,"N/A","N/A","N/A","N/A","N/A","N/A","N/A","N/A","N/A",1,1,1,1,1,1,1,1,1]
[null,null,null,null,null,null,null,null,null,null,null,null,null,null,null,null,null,null,null,null,null,null,null,null,null,null,null,null,null,null,null,null,null,null,"N/A","N/A","N/A","N/A","N/A","N/A","N/A","N/A","N/A",1,1,1,1,1,1,1,1,1]
[null,null,null,null,null,null,null,null,null,null,null,null,null,null,null,null,null,null,null,null,null,null,null,null,null,null,null,null,null,null,null,null,null,null,"N/A","N/A","N/A","N/A","N/A","N/A","N/A","N/A","N/A",1,1,1,1,1,1,1,1,1]
[null,null,null,null,null,null,null,null,null,null,null,null,null,null,null,null,null,null,null,null,null,null,null,null,null,null,null,null,null,null,null,null,null,null,"N/A","N/A","N/A","N/A","N/A","N/A","N/A","N/A","N/A",1,1,1,1,1,1,1,1,1]
[null,null,null,null,null,null,null,null,null,null,null,null,null,null,null,null,null,null,null,null,null,null,null,null,null,null,null,null,null,null,null,null,null,null,"N/A","N/A","N/A","N/A","N/A","N/A","N/A","N/A","N/A",1,1,1,1,1,1,1,1,1]
[null,null,null,null,null,null,null,null,null,null,null,null,null,null,null,null,null,null,null,null,null,null,null,null,null,null,null,null,null,null,null,null,null,null,"N/A","N/A","N/A","N/A","N/A","N/A","N/A","N/A","N/A",1,1,1,1,1,1,1,1,1]
[null,null,null,null,null,null,null,null,null,null,null,null,null,null,null,null,null,null,null,null,null,null,null,null,null,null,null,null,null,null,null,null,null,null,"N/A","N/A","N/A","N/A","N/A","N/A","N/A","N/A","N/A",1,1,1,1,1,1,1,1,1]
[null,null,null,null,null,null,null,null,null,null,null,null,null,null,null,null,null,null,null,null,null,null,null,null,null,null,null,null,null,null,null,null,null,null,"N/A","N/A","N/A","N/A","N/A","N/A","N/A","N/A","N/A",1,1,1,{"$f":"IF(AL1158=\"N/A\",1,\"\")","v":1},1,1,1,1,1]
[null,null,null,null,null,null,null,null,null,null,null,null,null,null,null,null,null,null,null,null,null,null,null,null,null,null,null,null,null,null,null,null,null,null,"N/A","N/A","N/A","N/A","N/A","N/A","N/A","N/A","N/A",{"$f":"IF(AI1159=\"N/A\",1,\"\")","v":1},1,1,1,1,1,1,1,1]
[null,null,null,null,null,null,null,null,null,null,null,null,null,null,null,null,null,null,null,null,null,null,null,null,null,null,null,null,null,null,null,null,null,null,"N/A","N/A","N/A","N/A","N/A","N/A","N/A","N/A","N/A",1,1,1,1,1,1,1,1,1]
[null,null,null,null,null,null,null,null,null,null,null,null,null,null,null,null,null,null,null,null,null,null,null,null,null,null,null,null,null,null,null,null,null,null,"N/A","N/A","N/A","N/A","N/A","N/A","N/A","N/A","N/A",1,1,1,1,1,1,1,1,1]
[null,null,null,null,null,null,null,null,null,null,null,null,null,null,null,null,null,null,null,null,null,null,null,null,null,null,null,null,null,null,null,null,null,null,"N/A","N/A","N/A","N/A","N/A","N/A","N/A","N/A","N/A",1,1,1,1,1,1,1,1,1]
[null,null,null,null,null,null,null,null,null,null,null,null,null,null,null,null,null,null,null,null,null,null,null,null,null,null,null,null,null,null,null,null,null,null,"N/A","N/A","N/A","N/A","N/A","N/A","N/A","N/A","N/A",1,1,1,1,1,1,1,1,1]
[null,null,null,null,null,null,null,null,null,null,null,null,null,null,null,null,null,null,null,null,null,null,null,null,null,null,null,null,null,null,null,null,null,null,"N/A","N/A","N/A","N/A","N/A","N/A","N/A","N/A","N/A",1,1,1,1,1,1,1,1,1]
[null,null,null,null,null,null,null,null,null,null,null,null,null,null,null,null,null,null,null,null,null,null,null,null,null,null,null,null,null,null,null,null,null,null,"N/A","N/A","N/A","N/A","N/A","N/A","N/A","N/A","N/A",1,1,1,1,1,1,1,1,1]
[null,null,null,null,null,null,null,null,null,null,null,null,null,null,null,null,null,null,null,null,null,null,null,null,null,null,null,null,null,null,null,null,null,null,"N/A","N/A","N/A","N/A","N/A","N/A","N/A","N/A","N/A",1,1,1,1,1,1,1,1,1]
[null,null,null,null,null,null,null,null,null,null,null,null,null,null,null,null,null,null,null,null,null,null,null,null,null,null,null,null,null,null,null,null,null,null,"N/A","N/A","N/A","N/A","N/A","N/A","N/A","N/A","N/A",1,1,1,1,1,1,1,1,1]
[null,null,null,null,null,null,null,null,null,null,null,null,null,null,null,null,null,null,null,null,null,null,null,null,null,null,null,null,null,null,null,null,null,null,"N/A","N/A","N/A","N/A","N/A","N/A","N/A","N/A","N/A",1,1,1,1,1,1,1,1,1]
[null,null,null,null,null,null,null,null,null,null,null,null,null,null,null,null,null,null,null,null,null,null,null,null,null,null,null,null,null,null,null,null,null,null,"N/A","N/A","N/A","N/A","N/A","N/A","N/A","N/A","N/A",1,1,1,1,1,1,1,1,1]
[null,null,null,null,null,null,null,null,null,null,null,null,null,null,null,null,null,null,null,null,null,null,null,null,null,null,null,null,null,null,null,null,null,null,"N/A","N/A","N/A","N/A","N/A","N/A","N/A","N/A","N/A",1,1,1,1,1,1,1,1,1]
[null,null,null,null,null,null,null,null,null,null,null,null,null,null,null,null,null,null,null,null,null,null,null,null,null,null,null,null,null,null,null,null,null,null,"N/A","N/A","N/A","N/A","N/A","N/A","N/A","N/A","N/A",1,1,1,1,1,1,1,1,1]
[null,null,null,null,null,null,null,null,null,null,null,null,null,null,null,null,null,null,null,null,null,null,null,null,null,null,null,null,null,null,null,null,null,null,"N/A","N/A","N/A","N/A","N/A","N/A","N/A","N/A","N/A",1,1,1,1,1,1,1,1,1]
[null,null,null,null,null,null,null,null,null,null,null,null,null,null,null,null,null,null,null,null,null,null,null,null,null,null,null,null,null,null,null,null,null,null,"N/A","N/A","N/A","N/A","N/A","N/A","N/A","N/A","N/A",1,1,1,1,1,1,1,1,1]
[null,null,null,null,null,null,null,null,null,null,null,null,null,null,null,null,null,null,null,null,null,null,null,null,null,null,null,null,null,null,null,null,null,null,"N/A","N/A","N/A","N/A","N/A","N/A","N/A","N/A","N/A",1,1,1,1,1,1,1,1,1]
[null,null,null,null,null,null,null,null,null,null,null,null,null,null,null,null,null,null,null,null,null,null,null,null,null,null,null,null,null,null,null,null,null,null,"N/A","N/A","N/A","N/A","N/A","N/A","N/A","N/A","N/A",1,1,1,1,1,1,1,1,1]
[null,null,null,null,null,null,null,null,null,null,null,null,null,null,null,null,null,null,null,null,null,null,null,null,null,null,null,null,null,null,null,null,null,null,"N/A","N/A","N/A","N/A","N/A","N/A","N/A","N/A","N/A",1,1,1,1,1,1,1,1,1]
[null,null,null,null,null,null,null,null,null,null,null,null,null,null,null,null,null,null,null,null,null,null,null,null,null,null,null,null,null,null,null,null,null,null,"N/A","N/A","N/A","N/A","N/A","N/A","N/A","N/A","N/A",1,1,1,1,1,1,1,1,1]
[null,null,null,null,null,null,null,null,null,null,null,null,null,null,null,null,null,null,null,null,null,null,null,null,null,null,null,null,null,null,null,null,null,null,"N/A","N/A","N/A","N/A","N/A","N/A","N/A","N/A","N/A",1,1,1,1,1,1,1,1,1]
[null,null,null,null,null,null,null,null,null,null,null,null,null,null,null,null,null,null,null,null,null,null,null,null,null,null,null,null,null,null,null,null,null,null,"N/A","N/A","N/A","N/A","N/A","N/A","N/A","N/A","N/A",1,1,1,1,1,1,1,1,1]
[null,null,null,null,null,null,null,null,null,null,null,null,null,null,null,null,null,null,null,null,null,null,null,null,null,null,null,null,null,null,null,null,null,null,"N/A","N/A","N/A","N/A","N/A","N/A","N/A","N/A","N/A",1,1,1,1,1,1,1,1,1]
[null,null,null,null,null,null,null,null,null,null,null,null,null,null,null,null,null,null,null,null,null,null,null,null,null,null,null,null,null,null,null,null,null,null,"N/A","N/A","N/A","N/A","N/A","N/A","N/A","N/A","N/A",1,1,1,1,1,1,1,1,1]
[null,null,null,null,null,null,null,null,null,null,null,null,null,null,null,null,null,null,null,null,null,null,null,null,null,null,null,null,null,null,null,null,null,null,"N/A","N/A","N/A","N/A","N/A","N/A","N/A","N/A","N/A",1,1,1,1,1,1,1,1,1]
[null,null,null,null,null,null,null,null,null,null,null,null,null,null,null,null,null,null,null,null,null,null,null,null,null,null,null,null,null,null,null,null,null,null,"N/A","N/A","N/A","N/A","N/A","N/A","N/A","N/A","N/A",1,1,1,1,1,1,1,1,1]
[null,null,null,null,null,null,null,null,null,null,null,null,null,null,null,null,null,null,null,null,null,null,null,null,null,null,null,null,null,null,null,null,null,null,"N/A","N/A","N/A","N/A","N/A","N/A","N/A","N/A","N/A",1,1,1,1,1,1,1,1,1]
[null,null,null,null,null,null,null,null,null,null,null,null,null,null,null,null,null,null,null,null,null,null,null,null,null,null,null,null,null,null,null,null,null,null,"N/A","N/A","N/A","N/A","N/A","N/A","N/A","N/A","N/A",1,1,1,1,1,1,1,1,1]
[null,null,null,null,null,null,null,null,null,null,null,null,null,null,null,null,null,null,null,null,null,null,null,null,null,null,null,null,null,null,null,null,null,null,"N/A","N/A","N/A","N/A","N/A","N/A","N/A","N/A","N/A",1,1,1,1,1,1,1,1,1]
[null,null,null,null,null,null,null,null,null,null,null,null,null,null,null,null,null,null,null,null,null,null,null,null,null,null,null,null,null,null,null,null,null,null,"N/A","N/A","N/A","N/A","N/A","N/A","N/A","N/A","N/A",1,1,1,1,1,1,1,1,1]
[null,null,null,null,null,null,null,null,null,null,null,null,null,null,null,null,null,null,null,null,null,null,null,null,null,null,null,null,null,null,null,null,null,null,"N/A","N/A","N/A","N/A","N/A","N/A","N/A","N/A","N/A",1,1,1,1,1,1,1,1,1]
[null,null,null,null,null,null,null,null,null,null,null,null,null,null,null,null,null,null,null,null,null,null,null,null,null,null,null,null,null,null,null,null,null,null,"N/A","N/A","N/A","N/A","N/A","N/A","N/A","N/A","N/A",1,1,1,1,1,1,1,1,1]
[null,null,null,null,null,null,null,null,null,null,null,null,null,null,null,null,null,null,null,null,null,null,null,null,null,null,null,null,null,null,null,null,null,null,"N/A","N/A","N/A","N/A","N/A","N/A","N/A","N/A","N/A",1,1,1,1,1,1,1,1,1]
[null,null,null,null,null,null,null,null,null,null,null,null,null,null,null,null,null,null,null,null,null,null,null,null,null,null,null,null,null,null,null,null,null,null,"N/A","N/A","N/A","N/A","N/A","N/A","N/A","N/A","N/A",1,1,1,1,1,1,1,1,1]
[null,null,null,null,null,null,null,null,null,null,null,null,null,null,null,null,null,null,null,null,null,null,null,null,null,null,null,null,null,null,null,null,null,null,"N/A","N/A","N/A","N/A","N/A","N/A","N/A","N/A","N/A",1,1,1,1,1,1,1,1,1]
[null,null,null,null,null,null,null,null,null,null,null,null,null,null,null,null,null,null,null,null,null,null,null,null,null,null,null,null,null,null,null,null,null,null,"N/A","N/A","N/A","N/A","N/A","N/A","N/A","N/A","N/A",1,1,1,1,1,1,1,1,1]
[null,null,null,null,null,null,null,null,null,null,null,null,null,null,null,null,null,null,null,null,null,null,null,null,null,null,null,null,null,null,null,null,null,null,"N/A","N/A","N/A","N/A","N/A","N/A","N/A","N/A","N/A",1,1,1,1,1,1,1,1,1]
[null,null,null,null,null,null,null,null,null,null,null,null,null,null,null,null,null,null,null,null,null,null,null,null,null,null,null,null,null,null,null,null,null,null,"N/A","N/A","N/A","N/A","N/A","N/A","N/A","N/A","N/A",1,1,1,1,1,1,1,1,1]
[null,null,null,null,null,null,null,null,null,null,null,null,null,null,null,null,null,null,null,null,null,null,null,null,null,null,null,null,null,null,null,null,null,null,"N/A","N/A","N/A","N/A","N/A","N/A","N/A","N/A","N/A",1,1,1,1,1,1,1,1,1]
[null,null,null,null,null,null,null,null,null,null,null,null,null,null,null,null,null,null,null,null,null,null,null,null,null,null,null,null,null,null,null,null,null,null,"N/A","N/A","N/A","N/A","N/A","N/A","N/A","N/A","N/A",1,1,1,1,1,1,1,1,1]
[null,null,null,null,null,null,null,null,null,null,null,null,null,null,null,null,null,null,null,null,null,null,null,null,null,null,null,null,null,null,null,null,null,null,{"$f":"IF(COUNTA(E1198:G1198)>0,(COUNTIF(E1198:G1198,\"=0\")*0+COUNTIF(E1198:G1198,\"=1\")*100+COUNTIF(E1198:G1198,\"=2\")*80+COUNTIF(E1198:G1198,\"=3\")*50+COUNTIF(E1198:G1198,\"=8\")*20+COUNTIF(E1198:G1198,\"=9\")*0)/COUNTA(E1198:G1198)/100,\"N/A\")","v":"N/A"},{"$f":"IF(COUNTA(H1198:J1198)>0,(COUNTIF(H1198:J1198,\"=0\")*0+COUNTIF(H1198:J1198,\"=1\")*100+COUNTIF(H1198:J1198,\"=2\")*80+COUNTIF(H1198:J1198,\"=3\")*50+COUNTIF(H1198:J1198,\"=8\")*20+COUNTIF(H1198:J1198,\"=9\")*0)/COUNTA(H1198:J1198)/100,\"N/A\")","v":"N/A"},{"$f":"IF(COUNTA(K1198:M1198)>0,(COUNTIF(K1198:M1198,\"=0\")*0+COUNTIF(K1198:M1198,\"=1\")*100+COUNTIF(K1198:M1198,\"=2\")*80+COUNTIF(K1198:M1198,\"=3\")*50+COUNTIF(K1198:M1198,\"=8\")*20+COUNTIF(K1198:M1198,\"=9\")*0)/COUNTA(K1198:M1198)/100,\"N/A\")","v":"N/A"},{"$f":"IF(COUNTA(N1198:V1198)>0,(COUNTIF(N1198:V1198,\"=0\")*0+COUNTIF(N1198:V1198,\"=1\")*100+COUNTIF(N1198:V1198,\"=2\")*80+COUNTIF(N1198:V1198,\"=3\")*50+COUNTIF(N1198:V1198,\"=8\")*20+COUNTIF(N1198:V1198,\"=9\")*0)/COUNTA(N1198:V1198)/100,\"N/A\")","v":"N/A"},{"$f":"IF(COUNTA(W1198:AA1198)>0,(COUNTIF(W1198:AA1198,\"=0\")*0+COUNTIF(W1198:AA1198,\"=1\")*100+COUNTIF(W1198:AA1198,\"=2\")*80+COUNTIF(W1198:AA1198,\"=3\")*50+COUNTIF(W1198:AA1198,\"=8\")*20+COUNTIF(W1198:AA1198,\"=9\")*0)/COUNTA(W1198:AA1198)/100,\"N/A\")","v":"N/A"},{"$f":"IF(COUNTA(AB1198:AC1198)>0,(COUNTIF(AB1198:AC1198,\"=0\")*0+COUNTIF(AB1198:AC1198,\"=1\")*100+COUNTIF(AB1198:AC1198,\"=2\")*80+COUNTIF(AB1198:AC1198,\"=3\")*50+COUNTIF(AB1198:AC1198,\"=8\")*20+COUNTIF(AB1198:AC1198,\"=9\")*0)/COUNTA(AB1198:AC1198)/100,\"N/A\")","v":"N/A"},{"$f":"IF(COUNTA((AD1198:AF1198))>0,(COUNTIF((AD1198:AF1198),\"=0\")*0+COUNTIF((AD1198:AF1198),\"=1\")*100+COUNTIF((AD1198:AF1198),\"=2\")*80+COUNTIF((AD1198:AF1198),\"=3\")*50+COUNTIF((AD1198:AF1198),\"=8\")*20+COUNTIF((AD1198:AF1198),\"=9\")*0)/COUNTA((AD1198:AF1198))/100,\"N/A\")","v":"N/A"},{"$f":"IF(COUNTA(AG1198:AH1198)>0,(COUNTIF(AG1198:AH1198,\"=0\")*0+COUNTIF(AG1198:AH1198,\"=1\")*100+COUNTIF(AG1198:AH1198,\"=2\")*80+COUNTIF(AG1198:AH1198,\"=3\")*50+COUNTIF(AG1198:AH1198,\"=8\")*20+COUNTIF(AG1198:AH1198,\"=9\")*0)/COUNTA(AG1198:AH1198)/100,\"N/A\")","v":"N/A"},{"$f":"IF(AND(COUNTA(E1198:AH1198)<>0,B1198<>\"\"),AVERAGE(AL1198:AP1198,AI1198),\"N/A\")","v":"N/A"},1,1,1,1,1,1,1,1,1]
[null,null,null,null,null,null,null,null,null,null,null,null,null,null,null,null,null,null,null,null,null,null,null,null,null,null,null,null,null,null,null,null,null,null,"N/A","N/A","N/A","N/A","N/A","N/A","N/A","N/A","N/A",1,1,1,1,1,1,1,1,1]
[null,null,null,null,null,null,null,null,null,null,null,null,null,null,null,null,null,null,null,null,null,null,null,null,null,null,null,null,null,null,null,null,null,null,"N/A","N/A","N/A","N/A","N/A","N/A","N/A","N/A","N/A",1,1,1,1,1,1,1,1,1]
[null,null,null,null,null,null,null,null,null,null,null,null,null,null,null,null,null,null,null,null,null,null,null,null,null,null,null,null,null,null,null,null,null,null,"N/A","N/A","N/A","N/A","N/A","N/A","N/A","N/A","N/A",1,1,1,1,1,1,1,1,1]
[null,null,null,null,null,null,null,null,null,null,null,null,null,null,null,null,null,null,null,null,null,null,null,null,null,null,null,null,null,null,null,null,null,null,"N/A","N/A","N/A","N/A","N/A","N/A","N/A","N/A","N/A",1,1,1,1,1,1,1,1,1]
[null,null,null,null,null,null,null,null,null,null,null,null,null,null,null,null,null,null,null,null,null,null,null,null,null,null,null,null,null,null,null,null,null,null,"N/A","N/A","N/A","N/A","N/A","N/A","N/A","N/A","N/A",1,1,1,1,1,1,1,1,1]
[null,null,null,null,null,null,null,null,null,null,null,null,null,null,null,null,null,null,null,null,null,null,null,null,null,null,null,null,null,null,null,null,null,null,"N/A","N/A","N/A","N/A","N/A","N/A","N/A","N/A","N/A",1,1,1,1,1,1,1,1,1]
[null,null,null,null,null,null,null,null,null,null,null,null,null,null,null,null,null,null,null,null,null,null,null,null,null,null,null,null,null,null,null,null,null,null,"N/A","N/A","N/A","N/A","N/A","N/A","N/A","N/A","N/A",1,1,1,1,1,1,1,1,1]
[null,null,null,null,null,null,null,null,null,null,null,null,null,null,null,null,null,null,null,null,null,null,null,null,null,null,null,null,null,null,null,null,null,null,"N/A","N/A","N/A","N/A","N/A","N/A","N/A","N/A","N/A",1,1,1,1,1,{"$f":"IF(AN1206=\"N/A\",1,\"\")","v":1},1,1,1]
[null,null,null,null,null,null,null,null,null,null,null,null,null,null,null,null,null,null,null,null,null,null,null,null,null,null,null,null,null,null,null,null,null,null,"N/A","N/A","N/A","N/A","N/A","N/A","N/A","N/A","N/A",1,1,1,1,1,{"$f":"IF(AN1207=\"N/A\",1,\"\")","v":1},1,1,1]
[null,null,null,null,null,null,null,null,null,null,null,null,null,null,null,null,null,null,null,null,null,null,null,null,null,null,null,null,null,null,null,null,null,null,"N/A","N/A","N/A","N/A","N/A","N/A","N/A","N/A","N/A",1,1,1,1,1,{"$f":"IF(AN1208=\"N/A\",1,\"\")","v":1},1,1,1]
[null,null,null,null,null,null,null,null,null,null,null,null,null,null,null,null,null,null,null,null,null,null,null,null,null,null,null,null,null,null,null,null,null,null,"N/A","N/A","N/A","N/A","N/A","N/A","N/A","N/A","N/A",1,1,1,1,1,{"$f":"IF(AN1209=\"N/A\",1,\"\")","v":1},1,1,1]
[null,null,null,null,null,null,null,null,null,null,null,null,null,null,null,null,null,null,null,null,null,null,null,null,null,null,null,null,null,null,null,null,null,null,"N/A","N/A","N/A","N/A","N/A","N/A","N/A","N/A","N/A",1,1,1,1,1,1,1,1,1]
[null,null,null,null,null,null,null,null,null,null,null,null,null,null,null,null,null,null,null,null,null,null,null,null,null,null,null,null,null,null,null,null,null,null,"N/A","N/A","N/A","N/A","N/A","N/A","N/A","N/A","N/A",1,1,1,1,1,1,1,{"$f":"IF(AP1211=\"N/A\",1,\"\")","v":1},1]
[null,null,null,null,null,null,null,null,null,null,null,null,null,null,null,null,null,null,null,null,null,null,null,null,null,null,null,null,null,null,null,null,null,null,"N/A","N/A","N/A","N/A","N/A","N/A","N/A","N/A","N/A",1,1,1,1,1,1,1,1,1]
[null,null,null,null,null,null,null,null,null,null,null,null,null,null,null,null,null,null,null,null,null,null,null,null,null,null,null,null,null,null,null,null,null,null,"N/A","N/A","N/A","N/A","N/A","N/A","N/A","N/A","N/A",1,1,1,1,1,1,1,1,1]
[null,null,null,null,null,null,null,null,null,null,null,null,null,null,null,null,null,null,null,null,null,null,null,null,null,null,null,null,null,null,null,null,null,null,"N/A","N/A","N/A","N/A","N/A","N/A","N/A","N/A","N/A",1,1,1,1,1,1,1,1,1]
[null,null,null,null,null,null,null,null,null,null,null,null,null,null,null,null,null,null,null,null,null,null,null,null,null,null,null,null,null,null,null,null,null,null,"N/A","N/A","N/A","N/A","N/A","N/A","N/A","N/A","N/A",1,1,1,1,1,1,1,1,1]
[null,null,null,null,null,null,null,null,null,null,null,null,null,null,null,null,null,null,null,null,null,null,null,null,null,null,null,null,null,null,null,null,null,null,"N/A","N/A","N/A","N/A","N/A","N/A","N/A","N/A","N/A",1,1,1,1,1,1,1,1,1]
[null,null,null,null,null,null,null,null,null,null,null,null,null,null,null,null,null,null,null,null,null,null,null,null,null,null,null,null,null,null,null,null,null,null,"N/A","N/A","N/A","N/A","N/A","N/A","N/A","N/A","N/A",1,1,1,1,1,1,1,1,1]
[null,null,null,null,null,null,null,null,null,null,null,null,null,null,null,null,null,null,null,null,null,null,null,null,null,null,null,null,null,null,null,null,null,null,"N/A","N/A","N/A","N/A","N/A","N/A","N/A","N/A","N/A",1,1,1,1,1,1,1,1,1]
[null,null,null,null,null,null,null,null,null,null,null,null,null,null,null,null,null,null,null,null,null,null,null,null,null,null,null,null,null,null,null,null,null,null,"N/A","N/A","N/A","N/A","N/A","N/A","N/A","N/A","N/A",1,1,1,1,1,1,1,1,1]
[null,null,null,null,null,null,null,null,null,null,null,null,null,null,null,null,null,null,null,null,null,null,null,null,null,null,null,null,null,null,null,null,null,null,"N/A","N/A","N/A","N/A","N/A","N/A","N/A","N/A","N/A",1,1,1,1,1,1,1,1,1]
[null,null,null,null,null,null,null,null,null,null,null,null,null,null,null,null,null,null,null,null,null,null,null,null,null,null,null,null,null,null,null,null,null,null,"N/A","N/A","N/A","N/A","N/A","N/A","N/A","N/A","N/A",1,1,1,1,1,1,1,1,1]
[null,null,null,null,null,null,null,null,null,null,null,null,null,null,null,null,null,null,null,null,null,null,null,null,null,null,null,null,null,null,null,null,null,null,"N/A","N/A","N/A","N/A","N/A","N/A","N/A","N/A","N/A",1,1,1,1,1,1,1,1,1]
[null,null,null,null,null,null,null,null,null,null,null,null,null,null,null,null,null,null,null,null,null,null,null,null,null,null,null,null,null,null,null,null,null,null,"N/A","N/A","N/A","N/A","N/A","N/A","N/A","N/A","N/A",{"$f":"IF(AI1223=\"N/A\",1,\"\")","v":1},1,1,1,1,1,1,1,1]
[null,null,null,null,null,null,null,null,null,null,null,null,null,null,null,null,null,null,null,null,null,null,null,null,null,null,null,null,null,null,null,null,null,null,"N/A","N/A","N/A","N/A","N/A","N/A","N/A","N/A","N/A",1,1,1,1,1,1,1,1,1]
[null,null,null,null,null,null,null,null,null,null,null,null,null,null,null,null,null,null,null,null,null,null,null,null,null,null,null,null,null,null,null,null,null,null,"N/A","N/A","N/A","N/A","N/A","N/A","N/A","N/A","N/A",1,1,1,1,1,1,1,1,1]
[null,null,null,null,null,null,null,null,null,null,null,null,null,null,null,null,null,null,null,null,null,null,null,null,null,null,null,null,null,null,null,null,null,null,"N/A","N/A","N/A","N/A","N/A","N/A","N/A","N/A","N/A",1,1,1,1,1,1,1,1,1]
[null,null,null,null,null,null,null,null,null,null,null,null,null,null,null,null,null,null,null,null,null,null,null,null,null,null,null,null,null,null,null,null,null,null,"N/A","N/A","N/A","N/A","N/A","N/A","N/A","N/A","N/A",1,1,1,1,1,1,1,1,1]
[null,null,null,null,null,null,null,null,null,null,null,null,null,null,null,null,null,null,null,null,null,null,null,null,null,null,null,null,null,null,null,null,null,null,"N/A","N/A","N/A","N/A","N/A","N/A","N/A","N/A","N/A",1,1,1,1,1,1,1,1,1]
[null,null,null,null,null,null,null,null,null,null,null,null,null,null,null,null,null,null,null,null,null,null,null,null,null,null,null,null,null,null,null,null,null,null,"N/A","N/A","N/A","N/A","N/A","N/A","N/A","N/A","N/A",1,1,1,1,1,1,1,1,1]
[null,null,null,null,null,null,null,null,null,null,null,null,null,null,null,null,null,null,null,null,null,null,null,null,null,null,null,null,null,null,null,null,null,null,"N/A","N/A","N/A","N/A","N/A","N/A","N/A","N/A","N/A",1,1,1,1,1,1,1,1,1]
[null,null,null,null,null,null,null,null,null,null,null,null,null,null,null,null,null,null,null,null,null,null,null,null,null,null,null,null,null,null,null,null,null,null,"N/A","N/A","N/A","N/A","N/A","N/A","N/A","N/A","N/A",1,1,1,1,1,1,1,1,1]
[null,null,null,null,null,null,null,null,null,null,null,null,null,null,null,null,null,null,null,null,null,null,null,null,null,null,null,null,null,null,null,null,null,null,"N/A","N/A","N/A","N/A","N/A","N/A","N/A","N/A","N/A",1,1,1,1,1,1,1,1,1]
[null,null,null,null,null,null,null,null,null,null,null,null,null,null,null,null,null,null,null,null,null,null,null,null,null,null,null,null,null,null,null,null,null,null,"N/A","N/A","N/A","N/A","N/A","N/A","N/A","N/A","N/A",1,1,1,1,1,1,1,1,1]
[null,null,null,null,null,null,null,null,null,null,null,null,null,null,null,null,null,null,null,null,null,null,null,null,null,null,null,null,null,null,null,null,null,null,"N/A","N/A","N/A","N/A","N/A","N/A","N/A","N/A","N/A",1,1,1,1,1,1,1,1,1]
[null,null,null,null,null,null,null,null,null,null,null,null,null,null,null,null,null,null,null,null,null,null,null,null,null,null,null,null,null,null,null,null,null,null,"N/A","N/A","N/A","N/A","N/A","N/A","N/A","N/A","N/A",1,1,1,1,1,1,1,1,1]
[null,null,null,null,null,null,null,null,null,null,null,null,null,null,null,null,null,null,null,null,null,null,null,null,null,null,null,null,null,null,null,null,null,null,"N/A","N/A","N/A","N/A","N/A","N/A","N/A","N/A","N/A",1,1,1,1,1,1,1,1,1]
[null,null,null,null,null,null,null,null,null,null,null,null,null,null,null,null,null,null,null,null,null,null,null,null,null,null,null,null,null,null,null,null,null,null,"N/A","N/A","N/A","N/A","N/A","N/A","N/A","N/A","N/A",1,1,1,1,1,1,1,1,1]
[null,null,null,null,null,null,null,null,null,null,null,null,null,null,null,null,null,null,null,null,null,null,null,null,null,null,null,null,null,null,null,null,null,null,"N/A","N/A","N/A","N/A","N/A","N/A","N/A","N/A","N/A",1,1,1,1,1,1,1,1,1]
[null,null,null,null,null,null,null,null,null,null,null,null,null,null,null,null,null,null,null,null,null,null,null,null,null,null,null,null,null,null,null,null,null,null,"N/A","N/A","N/A","N/A","N/A","N/A","N/A","N/A","N/A",1,1,1,1,1,1,1,1,1]
[null,null,null,null,null,null,null,null,null,null,null,null,null,null,null,null,null,null,null,null,null,null,null,null,null,null,null,null,null,null,null,null,null,null,"N/A","N/A","N/A","N/A","N/A","N/A","N/A","N/A","N/A",1,1,1,1,1,1,1,1,1]
[null,null,null,null,null,null,null,null,null,null,null,null,null,null,null,null,null,null,null,null,null,null,null,null,null,null,null,null,null,null,null,null,null,null,"N/A","N/A","N/A","N/A","N/A","N/A","N/A","N/A","N/A",1,1,1,1,1,1,1,1,1]
[null,null,null,null,null,null,null,null,null,null,null,null,null,null,null,null,null,null,null,null,null,null,null,null,null,null,null,null,null,null,null,null,null,null,"N/A","N/A","N/A","N/A","N/A","N/A","N/A","N/A","N/A",1,1,1,1,1,1,1,1,1]
[null,null,null,null,null,null,null,null,null,null,null,null,null,null,null,null,null,null,null,null,null,null,null,null,null,null,null,null,null,null,null,null,null,null,"N/A","N/A","N/A","N/A","N/A","N/A","N/A","N/A","N/A",1,1,1,1,1,1,1,1,1]
[null,null,null,null,null,null,null,null,null,null,null,null,null,null,null,null,null,null,null,null,null,null,null,null,null,null,null,null,null,null,null,null,null,null,"N/A","N/A","N/A","N/A","N/A","N/A","N/A","N/A","N/A",1,1,1,1,1,1,1,1,1]
[null,null,null,null,null,null,null,null,null,null,null,null,null,null,null,null,null,null,null,null,null,null,null,null,null,null,null,null,null,null,null,null,null,null,"N/A","N/A","N/A","N/A","N/A","N/A","N/A","N/A","N/A",1,1,1,1,1,1,1,1,1]
[null,null,null,null,null,null,null,null,null,null,null,null,null,null,null,null,null,null,null,null,null,null,null,null,null,null,null,null,null,null,null,null,null,null,"N/A","N/A","N/A","N/A","N/A","N/A","N/A","N/A","N/A",1,1,1,1,1,1,1,1,1]
[null,null,null,null,null,null,null,null,null,null,null,null,null,null,null,null,null,null,null,null,null,null,null,null,null,null,null,null,null,null,null,null,null,null,"N/A","N/A","N/A","N/A","N/A","N/A","N/A","N/A","N/A",1,1,1,1,1,1,1,1,1]
[null,null,null,null,null,null,null,null,null,null,null,null,null,null,null,null,null,null,null,null,null,null,null,null,null,null,null,null,null,null,null,null,null,null,"N/A","N/A","N/A","N/A","N/A","N/A","N/A","N/A","N/A",1,1,1,1,1,1,1,1,1]
[null,null,null,null,null,null,null,null,null,null,null,null,null,null,null,null,null,null,null,null,null,null,null,null,null,null,null,null,null,null,null,null,null,null,"N/A","N/A","N/A","N/A","N/A","N/A","N/A","N/A","N/A",1,1,1,1,1,1,1,1,1]
[null,null,null,null,null,null,null,null,null,null,null,null,null,null,null,null,null,null,null,null,null,null,null,null,null,null,null,null,null,null,null,null,null,null,"N/A","N/A","N/A","N/A","N/A","N/A","N/A","N/A","N/A",1,1,1,1,1,1,1,1,1]
[null,null,null,null,null,null,null,null,null,null,null,null,null,null,null,null,null,null,null,null,null,null,null,null,null,null,null,null,null,null,null,null,null,null,"N/A","N/A","N/A","N/A","N/A","N/A","N/A","N/A","N/A",1,1,1,1,1,1,1,1,1]
[null,null,null,null,null,null,null,null,null,null,null,null,null,null,null,null,null,null,null,null,null,null,null,null,null,null,null,null,null,null,null,null,null,null,"N/A","N/A","N/A","N/A","N/A","N/A","N/A","N/A","N/A",1,1,1,1,1,1,1,1,1]
[null,null,null,null,null,null,null,null,null,null,null,null,null,null,null,null,null,null,null,null,null,null,null,null,null,null,null,null,null,null,null,null,null,null,"N/A","N/A","N/A","N/A","N/A","N/A","N/A","N/A","N/A",1,1,1,1,1,1,1,1,1]
[null,null,null,null,null,null,null,null,null,null,null,null,null,null,null,null,null,null,null,null,null,null,null,null,null,null,null,null,null,null,null,null,null,null,"N/A","N/A","N/A","N/A","N/A","N/A","N/A","N/A","N/A",1,1,1,1,1,1,1,1,1]
[null,null,null,null,null,null,null,null,null,null,null,null,null,null,null,null,null,null,null,null,null,null,null,null,null,null,null,null,null,null,null,null,null,null,"N/A","N/A","N/A","N/A","N/A","N/A","N/A","N/A","N/A",1,1,1,1,1,1,1,1,1]
[null,null,null,null,null,null,null,null,null,null,null,null,null,null,null,null,null,null,null,null,null,null,null,null,null,null,null,null,null,null,null,null,null,null,"N/A","N/A","N/A","N/A","N/A","N/A","N/A","N/A","N/A",1,1,1,1,1,1,1,1,1]
[null,null,null,null,null,null,null,null,null,null,null,null,null,null,null,null,null,null,null,null,null,null,null,null,null,null,null,null,null,null,null,null,null,null,"N/A","N/A","N/A","N/A","N/A","N/A","N/A","N/A","N/A",1,1,1,1,1,1,1,1,1]
[null,null,null,null,null,null,null,null,null,null,null,null,null,null,null,null,null,null,null,null,null,null,null,null,null,null,null,null,null,null,null,null,null,null,"N/A","N/A","N/A","N/A","N/A","N/A","N/A","N/A","N/A",1,1,1,1,1,1,1,1,1]
[null,null,null,null,null,null,null,null,null,null,null,null,null,null,null,null,null,null,null,null,null,null,null,null,null,null,null,null,null,null,null,null,null,null,"N/A","N/A","N/A","N/A","N/A","N/A","N/A","N/A","N/A",1,1,1,{"$f":"IF(AL1259=\"N/A\",1,\"\")","v":1},1,1,1,1,1]
[null,null,null,null,null,null,null,null,null,null,null,null,null,null,null,null,null,null,null,null,null,null,null,null,null,null,null,null,null,null,null,null,null,null,"N/A","N/A","N/A","N/A","N/A","N/A","N/A","N/A","N/A",{"$f":"IF(AI1260=\"N/A\",1,\"\")","v":1},1,1,1,1,1,1,1,1]
[null,null,null,null,null,null,null,null,null,null,null,null,null,null,null,null,null,null,null,null,null,null,null,null,null,null,null,null,null,null,null,null,null,null,"N/A","N/A","N/A","N/A","N/A","N/A","N/A","N/A","N/A",1,1,1,1,1,1,1,1,1]
[null,null,null,null,null,null,null,null,null,null,null,null,null,null,null,null,null,null,null,null,null,null,null,null,null,null,null,null,null,null,null,null,null,null,{"$f":"IF(COUNTA(E1262:G1262)>0,(COUNTIF(E1262:G1262,\"=0\")*0+COUNTIF(E1262:G1262,\"=1\")*100+COUNTIF(E1262:G1262,\"=2\")*80+COUNTIF(E1262:G1262,\"=3\")*50+COUNTIF(E1262:G1262,\"=8\")*20+COUNTIF(E1262:G1262,\"=9\")*0)/COUNTA(E1262:G1262)/100,\"N/A\")","v":"N/A"},{"$f":"IF(COUNTA(H1262:J1262)>0,(COUNTIF(H1262:J1262,\"=0\")*0+COUNTIF(H1262:J1262,\"=1\")*100+COUNTIF(H1262:J1262,\"=2\")*80+COUNTIF(H1262:J1262,\"=3\")*50+COUNTIF(H1262:J1262,\"=8\")*20+COUNTIF(H1262:J1262,\"=9\")*0)/COUNTA(H1262:J1262)/100,\"N/A\")","v":"N/A"},{"$f":"IF(COUNTA(K1262:M1262)>0,(COUNTIF(K1262:M1262,\"=0\")*0+COUNTIF(K1262:M1262,\"=1\")*100+COUNTIF(K1262:M1262,\"=2\")*80+COUNTIF(K1262:M1262,\"=3\")*50+COUNTIF(K1262:M1262,\"=8\")*20+COUNTIF(K1262:M1262,\"=9\")*0)/COUNTA(K1262:M1262)/100,\"N/A\")","v":"N/A"},{"$f":"IF(COUNTA(N1262:V1262)>0,(COUNTIF(N1262:V1262,\"=0\")*0+COUNTIF(N1262:V1262,\"=1\")*100+COUNTIF(N1262:V1262,\"=2\")*80+COUNTIF(N1262:V1262,\"=3\")*50+COUNTIF(N1262:V1262,\"=8\")*20+COUNTIF(N1262:V1262,\"=9\")*0)/COUNTA(N1262:V1262)/100,\"N/A\")","v":"N/A"},{"$f":"IF(COUNTA(W1262:AA1262)>0,(COUNTIF(W1262:AA1262,\"=0\")*0+COUNTIF(W1262:AA1262,\"=1\")*100+COUNTIF(W1262:AA1262,\"=2\")*80+COUNTIF(W1262:AA1262,\"=3\")*50+COUNTIF(W1262:AA1262,\"=8\")*20+COUNTIF(W1262:AA1262,\"=9\")*0)/COUNTA(W1262:AA1262)/100,\"N/A\")","v":"N/A"},{"$f":"IF(COUNTA(AB1262:AC1262)>0,(COUNTIF(AB1262:AC1262,\"=0\")*0+COUNTIF(AB1262:AC1262,\"=1\")*100+COUNTIF(AB1262:AC1262,\"=2\")*80+COUNTIF(AB1262:AC1262,\"=3\")*50+COUNTIF(AB1262:AC1262,\"=8\")*20+COUNTIF(AB1262:AC1262,\"=9\")*0)/COUNTA(AB1262:AC1262)/100,\"N/A\")","v":"N/A"},{"$f":"IF(COUNTA((AD1262:AF1262))>0,(COUNTIF((AD1262:AF1262),\"=0\")*0+COUNTIF((AD1262:AF1262),\"=1\")*100+COUNTIF((AD1262:AF1262),\"=2\")*80+COUNTIF((AD1262:AF1262),\"=3\")*50+COUNTIF((AD1262:AF1262),\"=8\")*20+COUNTIF((AD1262:AF1262),\"=9\")*0)/COUNTA((AD1262:AF1262))/100,\"N/A\")","v":"N/A"},{"$f":"IF(COUNTA(AG1262:AH1262)>0,(COUNTIF(AG1262:AH1262,\"=0\")*0+COUNTIF(AG1262:AH1262,\"=1\")*100+COUNTIF(AG1262:AH1262,\"=2\")*80+COUNTIF(AG1262:AH1262,\"=3\")*50+COUNTIF(AG1262:AH1262,\"=8\")*20+COUNTIF(AG1262:AH1262,\"=9\")*0)/COUNTA(AG1262:AH1262)/100,\"N/A\")","v":"N/A"},{"$f":"IF(AND(COUNTA(E1262:AH1262)<>0,B1262<>\"\"),AVERAGE(AL1262:AP1262,AI1262),\"N/A\")","v":"N/A"},1,1,1,1,1,1,1,1,1]
[null,null,null,null,null,null,null,null,null,null,null,null,null,null,null,null,null,null,null,null,null,null,null,null,null,null,null,null,null,null,null,null,null,null,"N/A","N/A","N/A","N/A","N/A","N/A","N/A","N/A","N/A",1,1,1,1,1,1,1,1,1]
[null,null,null,null,null,null,null,null,null,null,null,null,null,null,null,null,null,null,null,null,null,null,null,null,null,null,null,null,null,null,null,null,null,null,"N/A","N/A","N/A","N/A","N/A","N/A","N/A","N/A","N/A",1,1,1,1,1,1,1,1,1]
[null,null,null,null,null,null,null,null,null,null,null,null,null,null,null,null,null,null,null,null,null,null,null,null,null,null,null,null,null,null,null,null,null,null,"N/A","N/A","N/A","N/A","N/A","N/A","N/A","N/A","N/A",1,1,1,1,1,1,1,1,1]
[null,null,null,null,null,null,null,null,null,null,null,null,null,null,null,null,null,null,null,null,null,null,null,null,null,null,null,null,null,null,null,null,null,null,"N/A","N/A","N/A","N/A","N/A","N/A","N/A","N/A","N/A",1,1,1,1,1,1,1,1,1]
[null,null,null,null,null,null,null,null,null,null,null,null,null,null,null,null,null,null,null,null,null,null,null,null,null,null,null,null,null,null,null,null,null,null,"N/A","N/A","N/A","N/A","N/A","N/A","N/A","N/A","N/A",1,1,1,1,1,1,1,1,1]
[null,null,null,null,null,null,null,null,null,null,null,null,null,null,null,null,null,null,null,null,null,null,null,null,null,null,null,null,null,null,null,null,null,null,"N/A","N/A","N/A","N/A","N/A","N/A","N/A","N/A","N/A",1,1,1,1,1,1,1,1,1]
[null,null,null,null,null,null,null,null,null,null,null,null,null,null,null,null,null,null,null,null,null,null,null,null,null,null,null,null,null,null,null,null,null,null,"N/A","N/A","N/A","N/A","N/A","N/A","N/A","N/A","N/A",1,1,1,1,1,1,1,1,1]
[null,null,null,null,null,null,null,null,null,null,null,null,null,null,null,null,null,null,null,null,null,null,null,null,null,null,null,null,null,null,null,null,null,null,"N/A","N/A","N/A","N/A","N/A","N/A","N/A","N/A","N/A",1,1,1,1,1,1,1,1,1]
[null,null,null,null,null,null,null,null,null,null,null,null,null,null,null,null,null,null,null,null,null,null,null,null,null,null,null,null,null,null,null,null,null,null,"N/A","N/A","N/A","N/A","N/A","N/A","N/A","N/A","N/A",1,1,1,1,1,1,1,1,1]
[null,null,null,null,null,null,null,null,null,null,null,null,null,null,null,null,null,null,null,null,null,null,null,null,null,null,null,null,null,null,null,null,null,null,"N/A","N/A","N/A","N/A","N/A","N/A","N/A","N/A","N/A",1,1,1,1,1,1,1,1,1]
[null,null,null,null,null,null,null,null,null,null,null,null,null,null,null,null,null,null,null,null,null,null,null,null,null,null,null,null,null,null,null,null,null,null,"N/A","N/A","N/A","N/A","N/A","N/A","N/A","N/A","N/A",1,1,1,1,1,1,1,1,1]
[null,null,null,null,null,null,null,null,null,null,null,null,null,null,null,null,null,null,null,null,null,null,null,null,null,null,null,null,null,null,null,null,null,null,"N/A","N/A","N/A","N/A","N/A","N/A","N/A","N/A","N/A",1,1,1,1,1,1,1,1,1]
[null,null,null,null,null,null,null,null,null,null,null,null,null,null,null,null,null,null,null,null,null,null,null,null,null,null,null,null,null,null,null,null,null,null,"N/A","N/A","N/A","N/A","N/A","N/A","N/A","N/A","N/A",1,1,1,1,1,1,1,1,1]
[null,null,null,null,null,null,null,null,null,null,null,null,null,null,null,null,null,null,null,null,null,null,null,null,null,null,null,null,null,null,null,null,null,null,"N/A","N/A","N/A","N/A","N/A","N/A","N/A","N/A","N/A",1,1,1,1,1,1,1,1,1]
[null,null,null,null,null,null,null,null,null,null,null,null,null,null,null,null,null,null,null,null,null,null,null,null,null,null,null,null,null,null,null,null,null,null,"N/A","N/A","N/A","N/A","N/A","N/A","N/A","N/A","N/A",1,1,1,1,1,1,1,1,1]
[null,null,null,null,null,null,null,null,null,null,null,null,null,null,null,null,null,null,null,null,null,null,null,null,null,null,null,null,null,null,null,null,null,null,"N/A","N/A","N/A","N/A","N/A","N/A","N/A","N/A","N/A",1,1,1,1,1,1,1,1,1]
[null,null,null,null,null,null,null,null,null,null,null,null,null,null,null,null,null,null,null,null,null,null,null,null,null,null,null,null,null,null,null,null,null,null,"N/A","N/A","N/A","N/A","N/A","N/A","N/A","N/A","N/A",1,1,1,1,1,1,1,1,1]
[null,null,null,null,null,null,null,null,null,null,null,null,null,null,null,null,null,null,null,null,null,null,null,null,null,null,null,null,null,null,null,null,null,null,"N/A","N/A","N/A","N/A","N/A","N/A","N/A","N/A","N/A",1,1,1,1,1,1,1,1,1]
[null,null,null,null,null,null,null,null,null,null,null,null,null,null,null,null,null,null,null,null,null,null,null,null,null,null,null,null,null,null,null,null,null,null,"N/A","N/A","N/A","N/A","N/A","N/A","N/A","N/A","N/A",1,1,1,1,1,1,1,1,1]
[null,null,null,null,null,null,null,null,null,null,null,null,null,null,null,null,null,null,null,null,null,null,null,null,null,null,null,null,null,null,null,null,null,null,"N/A","N/A","N/A","N/A","N/A","N/A","N/A","N/A","N/A",1,1,1,1,1,1,1,1,1]
[null,null,null,null,null,null,null,null,null,null,null,null,null,null,null,null,null,null,null,null,null,null,null,null,null,null,null,null,null,null,null,null,null,null,"N/A","N/A","N/A","N/A","N/A","N/A","N/A","N/A","N/A",1,1,1,1,1,1,1,1,1]
[null,null,null,null,null,null,null,null,null,null,null,null,null,null,null,null,null,null,null,null,null,null,null,null,null,null,null,null,null,null,null,null,null,null,"N/A","N/A","N/A","N/A","N/A","N/A","N/A","N/A","N/A",1,1,1,1,1,1,1,1,1]
[null,null,null,null,null,null,null,null,null,null,null,null,null,null,null,null,null,null,null,null,null,null,null,null,null,null,null,null,null,null,null,null,null,null,"N/A","N/A","N/A","N/A","N/A","N/A","N/A","N/A","N/A",1,1,1,1,1,1,1,1,1]
[null,null,null,null,null,null,null,null,null,null,null,null,null,null,null,null,null,null,null,null,null,null,null,null,null,null,null,null,null,null,null,null,null,null,"N/A","N/A","N/A","N/A","N/A","N/A","N/A","N/A","N/A",1,1,1,1,1,1,1,1,1]
[null,null,null,null,null,null,null,null,null,null,null,null,null,null,null,null,null,null,null,null,null,null,null,null,null,null,null,null,null,null,null,null,null,null,"N/A","N/A","N/A","N/A","N/A","N/A","N/A","N/A","N/A",1,1,1,1,1,1,1,1,1]
[null,null,null,null,null,null,null,null,null,null,null,null,null,null,null,null,null,null,null,null,null,null,null,null,null,null,null,null,null,null,null,null,null,null,"N/A","N/A","N/A","N/A","N/A","N/A","N/A","N/A","N/A",1,1,1,1,1,1,1,1,1]
[null,null,null,null,null,null,null,null,null,null,null,null,null,null,null,null,null,null,null,null,null,null,null,null,null,null,null,null,null,null,null,null,null,null,"N/A","N/A","N/A","N/A","N/A","N/A","N/A","N/A","N/A",1,1,1,1,1,1,1,1,1]
[null,null,null,null,null,null,null,null,null,null,null,null,null,null,null,null,null,null,null,null,null,null,null,null,null,null,null,null,null,null,null,null,null,null,"N/A","N/A","N/A","N/A","N/A","N/A","N/A","N/A","N/A",1,1,1,1,1,1,1,1,1]
[null,null,null,null,null,null,null,null,null,null,null,null,null,null,null,null,null,null,null,null,null,null,null,null,null,null,null,null,null,null,null,null,null,null,"N/A","N/A","N/A","N/A","N/A","N/A","N/A","N/A","N/A",1,1,1,1,1,1,1,1,1]
[null,null,null,null,null,null,null,null,null,null,null,null,null,null,null,null,null,null,null,null,null,null,null,null,null,null,null,null,null,null,null,null,null,null,"N/A","N/A","N/A","N/A","N/A","N/A","N/A","N/A","N/A",1,1,1,1,1,1,1,1,1]
[null,null,null,null,null,null,null,null,null,null,null,null,null,null,null,null,null,null,null,null,null,null,null,null,null,null,null,null,null,null,null,null,null,null,"N/A","N/A","N/A","N/A","N/A","N/A","N/A","N/A","N/A",1,1,1,1,1,1,1,1,1]
[null,null,null,null,null,null,null,null,null,null,null,null,null,null,null,null,null,null,null,null,null,null,null,null,null,null,null,null,null,null,null,null,null,null,"N/A","N/A","N/A","N/A","N/A","N/A","N/A","N/A","N/A",1,1,1,1,1,1,1,1,1]
[null,null,null,null,null,null,null,null,null,null,null,null,null,null,null,null,null,null,null,null,null,null,null,null,null,null,null,null,null,null,null,null,null,null,"N/A","N/A","N/A","N/A","N/A","N/A","N/A","N/A","N/A",1,1,1,1,1,1,1,1,1]
[null,null,null,null,null,null,null,null,null,null,null,null,null,null,null,null,null,null,null,null,null,null,null,null,null,null,null,null,null,null,null,null,null,null,"N/A","N/A","N/A","N/A","N/A","N/A","N/A","N/A","N/A",1,1,1,1,1,1,1,1,1]
[null,null,null,null,null,null,null,null,null,null,null,null,null,null,null,null,null,null,null,null,null,null,null,null,null,null,null,null,null,null,null,null,null,null,"N/A","N/A","N/A","N/A","N/A","N/A","N/A","N/A","N/A",1,1,1,1,1,1,1,1,1]
[null,null,null,null,null,null,null,null,null,null,null,null,null,null,null,null,null,null,null,null,null,null,null,null,null,null,null,null,null,null,null,null,null,null,"N/A","N/A","N/A","N/A","N/A","N/A","N/A","N/A","N/A",1,1,1,1,1,1,1,1,1]
[null,null,null,null,null,null,null,null,null,null,null,null,null,null,null,null,null,null,null,null,null,null,null,null,null,null,null,null,null,null,null,null,null,null,"N/A","N/A","N/A","N/A","N/A","N/A","N/A","N/A","N/A",1,1,1,1,1,1,1,1,1]
[null,null,null,null,null,null,null,null,null,null,null,null,null,null,null,null,null,null,null,null,null,null,null,null,null,null,null,null,null,null,null,null,null,null,"N/A","N/A","N/A","N/A","N/A","N/A","N/A","N/A","N/A",1,1,1,1,1,1,1,1,1]
[null,null,null,null,null,null,null,null,null,null,null,null,null,null,null,null,null,null,null,null,null,null,null,null,null,null,null,null,null,null,null,null,null,null,"N/A","N/A","N/A","N/A","N/A","N/A","N/A","N/A","N/A",1,1,1,1,1,1,1,1,1]
[null,null,null,null,null,null,null,null,null,null,null,null,null,null,null,null,null,null,null,null,null,null,null,null,null,null,null,null,null,null,null,null,null,null,"N/A","N/A","N/A","N/A","N/A","N/A","N/A","N/A","N/A",1,1,1,1,1,1,1,1,1]
[null,null,null,null,null,null,null,null,null,null,null,null,null,null,null,null,null,null,null,null,null,null,null,null,null,null,null,null,null,null,null,null,null,null,"N/A","N/A","N/A","N/A","N/A","N/A","N/A","N/A","N/A",1,1,1,1,1,1,1,1,1]
[null,null,null,null,null,null,null,null,null,null,null,null,null,null,null,null,null,null,null,null,null,null,null,null,null,null,null,null,null,null,null,null,null,null,"N/A","N/A","N/A","N/A","N/A","N/A","N/A","N/A","N/A",1,1,1,1,1,1,1,1,1]
[null,null,null,null,null,null,null,null,null,null,null,null,null,null,null,null,null,null,null,null,null,null,null,null,null,null,null,null,null,null,null,null,null,null,"N/A","N/A","N/A","N/A","N/A","N/A","N/A","N/A","N/A",1,1,1,1,1,1,1,1,1]
[null,null,null,null,null,null,null,null,null,null,null,null,null,null,null,null,null,null,null,null,null,null,null,null,null,null,null,null,null,null,null,null,null,null,"N/A","N/A","N/A","N/A","N/A","N/A","N/A","N/A","N/A",1,1,1,1,1,1,1,1,{"$f":"IF(AQ1306=\"N/A\",1,\"\")","v":1}]
[null,null,null,null,null,null,null,null,null,null,null,null,null,null,null,null,null,null,null,null,null,null,null,null,null,null,null,null,null,null,null,null,null,null,"N/A","N/A","N/A","N/A","N/A","N/A","N/A","N/A","N/A",1,1,1,1,1,1,1,1,1]
[null,null,null,null,null,null,null,null,null,null,null,null,null,null,null,null,null,null,null,null,null,null,null,null,null,null,null,null,null,null,null,null,null,null,"N/A","N/A","N/A","N/A","N/A","N/A","N/A","N/A","N/A",1,1,1,1,1,1,1,1,1]
[null,null,null,null,null,null,null,null,null,null,null,null,null,null,null,null,null,null,null,null,null,null,null,null,null,null,null,null,null,null,null,null,null,null,"N/A","N/A","N/A","N/A","N/A","N/A","N/A","N/A","N/A",1,1,1,1,1,1,1,1,1]
[null,null,null,null,null,null,null,null,null,null,null,null,null,null,null,null,null,null,null,null,null,null,null,null,null,null,null,null,null,null,null,null,null,null,"N/A","N/A","N/A","N/A","N/A","N/A","N/A","N/A","N/A",1,1,1,1,1,1,1,1,1]
[null,null,null,null,null,null,null,null,null,null,null,null,null,null,null,null,null,null,null,null,null,null,null,null,null,null,null,null,null,null,null,null,null,null,"N/A","N/A","N/A","N/A","N/A","N/A","N/A","N/A","N/A",1,1,1,1,1,1,1,1,1]
[null,null,null,null,null,null,null,null,null,null,null,null,null,null,null,null,null,null,null,null,null,null,null,null,null,null,null,null,null,null,null,null,null,null,"N/A","N/A","N/A","N/A","N/A","N/A","N/A","N/A","N/A",1,1,1,1,1,1,1,1,1]
[null,null,null,null,null,null,null,null,null,null,null,null,null,null,null,null,null,null,null,null,null,null,null,null,null,null,null,null,null,null,null,null,null,null,"N/A","N/A","N/A","N/A","N/A","N/A","N/A","N/A","N/A",1,1,1,1,1,1,1,1,1]
[null,null,null,null,null,null,null,null,null,null,null,null,null,null,null,null,null,null,null,null,null,null,null,null,null,null,null,null,null,null,null,null,null,null,"N/A","N/A","N/A","N/A","N/A","N/A","N/A","N/A","N/A",1,1,1,1,1,1,1,1,1]
[null,null,null,null,null,null,null,null,null,null,null,null,null,null,null,null,null,null,null,null,null,null,null,null,null,null,null,null,null,null,null,null,null,null,"N/A","N/A","N/A","N/A","N/A","N/A","N/A","N/A","N/A",1,1,1,1,1,1,1,1,1]
[null,null,null,null,null,null,null,null,null,null,null,null,null,null,null,null,null,null,null,null,null,null,null,null,null,null,null,null,null,null,null,null,null,null,"N/A","N/A","N/A","N/A","N/A","N/A","N/A","N/A","N/A",1,1,1,1,1,1,1,1,1]
[null,null,null,null,null,null,null,null,null,null,null,null,null,null,null,null,null,null,null,null,null,null,null,null,null,null,null,null,null,null,null,null,null,null,"N/A","N/A","N/A","N/A","N/A","N/A","N/A","N/A","N/A",1,1,1,1,1,1,1,1,1]
[null,null,null,null,null,null,null,null,null,null,null,null,null,null,null,null,null,null,null,null,null,null,null,null,null,null,null,null,null,null,null,null,null,null,"N/A","N/A","N/A","N/A","N/A","N/A","N/A","N/A","N/A",1,1,1,1,1,1,1,1,1]
[null,null,null,null,null,null,null,null,null,null,null,null,null,null,null,null,null,null,null,null,null,null,null,null,null,null,null,null,null,null,null,null,null,null,"N/A","N/A","N/A","N/A","N/A","N/A","N/A","N/A","N/A",1,1,1,1,1,1,1,1,1]
[null,null,null,null,null,null,null,null,null,null,null,null,null,null,null,null,null,null,null,null,null,null,null,null,null,null,null,null,null,null,null,null,null,null,"N/A","N/A","N/A","N/A","N/A","N/A","N/A","N/A","N/A",1,1,1,1,1,1,1,1,1]
[null,null,null,null,null,null,null,null,null,null,null,null,null,null,null,null,null,null,null,null,null,null,null,null,null,null,null,null,null,null,null,null,null,null,"N/A","N/A","N/A","N/A","N/A","N/A","N/A","N/A","N/A",1,1,{"$f":"IF(AK1321=\"N/A\",1,\"\")","v":1},1,1,1,1,1,1]
[null,null,null,null,null,null,null,null,null,null,null,null,null,null,null,null,null,null,null,null,null,null,null,null,null,null,null,null,null,null,null,null,null,null,"N/A","N/A","N/A","N/A","N/A","N/A","N/A","N/A","N/A",{"$f":"IF(AI1322=\"N/A\",1,\"\")","v":1},1,1,1,1,1,1,1,1]
[null,null,null,null,null,null,null,null,null,null,null,null,null,null,null,null,null,null,null,null,null,null,null,null,null,null,null,null,null,null,null,null,null,null,"N/A","N/A","N/A","N/A","N/A","N/A","N/A","N/A","N/A",1,1,1,1,1,1,1,1,1]
[null,null,null,null,null,null,null,null,null,null,null,null,null,null,null,null,null,null,null,null,null,null,null,null,null,null,null,null,null,null,null,null,null,null,"N/A","N/A","N/A","N/A","N/A","N/A","N/A","N/A","N/A",1,1,1,1,1,1,1,1,1]
[null,null,null,null,null,null,null,null,null,null,null,null,null,null,null,null,null,null,null,null,null,null,null,null,null,null,null,null,null,null,null,null,null,null,"N/A","N/A","N/A","N/A","N/A","N/A","N/A","N/A","N/A",1,1,1,1,1,1,1,1,1]
[null,null,null,null,null,null,null,null,null,null,null,null,null,null,null,null,null,null,null,null,null,null,null,null,null,null,null,null,null,null,null,null,null,null,{"$f":"IF(COUNTA(E1326:G1326)>0,(COUNTIF(E1326:G1326,\"=0\")*0+COUNTIF(E1326:G1326,\"=1\")*100+COUNTIF(E1326:G1326,\"=2\")*80+COUNTIF(E1326:G1326,\"=3\")*50+COUNTIF(E1326:G1326,\"=8\")*20+COUNTIF(E1326:G1326,\"=9\")*0)/COUNTA(E1326:G1326)/100,\"N/A\")","v":"N/A"},{"$f":"IF(COUNTA(H1326:J1326)>0,(COUNTIF(H1326:J1326,\"=0\")*0+COUNTIF(H1326:J1326,\"=1\")*100+COUNTIF(H1326:J1326,\"=2\")*80+COUNTIF(H1326:J1326,\"=3\")*50+COUNTIF(H1326:J1326,\"=8\")*20+COUNTIF(H1326:J1326,\"=9\")*0)/COUNTA(H1326:J1326)/100,\"N/A\")","v":"N/A"},{"$f":"IF(COUNTA(K1326:M1326)>0,(COUNTIF(K1326:M1326,\"=0\")*0+COUNTIF(K1326:M1326,\"=1\")*100+COUNTIF(K1326:M1326,\"=2\")*80+COUNTIF(K1326:M1326,\"=3\")*50+COUNTIF(K1326:M1326,\"=8\")*20+COUNTIF(K1326:M1326,\"=9\")*0)/COUNTA(K1326:M1326)/100,\"N/A\")","v":"N/A"},{"$f":"IF(COUNTA(N1326:V1326)>0,(COUNTIF(N1326:V1326,\"=0\")*0+COUNTIF(N1326:V1326,\"=1\")*100+COUNTIF(N1326:V1326,\"=2\")*80+COUNTIF(N1326:V1326,\"=3\")*50+COUNTIF(N1326:V1326,\"=8\")*20+COUNTIF(N1326:V1326,\"=9\")*0)/COUNTA(N1326:V1326)/100,\"N/A\")","v":"N/A"},{"$f":"IF(COUNTA(W1326:AA1326)>0,(COUNTIF(W1326:AA1326,\"=0\")*0+COUNTIF(W1326:AA1326,\"=1\")*100+COUNTIF(W1326:AA1326,\"=2\")*80+COUNTIF(W1326:AA1326,\"=3\")*50+COUNTIF(W1326:AA1326,\"=8\")*20+COUNTIF(W1326:AA1326,\"=9\")*0)/COUNTA(W1326:AA1326)/100,\"N/A\")","v":"N/A"},{"$f":"IF(COUNTA(AB1326:AC1326)>0,(COUNTIF(AB1326:AC1326,\"=0\")*0+COUNTIF(AB1326:AC1326,\"=1\")*100+COUNTIF(AB1326:AC1326,\"=2\")*80+COUNTIF(AB1326:AC1326,\"=3\")*50+COUNTIF(AB1326:AC1326,\"=8\")*20+COUNTIF(AB1326:AC1326,\"=9\")*0)/COUNTA(AB1326:AC1326)/100,\"N/A\")","v":"N/A"},{"$f":"IF(COUNTA((AD1326:AF1326))>0,(COUNTIF((AD1326:AF1326),\"=0\")*0+COUNTIF((AD1326:AF1326),\"=1\")*100+COUNTIF((AD1326:AF1326),\"=2\")*80+COUNTIF((AD1326:AF1326),\"=3\")*50+COUNTIF((AD1326:AF1326),\"=8\")*20+COUNTIF((AD1326:AF1326),\"=9\")*0)/COUNTA((AD1326:AF1326))/100,\"N/A\")","v":"N/A"},{"$f":"IF(COUNTA(AG1326:AH1326)>0,(COUNTIF(AG1326:AH1326,\"=0\")*0+COUNTIF(AG1326:AH1326,\"=1\")*100+COUNTIF(AG1326:AH1326,\"=2\")*80+COUNTIF(AG1326:AH1326,\"=3\")*50+COUNTIF(AG1326:AH1326,\"=8\")*20+COUNTIF(AG1326:AH1326,\"=9\")*0)/COUNTA(AG1326:AH1326)/100,\"N/A\")","v":"N/A"},{"$f":"IF(AND(COUNTA(E1326:AH1326)<>0,B1326<>\"\"),AVERAGE(AL1326:AP1326,AI1326),\"N/A\")","v":"N/A"},1,1,1,1,1,1,1,1,1]
[null,null,null,null,null,null,null,null,null,null,null,null,null,null,null,null,null,null,null,null,null,null,null,null,null,null,null,null,null,null,null,null,null,null,"N/A","N/A","N/A","N/A","N/A","N/A","N/A","N/A","N/A",1,1,1,1,1,1,1,1,1]
[null,null,null,null,null,null,null,null,null,null,null,null,null,null,null,null,null,null,null,null,null,null,null,null,null,null,null,null,null,null,null,null,null,null,"N/A","N/A","N/A","N/A","N/A","N/A","N/A","N/A","N/A",1,1,1,1,1,1,1,1,1]
[null,null,null,null,null,null,null,null,null,null,null,null,null,null,null,null,null,null,null,null,null,null,null,null,null,null,null,null,null,null,null,null,null,null,"N/A","N/A","N/A","N/A","N/A","N/A","N/A","N/A","N/A",1,1,1,1,1,1,1,1,1]
[null,null,null,null,null,null,null,null,null,null,null,null,null,null,null,null,null,null,null,null,null,null,null,null,null,null,null,null,null,null,null,null,null,null,"N/A","N/A","N/A","N/A","N/A","N/A","N/A","N/A","N/A",1,1,1,1,1,1,1,1,1]
[null,null,null,null,null,null,null,null,null,null,null,null,null,null,null,null,null,null,null,null,null,null,null,null,null,null,null,null,null,null,null,null,null,null,"N/A","N/A","N/A","N/A","N/A","N/A","N/A","N/A","N/A",1,1,1,1,1,1,1,1,1]
[null,null,null,null,null,null,null,null,null,null,null,null,null,null,null,null,null,null,null,null,null,null,null,null,null,null,null,null,null,null,null,null,null,null,"N/A","N/A","N/A","N/A","N/A","N/A","N/A","N/A","N/A",1,1,1,1,1,1,1,1,1]
[null,null,null,null,null,null,null,null,null,null,null,null,null,null,null,null,null,null,null,null,null,null,null,null,null,null,null,null,null,null,null,null,null,null,"N/A","N/A","N/A","N/A","N/A","N/A","N/A","N/A","N/A",1,1,1,1,1,1,1,1,1]
[null,null,null,null,null,null,null,null,null,null,null,null,null,null,null,null,null,null,null,null,null,null,null,null,null,null,null,null,null,null,null,null,null,null,"N/A","N/A","N/A","N/A","N/A","N/A","N/A","N/A","N/A",1,1,1,1,1,1,1,1,1]

{"sheet":"Synthèse","index":2,"n_rows":6,"n_cols":11,"rows_kept":6,"cut":false,"hidden":false,"merged":[]}
[]
[null,null,"Filtre\nIdentification des mots\nCompétences de base","Filtre\nIdentification des mots\nCompétences expertes","Filtre\nIdentification des mots\nReprésentation syllabique","Filtre\nIdentification des mots\nd'usage courant","Filtre\nLire\nCompréhension","Filtre\nÉcrire\nEncodage","Filtre\nÉcrire\nCopie","Filtre\nGrammaire","Filtre\nGénéral"]
["     Écoles\n             /Classes\n                         /Élèves","Nombre d'élèves","- Lire - Identitification des mots\nCompétences de base","- Lire -\nIdentification des mots\nCompétences expertes","- Lire -\nIdentification des mots\nReprésentation syllabique","- Lire -\nIdentification des mots d'usage fréquent","- Lire -\nCompréhension","- Écrire -\nEncodage","- Écrire - \nCopie","- Grammaire -","- Général -"]
["(vide)",null,"...","...","...","...","...","...","...","...","..."]
["(vide)",null,"...","...","...","...","...","...","...","...","..."]
["Total général",null,"...","...","...","...","...","...","...","...","..."]