{"text_format":"1","workbook":"xlsx","n_sheets":3,"sheets":["Notice","Saisie","Synthèse"],"not_rendered":{"charts":0,"images":3,"macros":1,"external_links":0,"defined_names":2,"comments":2,"pivot_tables":1},"unopened":[],"bounds":{"document_bytes":16777216,"sheet_cells":100000,"rows_first":2000,"rows_last":500,"rows_between":2000,"halvings":0,"cell_chars":16384,"cell_head_chars":4096},"cells_cut":0,"cells_raw":0,"read":"whole","date_system":"1900"}

{"sheet":"Notice","index":0,"n_rows":0,"n_cols":0,"rows_kept":0,"cut":false,"hidden":false,"merged":[]}

{"sheet":"Saisie","index":1,"n_rows":1334,"n_cols":71,"rows_kept":1334,"cut":false,"hidden":false,"merged":[[9,4,9,6],[11,10,12,14],[9,7,9,12],[11,4,11,9],[11,15,11,21],[12,15,12,20],[10,4,10,14],[10,50,10,51],[12,22,12,23],[12,4,12,6],[12,7,12,9],[11,36,12,41],[12,24,12,35],[12,42,12,46],[11,42,11,49],[12,47,12,49],[11,22,11,35]]}
[null,null,"Plages de codes possibles",null,1,1,1,1,1,1,1,1,1,1,1,1,1,1,1,1,1,1,1,1,1,1,1,1,1,1,1,1,1,1,1,1,1,1,1,1,1,1,1,1,1,1,1,1,1,1]
[null,null,null,null,3,3,3,2,2,2,2,9,9,2,9,9,9,9,9,9,9,2,2,3,9,9,9,9,9,9,9,9,9,9,9,9,9,9,9,9,9,9,8,2,9,9,9,2,3,8]
[null,null,null,null,8,8,8,3,3,3,9,0,0,9,0,0,0,0,0,0,0,3,9,8,0,0,0,0,0,0,0,0,0,0,0,0,0,0,0,0,0,0,9,3,0,0,0,9,9,9]
[null,null,null,null,9,9,9,9,9,9,0,null,null,0,null,null,null,null,null,null,null,8,0,9,null,null,null,null,null,null,null,null,null,null,null,null,null,null,null,null,null,null,0,9,null,null,null,0,0,0]
[null,null,null,null,0,0,0,0,0,0,null,null,null,null,null,null,null,null,null,null,null,9,null,0,null,null,null,null,null,null,null,null,null,null,null,null,null,null,null,null,null,null,null,0]
[null,null,null,null,null,null,null,null,null,null,null,null,null,null,null,null,null,null,null,null,null,0]
[]
[null,null,null,null,"EVALUATIONS DEPARTEMENTALES D'ACCOMPAGNEMENT DE L'APPRENTISSAGE DE LA LECTURE "]
[null,null,null,null,"CP  - Mai 2016"]
[null,null,null,null,"Circonscription :"]
[null,null,null,null,"Items concernant les élèves ayant obtenu moins de 50% aux évaluations de janvier",null,null,null,null,null,null,null,null,null,null,null,null,null,null,null,null,null,null,null,null,null,null,null,null,null,null,null,null,null,null,null,null,null,null,null,null,null,null,null,null,null,null,null,null,null,"< 50% en janvier"]
[null,null,null,null,"LIRE : Lire seul, à haute voix, un texte comprenant des mots connus et inconnus\n- Compétences d'assemblage -",null,null,null,null,null,"LIRE : dégager le thème d'un paragraphe, d'un texte court\n- Compétences de traitement global et de traitement local d'un texte -",null,null,null,null,"LIRE : Lire seul, à haute voix, un texte comprenant des mots connus et inconnus\n",null,null,null,null,null,null,"GRAMMAIRE ",null,null,null,null,null,null,null,null,null,null,null,null,null,"VOCABULAIRE :\n trouver un mot de sens opposé pour un adjectif\ntrouver un mot de sens opposé pour un verbe d'action\n",null,null,null,null,null,"ÉCRIRE : Écrire de manière autonome un texte de 5 à 10 lignes ",null,null,null,null,null,null,null,"A","B","C","D","E","F","G","H","A","B","C","D","E","F","G","H","I","J","K","L"]
[null,null,null,null,"Compétences de base",null,null,"Compétences expertes\n(en janvier)",null,null,null,null,null,null,null,"Lire aisément les mots les plus fréquemment rencontrés (mots-outils)",null,null,null,null,null,"Lecture à haute voix","Identifier les phrase d'un texte en s'appuyant sur la ponctuation",null,"Distinguer le nom et l’article qui le précède. Identifier l’article.\nRepérer et justifier les marques du genre et du nombre : le « s » du pluriel, le « e » du féminin\n",null,null,null,null,null,null,null,null,null,null,null,null,null,null,null,null,null,"Écrire sans erreur des mots appris choisir et écrire de manière autonome des mots simples en respectant les correspondances entre lettres et sons",null,null,null,null,"Produire une phrase simple\n\n",null,null,{"$f":"AVERAGE(AY15:AY344)","v":{"$error":"#DIV/0!"}},{"$f":"AVERAGE(AZ15:AZ344)","v":{"$error":"#DIV/0!"}},{"$error":"#DIV/0!"},{"$error":"#DIV/0!"},{"$error":"#DIV/0!"},{"$error":"#DIV/0!"},{"$error":"#DIV/0!"},{"$error":"#DIV/0!"},{"$error":"#DIV/0!"},{"$error":"#DIV/0!"}]
["ECOLE","CLASSE","NOM Prénom","Date de naiss.","L1A","L1B","L1C","L1D","L1E","L1F","L5A","L5B","L5C","L5D","L5E","L2A","L2B","L2C","L2D","L2E","L2F","L3","G1A","G1B","G2A","G2B","G2C","G2D","G2E","G2F","G2G","G2H","G2I","G2J","G2K","G2L","V1A","V1B","V1C","V1D","V1E","V1F","O1A","O1B","O1C1","O1C2","O1C3","E1A","E1B","E1C","Lire : identification des mots\nAssemblage","Lire : Compréhension","Lire : Mots outils","Lire : Lecture à haute voix","Grammaire : Phrases","Grammaire : Accords","Vocabulaire","Orthographe","Ecrire","Général"]
[null,null,null,null,null,null,null,null,null,null,null,null,null,null,null,null,null,null,null,null,null,null,null,null,null,null,null,null,null,null,null,null,null,null,null,null,null,null,null,null,null,null,null,null,null,null,null,null,null,null,{"$f":"IF(COUNTA(E15:J15)>0,(COUNTIF(E15:J15,\"=0\")*0+COUNTIF(E15:J15,\"=1\")*100+COUNTIF(E15:J15,\"=2\")*80+COUNTIF(E15:J15,\"=3\")*50+COUNTIF(E15:J15,\"=8\")*20+COUNTIF(E15:J15,\"=9\")*0)/COUNTA(E15:J15)/100,\"N/A\")","v":"N/A"},{"$f":"IF(COUNTA(K15:O15)>0,(COUNTIF(K15:O15,\"=0\")*0+COUNTIF(K15:O15,\"=1\")*100+COUNTIF(K15:O15,\"=2\")*80+COUNTIF(K15:O15,\"=3\")*50+COUNTIF(K15:O15,\"=8\")*20+COUNTIF(K15:O15,\"=9\")*0)/COUNTA(K15:O15)/100,\"N/A\")","v":"N/A"},{"$f":"IF(COUNTA(P15:U15)>0,(COUNTIF(P15:U15,\"=0\")*0+COUNTIF(P15:U15,\"=1\")*100+COUNTIF(P15:U15,\"=2\")*80+COUNTIF(P15:U15,\"=3\")*50+COUNTIF(P15:U15,\"=8\")*20+COUNTIF(P15:U15,\"=9\")*0)/COUNTA(P15:U15)/100,\"N/A\")","v":"N/A"},{"$f":"IF(COUNTA(V15)<>0,(COUNTIF(V15,\"=0\")*0+COUNTIF(V15,\"=1\")*100+COUNTIF(V15,\"=2\")*80+COUNTIF(V15,\"=3\")*50+COUNTIF(V15,\"=8\")*20+COUNTIF(V15,\"=9\")*0)/COUNTA(V15)/100,\"N/A\")","v":"N/A"},{"$f":"IF(COUNTA(W15:X15)>0,(COUNTIF(W15:X15,\"=0\")*0+COUNTIF(W15:X15,\"=1\")*100+COUNTIF(W15:X15,\"=2\")*80+COUNTIF(W15:X15,\"=3\")*50+COUNTIF(W15:X15,\"=8\")*20+COUNTIF(W15:X15,\"=9\")*0)/COUNTA(W15:X15)/100,\"N/A\")","v":"N/A"},{"$f":"IF(COUNTA(Y15:AJ15)>0,(COUNTIF(Y15:AJ15,\"=0\")*0+COUNTIF(Y15:AJ15,\"=1\")*100+COUNTIF(Y15:AJ15,\"=2\")*80+COUNTIF(Y15:AJ15,\"=3\")*50+COUNTIF(Y15:AJ15,\"=8\")*20+COUNTIF(Y15:AJ15,\"=9\")*0)/COUNTA(Y15:AJ15)/100,\"N/A\")","v":"N/A"},{"$f":"IF(COUNTA(AK15:AP15)>0,(COUNTIF(AK15:AP15,\"=0\")*0+COUNTIF(AK15:AP15,\"=1\")*100+COUNTIF(AK15:AP15,\"=2\")*80+COUNTIF(AK15:AP15,\"=3\")*50+COUNTIF(AK15:AP15,\"=8\")*20+COUNTIF(AK15:AP15,\"=9\")*0)/COUNTA(AK15:AP15)/100,\"N/A\")","v":"N/A"},{"$f":"IF(COUNTA(AQ15:AU15)>0,(COUNTIF(AQ15:AU15,\"=0\")*0+COUNTIF(AQ15:AU15,\"=1\")*100+COUNTIF(AQ15:AU15,\"=2\")*80+COUNTIF(AQ15:AU15,\"=3\")*50+COUNTIF(AQ15:AU15,\"=8\")*20+COUNTIF(AQ15:AU15,\"=9\")*0)/COUNTA(AQ15:AU15)/100,\"N/A\")","v":"N/A"},{"$f":"IF(COUNTA(AV15:AX15)>0,(COUNTIF(AV15:AX15,\"=0\")*0+COUNTIF(AV15:AX15,\"=1\")*100+COUNTIF(AV15:AX15,\"=2\")*80+COUNTIF(AV15:AX15,\"=3\")*50+COUNTIF(AV15:AX15,\"=8\")*20+COUNTIF(AV15:AX15,\"=9\")*0)/COUNTA(AV15:AX15)/100,\"N/A\")","v":"N/A"},{"$f":"IF(AND(COUNTA(E15:AX15)<>0,B15<>\"\"),AVERAGE(BA15:BG15),\"N/A\")","v":"N/A"},{"$f":"IF(AY15=\"N/A\",1,\"\")","v":1},{"$f":"IF(AZ15=\"N/A\",1,\"\")","v":1},{"$f":"IF(BA15=\"N/A\",1,\"\")","v":1},1,1,1,1,1,1,1]
[null,null,null,null,null,null,null,null,null,null,null,null,null,null,null,null,null,null,null,null,null,null,null,null,null,null,null,null,null,null,null,null,null,null,null,null,null,null,null,null,null,null,null,null,null,null,null,null,null,null,{"$f":"IF(COUNTA(E16:J16)>0,(COUNTIF(E16:J16,\"=0\")*0+COUNTIF(E16:J16,\"=1\")*100+COUNTIF(E16:J16,\"=2\")*80+COUNTIF(E16:J16,\"=3\")*50+COUNTIF(E16:J16,\"=8\")*20+COUNTIF(E16:J16,\"=9\")*0)/COUNTA(E16:J16)/100,\"N/A\")","v":"N/A"},{"$f":"IF(COUNTA(K16:O16)>0,(COUNTIF(K16:O16,\"=0\")*0+COUNTIF(K16:O16,\"=1\")*100+COUNTIF(K16:O16,\"=2\")*80+COUNTIF(K16:O16,\"=3\")*50+COUNTIF(K16:O16,\"=8\")*20+COUNTIF(K16:O16,\"=9\")*0)/COUNTA(K16:O16)/100,\"N/A\")","v":"N/A"},{"$f":"IF(COUNTA(P16:U16)>0,(COUNTIF(P16:U16,\"=0\")*0+COUNTIF(P16:U16,\"=1\")*100+COUNTIF(P16:U16,\"=2\")*80+COUNTIF(P16:U16,\"=3\")*50+COUNTIF(P16:U16,\"=8\")*20+COUNTIF(P16:U16,\"=9\")*0)/COUNTA(P16:U16)/100,\"N/A\")","v":"N/A"},{"$f":"IF(COUNTA(V16)<>0,(COUNTIF(V16,\"=0\")*0+COUNTIF(V16,\"=1\")*100+COUNTIF(V16,\"=2\")*80+COUNTIF(V16,\"=3\")*50+COUNTIF(V16,\"=8\")*20+COUNTIF(V16,\"=9\")*0)/COUNTA(V16)/100,\"N/A\")","v":"N/A"},{"$f":"IF(COUNTA(W16:X16)>0,(COUNTIF(W16:X16,\"=0\")*0+COUNTIF(W16:X16,\"=1\")*100+COUNTIF(W16:X16,\"=2\")*80+COUNTIF(W16:X16,\"=3\")*50+COUNTIF(W16:X16,\"=8\")*20+COUNTIF(W16:X16,\"=9\")*0)/COUNTA(W16:X16)/100,\"N/A\")","v":"N/A"},{"$f":"IF(COUNTA(Y16:AJ16)>0,(COUNTIF(Y16:AJ16,\"=0\")*0+COUNTIF(Y16:AJ16,\"=1\")*100+COUNTIF(Y16:AJ16,\"=2\")*80+COUNTIF(Y16:AJ16,\"=3\")*50+COUNTIF(Y16:AJ16,\"=8\")*20+COUNTIF(Y16:AJ16,\"=9\")*0)/COUNTA(Y16:AJ16)/100,\"N/A\")","v":"N/A"},{"$f":"IF(COUNTA(AK16:AP16)>0,(COUNTIF(AK16:AP16,\"=0\")*0+COUNTIF(AK16:AP16,\"=1\")*100+COUNTIF(AK16:AP16,\"=2\")*80+COUNTIF(AK16:AP16,\"=3\")*50+COUNTIF(AK16:AP16,\"=8\")*20+COUNTIF(AK16:AP16,\"=9\")*0)/COUNTA(AK16:AP16)/100,\"N/A\")","v":"N/A"},{"$f":"IF(COUNTA(AQ16:AU16)>0,(COUNTIF(AQ16:AU16,\"=0\")*0+COUNTIF(AQ16:AU16,\"=1\")*100+COUNTIF(AQ16:AU16,\"=2\")*80+COUNTIF(AQ16:AU16,\"=3\")*50+COUNTIF(AQ16:AU16,\"=8\")*20+COUNTIF(AQ16:AU16,\"=9\")*0)/COUNTA(AQ16:AU16)/100,\"N/A\")","v":"N/A"},{"$f":"IF(COUNTA(AV16:AX16)>0,(COUNTIF(AV16:AX16,\"=0\")*0+COUNTIF(AV16:AX16,\"=1\")*100+COUNTIF(AV16:AX16,\"=2\")*80+COUNTIF(AV16:AX16,\"=3\")*50+COUNTIF(AV16:AX16,\"=8\")*20+COUNTIF(AV16:AX16,\"=9\")*0)/COUNTA(AV16:AX16)/100,\"N/A\")","v":"N/A"},{"$f":"IF(AND(COUNTA(E16:AX16)<>0,B16<>\"\"),AVERAGE(BA16:BG16),\"N/A\")","v":"N/A"},1,1,{"$f":"IF(BA16=\"N/A\",1,\"\")","v":1},{"$f":"IF(BB16=\"N/A\",1,\"\")","v":1},{"$f":"IF(BC16=\"N/A\",1,\"\")","v":1},{"$f":"IF(BD16=\"N/A\",1,\"\")","v":1},{"$f":"IF(BE16=\"N/A\",1,\"\")","v":1},{"$f":"IF(BF16=\"N/A\",1,\"\")","v":1},{"$f":"IF(BG16=\"N/A\",1,\"\")","v":1},{"$f":"IF(BH16=\"N/A\",1,\"\")","v":1},{"$f":"COUNTA(#REF!)","v":1}]
[null,null,null,null,null,null,null,null,null,null,null,null,null,null,null,null,null,null,null,null,null,null,null,null,null,null,null,null,null,null,null,null,null,null,null,null,null,null,null,null,null,null,null,null,null,null,null,null,null,null,"N/A","N/A","N/A","N/A","N/A","N/A","N/A","N/A","N/A","N/A",1,1,1,1,1,1,1,1,1,1,{"$f":"IF(#REF!<>\"\",#REF!,\"\")","v":{"$error":"#REF!"}}]
[null,null,null,null,null,null,null,null,null,null,null,null,null,null,null,null,null,null,null,null,null,null,null,null,null,null,null,null,null,null,null,null,null,null,null,null,null,null,null,null,null,null,null,null,null,null,null,null,null,null,"N/A","N/A","N/A","N/A","N/A","N/A","N/A","N/A","N/A","N/A",1,1,1,1,1,1,1,1,1,1,{"$f":"IF(#REF!<>\"\",#REF!,\"\")","v":{"$error":"#REF!"}}]
[null,null,null,null,null,null,null,null,null,null,null,null,null,null,null,null,null,null,null,null,null,null,null,null,null,null,null,null,null,null,null,null,null,null,null,null,null,null,null,null,null,null,null,null,null,null,null,null,null,null,"N/A",{"$f":"IF(COUNTA(K19:O19)>0,(COUNTIF(K19:O19,\"=0\")*0+COUNTIF(K19:O19,\"=1\")*100+COUNTIF(K19:O19,\"=2\")*80+COUNTIF(K19:O19,\"=3\")*50+COUNTIF(K19:O19,\"=8\")*20+COUNTIF(K19:O19,\"=9\")*0)/COUNTA(K19:O19)/100,\"N/A\")","v":"N/A"},"N/A","N/A","N/A","N/A","N/A","N/A","N/A","N/A",1,1,1,1,1,1,1,1,1,1,{"$f":"IF(#REF!<>\"\",#REF!,\"\")","v":{"$error":"#REF!"}}]
[null,null,null,null,null,null,null,null,null,null,null,null,null,null,null,null,null,null,null,null,null,null,null,null,null,null,null,null,null,null,null,null,null,null,null,null,null,null,null,null,null,null,null,null,null,null,null,null,null,null,"N/A","N/A","N/A","N/A","N/A","N/A","N/A","N/A","N/A","N/A",1,1,1,1,1,1,1,1,1,1,{"$f":"IF(#REF!<>\"\",#REF!,\"\")","v":{"$error":"#REF!"}}]
[null,null,null,null,null,null,null,null,null,null,null,null,null,null,null,null,null,null,null,null,null,null,null,null,null,null,null,null,null,null,null,null,null,null,null,null,null,null,null,null,null,null,null,null,null,null,null,null,null,null,"N/A","N/A","N/A","N/A","N/A","N/A","N/A","N/A","N/A","N/A",1,1,1,1,1,1,1,1,1,1,{"$f":"IF(#REF!<>\"\",#REF!,\"\")","v":{"$error":"#REF!"}}]
[null,null,null,null,null,null,null,null,null,null,null,null,null,null,null,null,null,null,null,null,null,null,null,null,null,null,null,null,null,null,null,null,null,null,null,null,null,null,null,null,null,null,null,null,null,null,null,null,null,null,"N/A","N/A","N/A","N/A","N/A","N/A","N/A","N/A","N/A","N/A",1,1,1,1,1,1,1,1,1,1,{"$f":"IF(#REF!<>\"\",#REF!,\"\")","v":{"$error":"#REF!"}}]
[null,null,null,null,null,null,null,null,null,null,null,null,null,null,null,null,null,null,null,null,null,null,null,null,null,null,null,null,null,null,null,null,null,null,null,null,null,null,null,null,null,null,null,null,null,null,null,null,null,null,"N/A","N/A","N/A","N/A","N/A","N/A","N/A","N/A","N/A","N/A",1,1,1,1,1,1,1,1,1,1,{"$f":"IF(#REF!<>\"\",#REF!,\"\")","v":{"$error":"#REF!"}}]
[null,null,null,null,null,null,null,null,null,null,null,null,null,null,null,null,null,null,null,null,null,null,null,null,null,null,null,null,null,null,null,null,null,null,null,null,null,null,null,null,null,null,null,null,null,null,null,null,null,null,"N/A","N/A","N/A","N/A","N/A","N/A","N/A","N/A","N/A","N/A",1,1,1,1,1,1,1,1,1,1,{"$f":"IF(#REF!<>\"\",#REF!,\"\")","v":{"$error":"#REF!"}}]
[null,null,null,null,null,null,null,null,null,null,null,null,null,null,null,null,null,null,null,null,null,null,null,null,null,null,null,null,null,null,null,null,null,null,null,null,null,null,null,null,null,null,null,null,null,null,null,null,null,null,"N/A","N/A","N/A","N/A","N/A","N/A","N/A","N/A","N/A","N/A",1,1,1,1,1,1,1,1,1,1,{"$f":"IF(#REF!<>\"\",#REF!,\"\")","v":{"$error":"#REF!"}}]
[null,null,null,null,null,null,null,null,null,null,null,null,null,null,null,null,null,null,null,null,null,null,null,null,null,null,null,null,null,null,null,null,null,null,null,null,null,null,null,null,null,null,null,null,null,null,null,null,null,null,"N/A","N/A","N/A","N/A","N/A","N/A","N/A","N/A","N/A","N/A",1,1,1,1,1,1,1,1,1,1,{"$f":"IF(#REF!<>\"\",#REF!,\"\")","v":{"$error":"#REF!"}}]
[null,null,null,null,null,null,null,null,null,null,null,null,null,null,null,null,null,null,null,null,null,null,null,null,null,null,null,null,null,null,null,null,null,null,null,null,null,null,null,null,null,null,null,null,null,null,null,null,null,null,"N/A","N/A","N/A","N/A","N/A","N/A","N/A","N/A","N/A","N/A",1,1,1,1,1,1,1,1,1,1,{"$f":"IF(#REF!<>\"\",#REF!,\"\")","v":{"$error":"#REF!"}}]
[null,null,null,null,null,null,null,null,null,null,null,null,null,null,null,null,null,null,null,null,null,null,null,null,null,null,null,null,null,null,null,null,null,null,null,null,null,null,null,null,null,null,null,null,null,null,null,null,null,null,"N/A","N/A","N/A","N/A","N/A","N/A","N/A","N/A","N/A","N/A",1,1,1,1,1,1,1,1,1,1]
[null,null,null,null,null,null,null,null,null,null,null,null,null,null,null,null,null,null,null,null,null,null,null,null,null,null,null,null,null,null,null,null,null,null,null,null,null,null,null,null,null,null,null,null,null,null,null,null,null,null,"N/A","N/A","N/A","N/A","N/A","N/A","N/A","N/A","N/A","N/A",1,1,1,1,1,1,1,1,1,1]
[null,null,null,null,null,null,null,null,null,null,null,null,null,null,null,null,null,null,null,null,null,null,null,null,null,null,null,null,null,null,null,null,null,null,null,null,null,null,null,null,null,null,null,null,null,null,null,null,null,null,"N/A","N/A","N/A","N/A","N/A","N/A","N/A","N/A","N/A","N/A",1,1,1,1,1,1,1,1,1,1]
[null,null,null,null,null,null,null,null,null,null,null,null,null,null,null,null,null,null,null,null,null,null,null,null,null,null,null,null,null,null,null,null,null,null,null,null,null,null,null,null,null,null,null,null,null,null,null,null,null,null,"N/A","N/A","N/A","N/A","N/A","N/A","N/A","N/A","N/A","N/A",1,1,{"$f":"IF(BA31=\"N/A\",1,\"\")","v":1},{"$f":"IF(BB31=\"N/A\",1,\"\")","v":1},{"$f":"IF(BC31=\"N/A\",1,\"\")","v":1},{"$f":"IF(BD31=\"N/A\",1,\"\")","v":1},{"$f":"IF(BE31=\"N/A\",1,\"\")","v":1},1,1,{"$f":"IF(BH31=\"N/A\",1,\"\")","v":1}]
[null,null,null,null,null,null,null,null,null,null,null,null,null,null,null,null,null,null,null,null,null,null,null,null,null,null,null,null,null,null,null,null,null,null,null,null,null,null,null,null,null,null,null,null,null,null,null,null,null,null,"N/A","N/A","N/A","N/A","N/A","N/A","N/A","N/A","N/A","N/A",1,1,1,1,1,1,1,1,1,1]
[null,null,null,null,null,null,null,null,null,null,null,null,null,null,null,null,null,null,null,null,null,null,null,null,null,null,null,null,null,null,null,null,null,null,null,null,null,null,null,null,null,null,null,null,null,null,null,null,null,null,"N/A","N/A","N/A","N/A","N/A","N/A","N/A","N/A","N/A","N/A",1,1,1,1,1,1,1,1,1,1]
[null,null,null,null,null,null,null,null,null,null,null,null,null,null,null,null,null,null,null,null,null,null,null,null,null,null,null,null,null,null,null,null,null,null,null,null,null,null,null,null,null,null,null,null,null,null,null,null,null,null,"N/A","N/A","N/A","N/A","N/A","N/A","N/A","N/A","N/A","N/A",1,1,1,1,1,1,1,1,1,1]
[null,null,null,null,null,null,null,null,null,null,null,null,null,null,null,null,null,null,null,null,null,null,null,null,null,null,null,null,null,null,null,null,null,null,null,null,null,null,null,null,null,null,null,null,null,null,null,null,null,null,"N/A","N/A","N/A","N/A","N/A","N/A","N/A","N/A","N/A","N/A",1,1,1,1,1,1,1,1,1,1]
[null,null,null,null,null,null,null,null,null,null,null,null,null,null,null,null,null,null,null,null,null,null,null,null,null,null,null,null,null,null,null,null,null,null,null,null,null,null,null,null,null,null,null,null,null,null,null,null,null,null,"N/A","N/A","N/A","N/A","N/A","N/A","N/A","N/A","N/A","N/A",1,1,1,1,1,1,1,1,1,1]
[null,null,null,null,null,null,null,null,null,null,null,null,null,null,null,null,null,null,null,null,null,null,null,null,null,null,null,null,null,null,null,null,null,null,null,null,null,null,null,null,null,null,null,null,null,null,null,null,null,null,"N/A","N/A","N/A","N/A","N/A","N/A","N/A","N/A","N/A","N/A",1,1,1,1,1,1,1,1,1,1]
[null,null,null,null,null,null,null,null,null,null,null,null,null,null,null,null,null,null,null,null,null,null,null,null,null,null,null,null,null,null,null,null,null,null,null,null,null,null,null,null,null,null,null,null,null,null,null,null,null,null,"N/A","N/A","N/A","N/A","N/A","N/A","N/A","N/A","N/A","N/A",1,1,1,1,1,1,1,1,1,1]
[null,null,null,null,null,null,null,null,null,null,null,null,null,null,null,null,null,null,null,null,null,null,null,null,null,null,null,null,null,null,null,null,null,null,null,null,null,null,null,null,null,null,null,null,null,null,null,null,null,null,"N/A","N/A","N/A","N/A","N/A","N/A","N/A","N/A","N/A","N/A",1,1,1,1,1,1,1,1,1,1]
[null,null,null,null,null,null,null,null,null,null,null,null,null,null,null,null,null,null,null,null,null,null,null,null,null,null,null,null,null,null,null,null,null,null,null,null,null,null,null,null,null,null,null,null,null,null,null,null,null,null,"N/A","N/A","N/A","N/A","N/A","N/A","N/A","N/A","N/A","N/A",1,1,1,1,1,1,1,1,1,1]
[null,null,null,null,null,null,null,null,null,null,null,null,null,null,null,null,null,null,null,null,null,null,null,null,null,null,null,null,null,null,null,null,null,null,null,null,null,null,null,null,null,null,null,null,null,null,null,null,null,null,"N/A","N/A","N/A","N/A","N/A","N/A","N/A","N/A","N/A","N/A",1,1,1,1,1,1,1,1,1,1]
[null,null,null,null,null,null,null,null,null,null,null,null,null,null,null,null,null,null,null,null,null,null,null,null,null,null,null,null,null,null,null,null,null,null,null,null,null,null,null,null,null,null,null,null,null,null,null,null,null,null,"N/A","N/A","N/A","N/A","N/A","N/A","N/A","N/A","N/A","N/A",1,1,1,1,1,1,1,1,1,1]
[null,null,null,null,null,null,null,null,null,null,null,null,null,null,null,null,null,null,null,null,null,null,null,null,null,null,null,null,null,null,null,null,null,null,null,null,null,null,null,null,null,null,null,null,null,null,null,null,null,null,"N/A","N/A","N/A","N/A","N/A","N/A","N/A","N/A","N/A","N/A",1,1,1,1,1,1,1,1,1,1]
[null,null,null,null,null,null,null,null,null,null,null,null,null,null,null,null,null,null,null,null,null,null,null,null,null,null,null,null,null,null,null,null,null,null,null,null,null,null,null,null,null,null,null,null,null,null,null,null,null,null,"N/A","N/A","N/A","N/A","N/A","N/A","N/A","N/A","N/A","N/A",1,1,1,1,1,1,1,1,1,1]
[null,null,null,null,null,null,null,null,null,null,null,null,null,null,null,null,null,null,null,null,null,null,null,null,null,null,null,null,null,null,null,null,null,null,null,null,null,null,null,null,null,null,null,null,null,null,null,null,null,null,"N/A","N/A","N/A","N/A","N/A","N/A","N/A","N/A","N/A","N/A",1,1,1,1,1,1,1,1,1,1]
[null,null,null,null,null,null,null,null,null,null,null,null,null,null,null,null,null,null,null,null,null,null,null,null,null,null,null,null,null,null,null,null,null,null,null,null,null,null,null,null,null,null,null,null,null,null,null,null,null,null,"N/A","N/A","N/A","N/A","N/A","N/A","N/A","N/A","N/A","N/A",1,1,1,1,1,1,1,1,1,1]
[null,null,null,null,null,null,null,null,null,null,null,null,null,null,null,null,null,null,null,null,null,null,null,null,null,null,null,null,null,null,null,null,null,null,null,null,null,null,null,null,null,null,null,null,null,null,null,null,null,null,"N/A","N/A","N/A","N/A","N/A","N/A","N/A","N/A","N/A","N/A",{"$f":"IF(AY47=\"N/A\",1,\"\")","v":1},{"$f":"IF(AZ47=\"N/A\",1,\"\")","v":1},1,1,1,1,1,1,1,1]
[null,null,null,null,null,null,null,null,null,null,null,null,null,null,null,null,null,null,null,null,null,null,null,null,null,null,null,null,null,null,null,null,null,null,null,null,null,null,null,null,null,null,null,null,null,null,null,null,null,null,"N/A","N/A","N/A","N/A","N/A","N/A","N/A","N/A","N/A","N/A",1,1,1,1,1,1,1,1,1,1]
[null,null,null,null,null,null,null,null,null,null,null,null,null,null,null,null,null,null,null,null,null,null,null,null,null,null,null,null,null,null,null,null,null,null,null,null,null,null,null,null,null,null,null,null,null,null,null,null,null,null,"N/A","N/A","N/A","N/A","N/A","N/A","N/A","N/A","N/A","N/A",1,1,1,1,1,1,1,1,1,1]
[null,null,null,null,null,null,null,null,null,null,null,null,null,null,null,null,null,null,null,null,null,null,null,null,null,null,null,null,null,null,null,null,null,null,null,null,null,null,null,null,null,null,null,null,null,null,null,null,null,null,"N/A","N/A","N/A","N/A","N/A","N/A","N/A","N/A","N/A","N/A",1,1,1,1,1,1,1,1,1,1]
[null,null,null,null,null,null,null,null,null,null,null,null,null,null,null,null,null,null,null,null,null,null,null,null,null,null,null,null,null,null,null,null,null,null,null,null,null,null,null,null,null,null,null,null,null,null,null,null,null,null,"N/A","N/A","N/A","N/A","N/A","N/A","N/A","N/A","N/A","N/A",1,1,1,1,1,1,1,1,1,1]
[null,null,null,null,null,null,null,null,null,null,null,null,null,null,null,null,null,null,null,null,null,null,null,null,null,null,null,null,null,null,null,null,null,null,null,null,null,null,null,null,null,null,null,null,null,null,null,null,null,null,"N/A","N/A","N/A","N/A","N/A","N/A","N/A","N/A","N/A","N/A",1,1,1,1,1,1,1,1,1,1]
[null,null,null,null,null,null,null,null,null,null,null,null,null,null,null,null,null,null,null,null,null,null,null,null,null,null,null,null,null,null,null,null,null,null,null,null,null,null,null,null,null,null,null,null,null,null,null,null,null,null,"N/A","N/A","N/A","N/A","N/A","N/A","N/A","N/A","N/A","N/A",1,1,1,1,1,1,1,1,1,1]
[null,null,null,null,null,null,null,null,null,null,null,null,null,null,null,null,null,null,null,null,null,null,null,null,null,null,null,null,null,null,null,null,null,null,null,null,null,null,null,null,null,null,null,null,null,null,null,null,null,null,"N/A","N/A","N/A","N/A","N/A","N/A","N/A","N/A","N/A","N/A",1,1,1,1,1,1,1,1,1,1]
[null,null,null,null,null,null,null,null,null,null,null,null,null,null,null,null,null,null,null,null,null,null,null,null,null,null,null,null,null,null,null,null,null,null,null,null,null,null,null,null,null,null,null,null,null,null,null,null,null,null,"N/A","N/A","N/A","N/A","N/A","N/A","N/A","N/A","N/A","N/A",1,1,1,1,1,1,1,1,1,1]
[null,null,null,null,null,null,null,null,null,null,null,null,null,null,null,null,null,null,null,null,null,null,null,null,null,null,null,null,null,null,null,null,null,null,null,null,null,null,null,null,null,null,null,null,null,null,null,null,null,null,"N/A","N/A","N/A","N/A","N/A","N/A","N/A","N/A","N/A","N/A",1,1,1,1,1,1,1,1,1,1]
[null,null,null,null,null,null,null,null,null,null,null,null,null,null,null,null,null,null,null,null,null,null,null,null,null,null,null,null,null,null,null,null,null,null,null,null,null,null,null,null,null,null,null,null,null,null,null,null,null,null,"N/A","N/A","N/A","N/A","N/A","N/A","N/A","N/A","N/A","N/A",1,1,1,1,1,1,1,1,1,1]
[null,null,null,null,null,null,null,null,null,null,null,null,null,null,null,null,null,null,null,null,null,null,null,null,null,null,null,null,null,null,null,null,null,null,null,null,null,null,null,null,null,null,null,null,null,null,null,null,null,null,"N/A","N/A","N/A","N/A","N/A","N/A","N/A","N/A","N/A","N/A",1,1,1,1,1,1,1,1,1,1]
[null,null,null,null,null,null,null,null,null,null,null,null,null,null,null,null,null,null,null,null,null,null,null,null,null,null,null,null,null,null,null,null,null,null,null,null,null,null,null,null,null,null,null,null,null,null,null,null,null,null,"N/A","N/A","N/A","N/A","N/A","N/A","N/A","N/A","N/A","N/A",1,1,1,1,1,1,1,1,1,1]
[null,null,null,null,null,null,null,null,null,null,null,null,null,null,null,null,null,null,null,null,null,null,null,null,null,null,null,null,null,null,null,null,null,null,null,null,null,null,null,null,null,null,null,null,null,null,null,null,null,null,"N/A","N/A","N/A","N/A","N/A","N/A","N/A","N/A","N/A","N/A",1,1,1,1,1,1,1,1,1,1]
[null,null,null,null,null,null,null,null,null,null,null,null,null,null,null,null,null,null,null,null,null,null,null,null,null,null,null,null,null,null,null,null,null,null,null,null,null,null,null,null,null,null,null,null,null,null,null,null,null,null,"N/A","N/A","N/A","N/A","N/A","N/A","N/A","N/A","N/A","N/A",1,1,1,1,1,1,1,1,1,1]
[null,null,null,null,null,null,null,null,null,null,null,null,null,null,null,null,null,null,null,null,null,null,null,null,null,null,null,null,null,null,null,null,null,null,null,null,null,null,null,null,null,null,null,null,null,null,null,null,null,null,"N/A","N/A","N/A","N/A","N/A","N/A","N/A","N/A","N/A","N/A",1,1,1,1,1,1,1,1,1,1]
[null,null,null,null,null,null,null,null,null,null,null,null,null,null,null,null,null,null,null,null,null,null,null,null,null,null,null,null,null,null,null,null,null,null,null,null,null,null,null,null,null,null,null,null,null,null,null,null,null,null,"N/A","N/A","N/A","N/A","N/A","N/A","N/A","N/A","N/A","N/A",1,1,{"$f":"IF(BA63=\"N/A\",1,\"\")","v":1},{"$f":"IF(BB63=\"N/A\",1,\"\")","v":1},{"$f":"IF(BC63=\"N/A\",1,\"\")","v":1},{"$f":"IF(BD63=\"N/A\",1,\"\")","v":1},{"$f":"IF(BE63=\"N/A\",1,\"\")","v":1},1,1,{"$f":"IF(BH63=\"N/A\",1,\"\")","v":1}]
[null,null,null,null,null,null,null,null,null,null,null,null,null,null,null,null,null,null,null,null,null,null,null,null,null,null,null,null,null,null,null,null,null,null,null,null,null,null,null,null,null,null,null,null,null,null,null,null,null,null,"N/A","N/A","N/A","N/A","N/A","N/A","N/A","N/A","N/A","N/A",{"$f":"IF(AY64=\"N/A\",1,\"\")","v":1},{"$f":"IF(AZ64=\"N/A\",1,\"\")","v":1},1,1,1,1,1,1,1,1]
[null,null,null,null,null,null,null,null,null,null,null,null,null,null,null,null,null,null,null,null,null,null,null,null,null,null,null,null,null,null,null,null,null,null,null,null,null,null,null,null,null,null,null,null,null,null,null,null,null,null,"N/A","N/A","N/A","N/A","N/A","N/A","N/A","N/A","N/A","N/A",1,1,1,1,1,1,1,1,1,1]
[null,null,null,null,null,null,null,null,null,null,null,null,null,null,null,null,null,null,null,null,null,null,null,null,null,null,null,null,null,null,null,null,null,null,null,null,null,null,null,null,null,null,null,null,null,null,null,null,null,null,"N/A","N/A","N/A","N/A","N/A","N/A","N/A","N/A","N/A","N/A",1,1,1,1,1,1,1,1,1,1]
[null,null,null,null,null,null,null,null,null,null,null,null,null,null,null,null,null,null,null,null,null,null,null,null,null,null,null,null,null,null,null,null,null,null,null,null,null,null,null,null,null,null,null,null,null,null,null,null,null,null,"N/A","N/A","N/A","N/A","N/A","N/A","N/A","N/A","N/A","N/A",1,1,1,1,1,1,1,1,1,1]
[null,null,null,null,null,null,null,null,null,null,null,null,null,null,null,null,null,null,null,null,null,null,null,null,null,null,null,null,null,null,null,null,null,null,null,null,null,null,null,null,null,null,null,null,null,null,null,null,null,null,"N/A","N/A","N/A","N/A","N/A","N/A","N/A","N/A","N/A","N/A",1,1,1,1,1,1,1,1,1,1]
[null,null,null,null,null,null,null,null,null,null,null,null,null,null,null,null,null,null,null,null,null,null,null,null,null,null,null,null,null,null,null,null,null,null,null,null,null,null,null,null,null,null,null,null,null,null,null,null,null,null,"N/A","N/A","N/A","N/A","N/A","N/A","N/A","N/A","N/A","N/A",1,1,1,1,1,1,1,1,1,1]
[null,null,null,null,null,null,null,null,null,null,null,null,null,null,null,null,null,null,null,null,null,null,null,null,null,null,null,null,null,null,null,null,null,null,null,null,null,null,null,null,null,null,null,null,null,null,null,null,null,null,"N/A","N/A","N/A","N/A","N/A","N/A","N/A","N/A","N/A","N/A",1,1,1,1,1,1,1,1,1,1]
[null,null,null,null,null,null,null,null,null,null,null,null,null,null,null,null,null,null,null,null,null,null,null,null,null,null,null,null,null,null,null,null,null,null,null,null,null,null,null,null,null,null,null,null,null,null,null,null,null,null,"N/A","N/A","N/A","N/A","N/A","N/A","N/A","N/A","N/A","N/A",1,1,1,1,1,1,1,1,1,1]
[null,null,null,null,null,null,null,null,null,null,null,null,null,null,null,null,null,null,null,null,null,null,null,null,null,null,null,null,null,null,null,null,null,null,null,null,null,null,null,null,null,null,null,null,null,null,null,null,null,null,"N/A","N/A","N/A","N/A","N/A","N/A","N/A","N/A","N/A","N/A",1,1,1,1,1,1,1,1,1,1]
[null,null,null,null,null,null,null,null,null,null,null,null,null,null,null,null,null,null,null,null,null,null,null,null,null,null,null,null,null,null,null,null,null,null,null,null,null,null,null,null,null,null,null,null,null,null,null,null,null,null,"N/A","N/A","N/A","N/A","N/A","N/A","N/A","N/A","N/A","N/A",1,1,1,1,1,1,1,1,1,1]
[null,null,null,null,null,null,null,null,null,null,null,null,null,null,null,null,null,null,null,null,null,null,null,null,null,null,null,null,null,null,null,null,null,null,null,null,null,null,null,null,null,null,null,null,null,null,null,null,null,null,"N/A","N/A","N/A","N/A","N/A","N/A","N/A","N/A","N/A","N/A",1,1,1,1,1,1,1,1,1,1]
[null,null,null,null,null,null,null,null,null,null,null,null,null,null,null,null,null,null,null,null,null,null,null,null,null,null,null,null,null,null,null,null,null,null,null,null,null,null,null,null,null,null,null,null,null,null,null,null,null,null,"N/A","N/A","N/A","N/A","N/A","N/A","N/A","N/A","N/A","N/A",1,1,1,1,1,1,1,1,1,1]
[null,null,null,null,null,null,null,null,null,null,null,null,null,null,null,null,null,null,null,null,null,null,null,null,null,null,null,null,null,null,null,null,null,null,null,null,null,null,null,null,null,null,null,null,null,null,null,null,null,null,"N/A","N/A","N/A","N/A","N/A","N/A","N/A","N/A","N/A","N/A",1,1,1,1,1,1,1,1,1,1]
[null,null,null,null,null,null,null,null,null,null,null,null,null,null,null,null,null,null,null,null,null,null,null,null,null,null,null,null,null,null,null,null,null,null,null,null,null,null,null,null,null,null,null,null,null,null,null,null,null,null,"N/A","N/A","N/A","N/A","N/A","N/A","N/A","N/A","N/A","N/A",1,1,1,1,1,1,1,1,1,1]
[null,null,null,null,null,null,null,null,null,null,null,null,null,null,null,null,null,null,null,null,null,null,null,null,null,null,null,null,null,null,null,null,null,null,null,null,null,null,null,null,null,null,null,null,null,null,null,null,null,null,"N/A","N/A","N/A","N/A","N/A","N/A","N/A","N/A","N/A","N/A",1,1,1,1,1,1,1,1,1,1]
[null,null,null,null,null,null,null,null,null,null,null,null,null,null,null,null,null,null,null,null,null,null,null,null,null,null,null,null,null,null,null,null,null,null,null,null,null,null,null,null,null,null,null,null,null,null,null,null,null,null,"N/A","N/A","N/A","N/A","N/A","N/A","N/A","N/A","N/A","N/A",1,1,1,1,1,1,1,1,1,1]
[null,null,null,null,null,null,null,null,null,null,null,null,null,null,null,null,null,null,null,null,null,null,null,null,null,null,null,null,null,null,null,null,null,null,null,null,null,null,null,null,null,null,null,null,null,null,null,null,null,null,{"$f":"IF(COUNTA(E80:J80)>0,(COUNTIF(E80:J80,\"=0\")*0+COUNTIF(E80:J80,\"=1\")*100+COUNTIF(E80:J80,\"=2\")*80+COUNTIF(E80:J80,\"=3\")*50+COUNTIF(E80:J80,\"=8\")*20+COUNTIF(E80:J80,\"=9\")*0)/COUNTA(E80:J80)/100,\"N/A\")","v":"N/A"},{"$f":"IF(COUNTA(K80:O80)>0,(COUNTIF(K80:O80,\"=0\")*0+COUNTIF(K80:O80,\"=1\")*100+COUNTIF(K80:O80,\"=2\")*80+COUNTIF(K80:O80,\"=3\")*50+COUNTIF(K80:O80,\"=8\")*20+COUNTIF(K80:O80,\"=9\")*0)/COUNTA(K80:O80)/100,\"N/A\")","v":"N/A"},{"$f":"IF(COUNTA(P80:U80)>0,(COUNTIF(P80:U80,\"=0\")*0+COUNTIF(P80:U80,\"=1\")*100+COUNTIF(P80:U80,\"=2\")*80+COUNTIF(P80:U80,\"=3\")*50+COUNTIF(P80:U80,\"=8\")*20+COUNTIF(P80:U80,\"=9\")*0)/COUNTA(P80:U80)/100,\"N/A\")","v":"N/A"},{"$f":"IF(COUNTA(V80)<>0,(COUNTIF(V80,\"=0\")*0+COUNTIF(V80,\"=1\")*100+COUNTIF(V80,\"=2\")*80+COUNTIF(V80,\"=3\")*50+COUNTIF(V80,\"=8\")*20+COUNTIF(V80,\"=9\")*0)/COUNTA(V80)/100,\"N/A\")","v":"N/A"},{"$f":"IF(COUNTA(W80:X80)>0,(COUNTIF(W80:X80,\"=0\")*0+COUNTIF(W80:X80,\"=1\")*100+COUNTIF(W80:X80,\"=2\")*80+COUNTIF(W80:X80,\"=3\")*50+COUNTIF(W80:X80,\"=8\")*20+COUNTIF(W80:X80,\"=9\")*0)/COUNTA(W80:X80)/100,\"N/A\")","v":"N/A"},{"$f":"IF(COUNTA(Y80:AJ80)>0,(COUNTIF(Y80:AJ80,\"=0\")*0+COUNTIF(Y80:AJ80,\"=1\")*100+COUNTIF(Y80:AJ80,\"=2\")*80+COUNTIF(Y80:AJ80,\"=3\")*50+COUNTIF(Y80:AJ80,\"=8\")*20+COUNTIF(Y80:AJ80,\"=9\")*0)/COUNTA(Y80:AJ80)/100,\"N/A\")","v":"N/A"},{"$f":"IF(COUNTA(AK80:AP80)>0,(COUNTIF(AK80:AP80,\"=0\")*0+COUNTIF(AK80:AP80,\"=1\")*100+COUNTIF(AK80:AP80,\"=2\")*80+COUNTIF(AK80:AP80,\"=3\")*50+COUNTIF(AK80:AP80,\"=8\")*20+COUNTIF(AK80:AP80,\"=9\")*0)/COUNTA(AK80:AP80)/100,\"N/A\")","v":"N/A"},{"$f":"IF(COUNTA(AQ80:AU80)>0,(COUNTIF(AQ80:AU80,\"=0\")*0+COUNTIF(AQ80:AU80,\"=1\")*100+COUNTIF(AQ80:AU80,\"=2\")*80+COUNTIF(AQ80:AU80,\"=3\")*50+COUNTIF(AQ80:AU80,\"=8\")*20+COUNTIF(AQ80:AU80,\"=9\")*0)/COUNTA(AQ80:AU80)/100,\"N/A\")","v":"N/A"},{"$f":"IF(COUNTA(AV80:AX80)>0,(COUNTIF(AV80:AX80,\"=0\")*0+COUNTIF(AV80:AX80,\"=1\")*100+COUNTIF(AV80:AX80,\"=2\")*80+COUNTIF(AV80:AX80,\"=3\")*50+COUNTIF(AV80:AX80,\"=8\")*20+COUNTIF(AV80:AX80,\"=9\")*0)/COUNTA(AV80:AX80)/100,\"N/A\")","v":"N/A"},{"$f":"IF(AND(COUNTA(E80:AX80)<>0,B80<>\"\"),AVERAGE(BA80:BG80),\"N/A\")","v":"N/A"},1,1,1,1,1,1,1,{"$f":"IF(BF80=\"N/A\",1,\"\")","v":1},{"$f":"IF(BG80=\"N/A\",1,\"\")","v":1},1]
[null,null,null,null,null,null,null,null,null,null,null,null,null,null,null,null,null,null,null,null,null,null,null,null,null,null,null,null,null,null,null,null,null,null,null,null,null,null,null,null,null,null,null,null,null,null,null,null,null,null,"N/A","N/A","N/A","N/A","N/A","N/A","N/A","N/A","N/A","N/A",1,1,1,1,1,1,1,1,1,1]
[null,null,null,null,null,null,null,null,null,null,null,null,null,null,null,null,null,null,null,null,null,null,null,null,null,null,null,null,null,null,null,null,null,null,null,null,null,null,null,null,null,null,null,null,null,null,null,null,null,null,"N/A","N/A","N/A","N/A","N/A","N/A","N/A","N/A","N/A","N/A",1,1,1,1,1,1,1,1,1,1]
[null,null,null,null,null,null,null,null,null,null,null,null,null,null,null,null,null,null,null,null,null,null,null,null,null,null,null,null,null,null,null,null,null,null,null,null,null,null,null,null,null,null,null,null,null,null,null,null,null,null,"N/A","N/A","N/A","N/A","N/A","N/A","N/A","N/A","N/A","N/A",1,1,1,1,1,1,1,1,1,1]
[null,null,null,null,null,null,null,null,null,null,null,null,null,null,null,null,null,null,null,null,null,null,null,null,null,null,null,null,null,null,null,null,null,null,null,null,null,null,null,null,null,null,null,null,null,null,null,null,null,null,"N/A","N/A","N/A","N/A","N/A","N/A","N/A","N/A","N/A","N/A",1,1,1,1,1,1,1,1,1,1]
[null,null,null,null,null,null,null,null,null,null,null,null,null,null,null,null,null,null,null,null,null,null,null,null,null,null,null,null,null,null,null,null,null,null,null,null,null,null,null,null,null,null,null,null,null,null,null,null,null,null,"N/A","N/A","N/A","N/A","N/A","N/A","N/A","N/A","N/A","N/A",1,1,1,1,1,1,1,1,1,1]
[null,null,null,null,null,null,null,null,null,null,null,null,null,null,null,null,null,null,null,null,null,null,null,null,null,null,null,null,null,null,null,null,null,null,null,null,null,null,null,null,null,null,null,null,null,null,null,null,null,null,"N/A","N/A","N/A","N/A","N/A","N/A","N/A","N/A","N/A","N/A",1,1,1,1,1,1,1,1,1,1]
[null,null,null,null,null,null,null,null,null,null,null,null,null,null,null,null,null,null,null,null,null,null,null,null,null,null,null,null,null,null,null,null,null,null,null,null,null,null,null,null,null,null,null,null,null,null,null,null,null,null,"N/A","N/A","N/A","N/A","N/A","N/A","N/A","N/A","N/A","N/A",1,1,1,1,1,1,1,1,1,1]
[null,null,null,null,null,null,null,null,null,null,null,null,null,null,null,null,null,null,null,null,null,null,null,null,null,null,null,null,null,null,null,null,null,null,null,null,null,null,null,null,null,null,null,null,null,null,null,null,null,null,"N/A","N/A","N/A","N/A","N/A","N/A","N/A","N/A","N/A","N/A",1,1,1,1,1,1,1,1,1,1]
[null,null,null,null,null,null,null,null,null,null,null,null,null,null,null,null,null,null,null,null,null,null,null,null,null,null,null,null,null,null,null,null,null,null,null,null,null,null,null,null,null,null,null,null,null,null,null,null,null,null,"N/A","N/A","N/A","N/A","N/A","N/A","N/A","N/A","N/A","N/A",1,1,1,1,1,1,1,1,1,1]
[null,null,null,null,null,null,null,null,null,null,null,null,null,null,null,null,null,null,null,null,null,null,null,null,null,null,null,null,null,null,null,null,null,null,null,null,null,null,null,null,null,null,null,null,null,null,null,null,null,null,"N/A","N/A","N/A","N/A","N/A","N/A","N/A","N/A","N/A","N/A",1,1,1,1,1,1,1,1,1,1]
[null,null,null,null,null,null,null,null,null,null,null,null,null,null,null,null,null,null,null,null,null,null,null,null,null,null,null,null,null,null,null,null,null,null,null,null,null,null,null,null,null,null,null,null,null,null,null,null,null,null,"N/A","N/A","N/A","N/A","N/A","N/A","N/A","N/A","N/A","N/A",1,1,1,1,1,1,1,1,1,1]
[null,null,null,null,null,null,null,null,null,null,null,null,null,null,null,null,null,null,null,null,null,null,null,null,null,null,null,null,null,null,null,null,null,null,null,null,null,null,null,null,null,null,null,null,null,null,null,null,null,null,"N/A","N/A","N/A","N/A","N/A","N/A","N/A","N/A","N/A","N/A",1,1,1,1,1,1,1,1,1,1]
[null,null,null,null,null,null,null,null,null,null,null,null,null,null,null,null,null,null,null,null,null,null,null,null,null,null,null,null,null,null,null,null,null,null,null,null,null,null,null,null,null,null,null,null,null,null,null,null,null,null,"N/A","N/A","N/A","N/A","N/A","N/A","N/A","N/A","N/A","N/A",1,1,1,1,1,1,1,1,1,1]
[null,null,null,null,null,null,null,null,null,null,null,null,null,null,null,null,null,null,null,null,null,null,null,null,null,null,null,null,null,null,null,null,null,null,null,null,null,null,null,null,null,null,null,null,null,null,null,null,null,null,"N/A","N/A","N/A","N/A","N/A","N/A","N/A","N/A","N/A","N/A",1,1,1,1,1,1,1,1,1,1]
[null,null,null,null,null,null,null,null,null,null,null,null,null,null,null,null,null,null,null,null,null,null,null,null,null,null,null,null,null,null,null,null,null,null,null,null,null,null,null,null,null,null,null,null,null,null,null,null,null,null,"N/A","N/A","N/A","N/A","N/A","N/A","N/A","N/A","N/A","N/A",1,1,{"$f":"IF(BA95=\"N/A\",1,\"\")","v":1},{"$f":"IF(BB95=\"N/A\",1,\"\")","v":1},{"$f":"IF(BC95=\"N/A\",1,\"\")","v":1},{"$f":"IF(BD95=\"N/A\",1,\"\")","v":1},{"$f":"IF(BE95=\"N/A\",1,\"\")","v":1},1,1,1]
[null,null,null,null,null,null,null,null,null,null,null,null,null,null,null,null,null,null,null,null,null,null,null,null,null,null,null,null,null,null,null,null,null,null,null,null,null,null,null,null,null,null,null,null,null,null,null,null,null,null,"N/A","N/A","N/A","N/A","N/A","N/A","N/A","N/A","N/A","N/A",{"$f":"IF(AY96=\"N/A\",1,\"\")","v":1},{"$f":"IF(AZ96=\"N/A\",1,\"\")","v":1},1,1,1,1,1,1,1,1]
[null,null,null,null,null,null,null,null,null,null,null,null,null,null,null,null,null,null,null,null,null,null,null,null,null,null,null,null,null,null,null,null,null,null,null,null,null,null,null,null,null,null,null,null,null,null,null,null,null,null,"N/A","N/A","N/A","N/A","N/A","N/A","N/A","N/A","N/A","N/A",1,1,1,1,1,1,1,1,1,1]
[null,null,null,null,null,null,null,null,null,null,null,null,null,null,null,null,null,null,null,null,null,null,null,null,null,null,null,null,null,null,null,null,null,null,null,null,null,null,null,null,null,null,null,null,null,null,null,null,null,null,"N/A","N/A","N/A","N/A","N/A","N/A","N/A","N/A","N/A","N/A",1,1,1,1,1,1,1,1,1,1]
[null,null,null,null,null,null,null,null,null,null,null,null,null,null,null,null,null,null,null,null,null,null,null,null,null,null,null,null,null,null,null,null,null,null,null,null,null,null,null,null,null,null,null,null,null,null,null,null,null,null,"N/A","N/A","N/A","N/A","N/A","N/A","N/A","N/A","N/A","N/A",1,1,1,1,1,1,1,1,1,1]
[null,null,null,null,null,null,null,null,null,null,null,null,null,null,null,null,null,null,null,null,null,null,null,null,null,null,null,null,null,null,null,null,null,null,null,null,null,null,null,null,null,null,null,null,null,null,null,null,null,null,"N/A","N/A","N/A","N/A","N/A","N/A","N/A","N/A","N/A","N/A",1,1,1,1,1,1,1,1,1,1]
[null,null,null,null,null,null,null,null,null,null,null,null,null,null,null,null,null,null,null,null,null,null,null,null,null,null,null,null,null,null,null,null,null,null,null,null,null,null,null,null,null,null,null,null,null,null,null,null,null,null,"N/A","N/A","N/A","N/A","N/A","N/A","N/A","N/A","N/A","N/A",1,1,1,1,1,1,1,1,1,1]
[null,null,null,null,null,null,null,null,null,null,null,null,null,null,null,null,null,null,null,null,null,null,null,null,null,null,null,null,null,null,null,null,null,null,null,null,null,null,null,null,null,null,null,null,null,null,null,null,null,null,"N/A","N/A","N/A","N/A","N/A","N/A","N/A","N/A","N/A","N/A",1,1,1,1,1,1,1,1,1,1]
[null,null,null,null,null,null,null,null,null,null,null,null,null,null,null,null,null,null,null,null,null,null,null,null,null,null,null,null,null,null,null,null,null,null,null,null,null,null,null,null,null,null,null,null,null,null,null,null,null,null,"N/A","N/A","N/A","N/A","N/A","N/A","N/A","N/A","N/A","N/A",1,1,1,1,1,1,1,1,1,1]
[null,null,null,null,null,null,null,null,null,null,null,null,null,null,null,null,null,null,null,null,null,null,null,null,null,null,null,null,null,null,null,null,null,null,null,null,null,null,null,null,null,null,null,null,null,null,null,null,null,null,"N/A","N/A","N/A","N/A","N/A","N/A","N/A","N/A","N/A","N/A",1,1,1,1,1,1,1,1,1,1]
[null,null,null,null,null,null,null,null,null,null,null,null,null,null,null,null,null,null,null,null,null,null,null,null,null,null,null,null,null,null,null,null,null,null,null,null,null,null,null,null,null,null,null,null,null,null,null,null,null,null,"N/A","N/A","N/A","N/A","N/A","N/A","N/A","N/A","N/A","N/A",1,1,1,1,1,1,1,1,1,1]
[null,null,null,null,null,null,null,null,null,null,null,null,null,null,null,null,null,null,null,null,null,null,null,null,null,null,null,null,null,null,null,null,null,null,null,null,null,null,null,null,null,null,null,null,null,null,null,null,null,null,"N/A","N/A","N/A","N/A","N/A","N/A","N/A","N/A","N/A","N/A",1,1,1,1,1,1,1,1,1,1]
[null,null,null,null,null,null,null,null,null,null,null,null,null,null,null,null,null,null,null,null,null,null,null,null,null,null,null,null,null,null,null,null,null,null,null,null,null,null,null,null,null,null,null,null,null,null,null,null,null,null,"N/A","N/A","N/A","N/A","N/A","N/A","N/A","N/A","N/A","N/A",1,1,1,1,1,1,1,1,1,1]
[null,null,null,null,null,null,null,null,null,null,null,null,null,null,null,null,null,null,null,null,null,null,null,null,null,null,null,null,null,null,null,null,null,null,null,null,null,null,null,null,null,null,null,null,null,null,null,null,null,null,"N/A","N/A","N/A","N/A","N/A","N/A","N/A","N/A","N/A","N/A",1,1,1,1,1,1,1,1,1,1]
[null,null,null,null,null,null,null,null,null,null,null,null,null,null,null,null,null,null,null,null,null,null,null,null,null,null,null,null,null,null,null,null,null,null,null,null,null,null,null,null,null,null,null,null,null,null,null,null,null,null,"N/A","N/A","N/A","N/A","N/A","N/A","N/A","N/A","N/A","N/A",1,1,1,1,1,1,1,1,1,1]
[null,null,null,null,null,null,null,null,null,null,null,null,null,null,null,null,null,null,null,null,null,null,null,null,null,null,null,null,null,null,null,null,null,null,null,null,null,null,null,null,null,null,null,null,null,null,null,null,null,null,"N/A","N/A","N/A","N/A","N/A","N/A","N/A","N/A","N/A","N/A",1,1,1,1,1,1,1,1,1,1]
[null,null,null,null,null,null,null,null,null,null,null,null,null,null,null,null,null,null,null,null,null,null,null,null,null,null,null,null,null,null,null,null,null,null,null,null,null,null,null,null,null,null,null,null,null,null,null,null,null,null,"N/A","N/A","N/A","N/A","N/A","N/A","N/A","N/A","N/A","N/A",1,1,1,1,1,1,1,1,1,1]
[null,null,null,null,null,null,null,null,null,null,null,null,null,null,null,null,null,null,null,null,null,null,null,null,null,null,null,null,null,null,null,null,null,null,null,null,null,null,null,null,null,null,null,null,null,null,null,null,null,null,"N/A","N/A","N/A","N/A","N/A","N/A","N/A","N/A","N/A","N/A",1,1,1,1,1,1,1,1,1,1]
[null,null,null,null,null,null,null,null,null,null,null,null,null,null,null,null,null,null,null,null,null,null,null,null,null,null,null,null,null,null,null,null,null,null,null,null,null,null,null,null,null,null,null,null,null,null,null,null,null,null,"N/A","N/A","N/A","N/A","N/A","N/A","N/A","N/A","N/A","N/A",1,1,1,1,1,1,1,1,1,1]
[null,null,null,null,null,null,null,null,null,null,null,null,null,null,null,null,null,null,null,null,null,null,null,null,null,null,null,null,null,null,null,null,null,null,null,null,null,null,null,null,null,null,null,null,null,null,null,null,null,null,"N/A","N/A","N/A","N/A","N/A","N/A","N/A","N/A","N/A","N/A",1,1,1,1,1,1,1,1,1,1]
[null,null,null,null,null,null,null,null,null,null,null,null,null,null,null,null,null,null,null,null,null,null,null,null,null,null,null,null,null,null,null,null,null,null,null,null,null,null,null,null,null,null,null,null,null,null,null,null,null,null,"N/A","N/A","N/A","N/A","N/A","N/A","N/A","N/A","N/A","N/A",1,1,1,1,1,1,1,1,1,1]
[null,null,null,null,null,null,null,null,null,null,null,null,null,null,null,null,null,null,null,null,null,null,null,null,null,null,null,null,null,null,null,null,null,null,null,null,null,null,null,null,null,null,null,null,null,null,null,null,null,null,"N/A","N/A","N/A","N/A","N/A","N/A","N/A","N/A","N/A","N/A",1,1,1,1,1,1,1,1,1,1]
[null,null,null,null,null,null,null,null,null,null,null,null,null,null,null,null,null,null,null,null,null,null,null,null,null,null,null,null,null,null,null,null,null,null,null,null,null,null,null,null,null,null,null,null,null,null,null,null,null,null,"N/A","N/A","N/A","N/A","N/A","N/A","N/A","N/A","N/A","N/A",1,1,1,1,1,1,1,1,1,1]
[null,null,null,null,null,null,null,null,null,null,null,null,null,null,null,null,null,null,null,null,null,null,null,null,null,null,null,null,null,null,null,null,null,null,null,null,null,null,null,null,null,null,null,null,null,null,null,null,null,null,"N/A","N/A","N/A","N/A","N/A","N/A","N/A","N/A","N/A","N/A",1,1,1,1,1,1,1,1,1,1]
[null,null,null,null,null,null,null,null,null,null,null,null,null,null,null,null,null,null,null,null,null,null,null,null,null,null,null,null,null,null,null,null,null,null,null,null,null,null,null,null,null,null,null,null,null,null,null,null,null,null,"N/A","N/A","N/A","N/A","N/A","N/A","N/A","N/A","N/A","N/A",1,1,1,1,1,1,1,1,1,1]
[null,null,null,null,null,null,null,null,null,null,null,null,null,null,null,null,null,null,null,null,null,null,null,null,null,null,null,null,null,null,null,null,null,null,null,null,null,null,null,null,null,null,null,null,null,null,null,null,null,null,"N/A","N/A","N/A","N/A","N/A","N/A","N/A","N/A","N/A","N/A",1,1,1,1,1,1,1,1,1,1]
[null,null,null,null,null,null,null,null,null,null,null,null,null,null,null,null,null,null,null,null,null,null,null,null,null,null,null,null,null,null,null,null,null,null,null,null,null,null,null,null,null,null,null,null,null,null,null,null,null,null,"N/A","N/A","N/A","N/A","N/A","N/A","N/A","N/A","N/A","N/A",1,1,1,1,1,1,1,1,1,1]
[null,null,null,null,null,null,null,null,null,null,null,null,null,null,null,null,null,null,null,null,null,null,null,null,null,null,null,null,null,null,null,null,null,null,null,null,null,null,null,null,null,null,null,null,null,null,null,null,null,null,"N/A","N/A","N/A","N/A","N/A","N/A","N/A","N/A","N/A","N/A",1,1,1,1,1,1,1,1,1,1]
[null,null,null,null,null,null,null,null,null,null,null,null,null,null,null,null,null,null,null,null,null,null,null,null,null,null,null,null,null,null,null,null,null,null,null,null,null,null,null,null,null,null,null,null,null,null,null,null,null,null,"N/A","N/A","N/A","N/A","N/A","N/A","N/A","N/A","N/A","N/A",1,1,1,1,1,1,1,1,1,1]
[null,null,null,null,null,null,null,null,null,null,null,null,null,null,null,null,null,null,null,null,null,null,null,null,null,null,null,null,null,null,null,null,null,null,null,null,null,null,null,null,null,null,null,null,null,null,null,null,null,null,"N/A","N/A","N/A","N/A","N/A","N/A","N/A","N/A","N/A","N/A",1,1,1,1,1,1,1,1,1,1]
[null,null,null,null,null,null,null,null,null,null,null,null,null,null,null,null,null,null,null,null,null,null,null,null,null,null,null,null,null,null,null,null,null,null,null,null,null,null,null,null,null,null,null,null,null,null,null,null,null,null,"N/A","N/A","N/A","N/A","N/A","N/A","N/A","N/A","N/A","N/A",1,1,1,1,1,1,1,1,1,1]
[null,null,null,null,null,null,null,null,null,null,null,null,null,null,null,null,null,null,null,null,null,null,null,null,null,null,null,null,null,null,null,null,null,null,null,null,null,null,null,null,null,null,null,null,null,null,null,null,null,null,"N/A","N/A","N/A","N/A","N/A","N/A","N/A","N/A","N/A","N/A",1,1,1,1,1,1,1,1,1,1]
[null,null,null,null,null,null,null,null,null,null,null,null,null,null,null,null,null,null,null,null,null,null,null,null,null,null,null,null,null,null,null,null,null,null,null,null,null,null,null,null,null,null,null,null,null,null,null,null,null,null,"N/A","N/A","N/A","N/A","N/A","N/A","N/A","N/A","N/A","N/A",1,1,{"$f":"IF(BA127=\"N/A\",1,\"\")","v":1},{"$f":"IF(BB127=\"N/A\",1,\"\")","v":1},{"$f":"IF(BC127=\"N/A\",1,\"\")","v":1},{"$f":"IF(BD127=\"N/A\",1,\"\")","v":1},{"$f":"IF(BE127=\"N/A\",1,\"\")","v":1},1,1,{"$f":"IF(BH127=\"N/A\",1,\"\")","v":1}]
[null,null,null,null,null,null,null,null,null,null,null,null,null,null,null,null,null,null,null,null,null,null,null,null,null,null,null,null,null,null,null,null,null,null,null,null,null,null,null,null,null,null,null,null,null,null,null,null,null,null,"N/A","N/A","N/A","N/A","N/A","N/A","N/A","N/A","N/A","N/A",{"$f":"IF(AY128=\"N/A\",1,\"\")","v":1},{"$f":"IF(AZ128=\"N/A\",1,\"\")","v":1},1,1,1,1,1,1,1,1]
[null,null,null,null,null,null,null,null,null,null,null,null,null,null,null,null,null,null,null,null,null,null,null,null,null,null,null,null,null,null,null,null,null,null,null,null,null,null,null,null,null,null,null,null,null,null,null,null,null,null,"N/A","N/A","N/A","N/A","N/A","N/A","N/A","N/A","N/A","N/A",1,1,1,1,1,1,1,1,1,1]
[null,null,null,null,null,null,null,null,null,null,null,null,null,null,null,null,null,null,null,null,null,null,null,null,null,null,null,null,null,null,null,null,null,null,null,null,null,null,null,null,null,null,null,null,null,null,null,null,null,null,"N/A","N/A","N/A","N/A","N/A","N/A","N/A","N/A","N/A","N/A",1,1,1,1,1,1,1,1,1,1]
[null,null,null,null,null,null,null,null,null,null,null,null,null,null,null,null,null,null,null,null,null,null,null,null,null,null,null,null,null,null,null,null,null,null,null,null,null,null,null,null,null,null,null,null,null,null,null,null,null,null,"N/A","N/A","N/A","N/A","N/A","N/A","N/A","N/A","N/A","N/A",1,1,1,1,1,1,1,1,1,1]
[null,null,null,null,null,null,null,null,null,null,null,null,null,null,null,null,null,null,null,null,null,null,null,null,null,null,null,null,null,null,null,null,null,null,null,null,null,null,null,null,null,null,null,null,null,null,null,null,null,null,"N/A","N/A","N/A","N/A","N/A","N/A","N/A","N/A","N/A","N/A",1,1,1,1,1,1,1,1,1,1]
[null,null,null,null,null,null,null,null,null,null,null,null,null,null,null,null,null,null,null,null,null,null,null,null,null,null,null,null,null,null,null,null,null,null,null,null,null,null,null,null,null,null,null,null,null,null,null,null,null,null,"N/A","N/A","N/A","N/A","N/A","N/A","N/A","N/A","N/A","N/A",1,1,1,1,1,1,1,1,1,1]
[null,null,null,null,null,null,null,null,null,null,null,null,null,null,null,null,null,null,null,null,null,null,null,null,null,null,null,null,null,null,null,null,null,null,null,null,null,null,null,null,null,null,null,null,null,null,null,null,null,null,"N/A","N/A","N/A","N/A","N/A","N/A","N/A","N/A","N/A","N/A",1,1,1,1,1,1,1,1,1,1]
[null,null,null,null,null,null,null,null,null,null,null,null,null,null,null,null,null,null,null,null,null,null,null,null,null,null,null,null,null,null,null,null,null,null,null,null,null,null,null,null,null,null,null,null,null,null,null,null,null,null,"N/A","N/A","N/A","N/A","N/A","N/A","N/A","N/A","N/A","N/A",1,1,1,1,1,1,1,1,1,1]
[null,null,null,null,null,null,null,null,null,null,null,null,null,null,null,null,null,null,null,null,null,null,null,null,null,null,null,null,null,null,null,null,null,null,null,null,null,null,null,null,null,null,null,null,null,null,null,null,null,null,"N/A","N/A","N/A","N/A","N/A","N/A","N/A","N/A","N/A","N/A",1,1,1,1,1,1,1,1,1,1]
[null,null,null,null,null,null,null,null,null,null,null,null,null,null,null,null,null,null,null,null,null,null,null,null,null,null,null,null,null,null,null,null,null,null,null,null,null,null,null,null,null,null,null,null,null,null,null,null,null,null,"N/A","N/A","N/A","N/A","N/A","N/A","N/A","N/A","N/A","N/A",1,1,1,1,1,1,1,1,1,1]
[null,null,null,null,null,null,null,null,null,null,null,null,null,null,null,null,null,null,null,null,null,null,null,null,null,null,null,null,null,null,null,null,null,null,null,null,null,null,null,null,null,null,null,null,null,null,null,null,null,null,"N/A","N/A","N/A","N/A","N/A","N/A","N/A","N/A","N/A","N/A",1,1,1,1,1,1,1,1,1,1]
[null,null,null,null,null,null,null,null,null,null,null,null,null,null,null,null,null,null,null,null,null,null,null,null,null,null,null,null,null,null,null,null,null,null,null,null,null,null,null,null,null,null,null,null,null,null,null,null,null,null,"N/A","N/A","N/A","N/A","N/A","N/A","N/A","N/A","N/A","N/A",1,1,1,1,1,1,1,1,1,1]
[null,null,null,null,null,null,null,null,null,null,null,null,null,null,null,null,null,null,null,null,null,null,null,null,null,null,null,null,null,null,null,null,null,null,null,null,null,null,null,null,null,null,null,null,null,null,null,null,null,null,"N/A","N/A","N/A","N/A","N/A","N/A","N/A","N/A","N/A","N/A",1,1,1,1,1,1,1,1,1,1]
[null,null,null,null,null,null,null,null,null,null,null,null,null,null,null,null,null,null,null,null,null,null,null,null,null,null,null,null,null,null,null,null,null,null,null,null,null,null,null,null,null,null,null,null,null,null,null,null,null,null,"N/A","N/A","N/A","N/A","N/A","N/A","N/A","N/A","N/A","N/A",1,1,1,1,1,1,1,1,1,1]
[null,null,null,null,null,null,null,null,null,null,null,null,null,null,null,null,null,null,null,null,null,null,null,null,null,null,null,null,null,null,null,null,null,null,null,null,null,null,null,null,null,null,null,null,null,null,null,null,null,null,"N/A","N/A","N/A","N/A","N/A","N/A","N/A","N/A","N/A","N/A",1,1,1,1,1,1,1,1,1,1]
[null,null,null,null,null,null,null,null,null,null,null,null,null,null,null,null,null,null,null,null,null,null,null,null,null,null,null,null,null,null,null,null,null,null,null,null,null,null,null,null,null,null,null,null,null,null,null,null,null,null,"N/A","N/A","N/A","N/A","N/A","N/A","N/A","N/A","N/A","N/A",1,1,1,1,1,1,1,1,1,1]
[null,null,null,null,null,null,null,null,null,null,null,null,null,null,null,null,null,null,null,null,null,null,null,null,null,null,null,null,null,null,null,null,null,null,null,null,null,null,null,null,null,null,null,null,null,null,null,null,null,null,{"$f":"IF(COUNTA(E144:J144)>0,(COUNTIF(E144:J144,\"=0\")*0+COUNTIF(E144:J144,\"=1\")*100+COUNTIF(E144:J144,\"=2\")*80+COUNTIF(E144:J144,\"=3\")*50+COUNTIF(E144:J144,\"=8\")*20+COUNTIF(E144:J144,\"=9\")*0)/COUNTA(E144:J144)/100,\"N/A\")","v":"N/A"},{"$f":"IF(COUNTA(K144:O144)>0,(COUNTIF(K144:O144,\"=0\")*0+COUNTIF(K144:O144,\"=1\")*100+COUNTIF(K144:O144,\"=2\")*80+COUNTIF(K144:O144,\"=3\")*50+COUNTIF(K144:O144,\"=8\")*20+COUNTIF(K144:O144,\"=9\")*0)/COUNTA(K144:O144)/100,\"N/A\")","v":"N/A"},{"$f":"IF(COUNTA(P144:U144)>0,(COUNTIF(P144:U144,\"=0\")*0+COUNTIF(P144:U144,\"=1\")*100+COUNTIF(P144:U144,\"=2\")*80+COUNTIF(P144:U144,\"=3\")*50+COUNTIF(P144:U144,\"=8\")*20+COUNTIF(P144:U144,\"=9\")*0)/COUNTA(P144:U144)/100,\"N/A\")","v":"N/A"},{"$f":"IF(COUNTA(V144)<>0,(COUNTIF(V144,\"=0\")*0+COUNTIF(V144,\"=1\")*100+COUNTIF(V144,\"=2\")*80+COUNTIF(V144,\"=3\")*50+COUNTIF(V144,\"=8\")*20+COUNTIF(V144,\"=9\")*0)/COUNTA(V144)/100,\"N/A\")","v":"N/A"},{"$f":"IF(COUNTA(W144:X144)>0,(COUNTIF(W144:X144,\"=0\")*0+COUNTIF(W144:X144,\"=1\")*100+COUNTIF(W144:X144,\"=2\")*80+COUNTIF(W144:X144,\"=3\")*50+COUNTIF(W144:X144,\"=8\")*20+COUNTIF(W144:X144,\"=9\")*0)/COUNTA(W144:X144)/100,\"N/A\")","v":"N/A"},{"$f":"IF(COUNTA(Y144:AJ144)>0,(COUNTIF(Y144:AJ144,\"=0\")*0+COUNTIF(Y144:AJ144,\"=1\")*100+COUNTIF(Y144:AJ144,\"=2\")*80+COUNTIF(Y144:AJ144,\"=3\")*50+COUNTIF(Y144:AJ144,\"=8\")*20+COUNTIF(Y144:AJ144,\"=9\")*0)/COUNTA(Y144:AJ144)/100,\"N/A\")","v":"N/A"},{"$f":"IF(COUNTA(AK144:AP144)>0,(COUNTIF(AK144:AP144,\"=0\")*0+COUNTIF(AK144:AP144,\"=1\")*100+COUNTIF(AK144:AP144,\"=2\")*80+COUNTIF(AK144:AP144,\"=3\")*50+COUNTIF(AK144:AP144,\"=8\")*20+COUNTIF(AK144:AP144,\"=9\")*0)/COUNTA(AK144:AP144)/100,\"N/A\")","v":"N/A"},{"$f":"IF(COUNTA(AQ144:AU144)>0,(COUNTIF(AQ144:AU144,\"=0\")*0+COUNTIF(AQ144:AU144,\"=1\")*100+COUNTIF(AQ144:AU144,\"=2\")*80+COUNTIF(AQ144:AU144,\"=3\")*50+COUNTIF(AQ144:AU144,\"=8\")*20+COUNTIF(AQ144:AU144,\"=9\")*0)/COUNTA(AQ144:AU144)/100,\"N/A\")","v":"N/A"},{"$f":"IF(COUNTA(AV144:AX144)>0,(COUNTIF(AV144:AX144,\"=0\")*0+COUNTIF(AV144:AX144,\"=1\")*100+COUNTIF(AV144:AX144,\"=2\")*80+COUNTIF(AV144:AX144,\"=3\")*50+COUNTIF(AV144:AX144,\"=8\")*20+COUNTIF(AV144:AX144,\"=9\")*0)/COUNTA(AV144:AX144)/100,\"N/A\")","v":"N/A"},{"$f":"IF(AND(COUNTA(E144:AX144)<>0,B144<>\"\"),AVERAGE(BA144:BG144),\"N/A\")","v":"N/A"},1,1,1,1,1,1,1,{"$f":"IF(BF144=\"N/A\",1,\"\")","v":1},{"$f":"IF(BG144=\"N/A\",1,\"\")","v":1},1]
[null,null,null,null,null,null,null,null,null,null,null,null,null,null,null,null,null,null,null,null,null,null,null,null,null,null,null,null,null,null,null,null,null,null,null,null,null,null,null,null,null,null,null,null,null,null,null,null,null,null,"N/A","N/A","N/A","N/A","N/A","N/A","N/A","N/A","N/A","N/A",1,1,1,1,1,1,1,1,1,1]
[null,null,null,null,null,null,null,null,null,null,null,null,null,null,null,null,null,null,null,null,null,null,null,null,null,null,null,null,null,null,null,null,null,null,null,null,null,null,null,null,null,null,null,null,null,null,null,null,null,null,"N/A","N/A","N/A","N/A","N/A","N/A","N/A","N/A","N/A","N/A",1,1,1,1,1,1,1,1,1,1]
[null,null,null,null,null,null,null,null,null,null,null,null,null,null,null,null,null,null,null,null,null,null,null,null,null,null,null,null,null,null,null,null,null,null,null,null,null,null,null,null,null,null,null,null,null,null,null,null,null,null,"N/A","N/A","N/A","N/A","N/A","N/A","N/A","N/A","N/A","N/A",1,1,1,1,1,1,1,1,1,1]
[null,null,null,null,null,null,null,null,null,null,null,null,null,null,null,null,null,null,null,null,null,null,null,null,null,null,null,null,null,null,null,null,null,null,null,null,null,null,null,null,null,null,null,null,null,null,null,null,null,null,"N/A","N/A","N/A","N/A","N/A","N/A","N/A","N/A","N/A","N/A",1,1,1,1,1,1,1,1,1,1]
[null,null,null,null,null,null,null,null,null,null,null,null,null,null,null,null,null,null,null,null,null,null,null,null,null,null,null,null,null,null,null,null,null,null,null,null,null,null,null,null,null,null,null,null,null,null,null,null,null,null,"N/A","N/A","N/A","N/A","N/A","N/A","N/A","N/A","N/A","N/A",1,1,1,1,1,1,1,1,1,1]
[null,null,null,null,null,null,null,null,null,null,null,null,null,null,null,null,null,null,null,null,null,null,null,null,null,null,null,null,null,null,null,null,null,null,null,null,null,null,null,null,null,null,null,null,null,null,null,null,null,null,"N/A","N/A","N/A","N/A","N/A","N/A","N/A","N/A","N/A","N/A",1,1,1,1,1,1,1,1,1,1]
[null,null,null,null,null,null,null,null,null,null,null,null,null,null,null,null,null,null,null,null,null,null,null,null,null,null,null,null,null,null,null,null,null,null,null,null,null,null,null,null,null,null,null,null,null,null,null,null,null,null,"N/A","N/A","N/A","N/A","N/A","N/A","N/A","N/A","N/A","N/A",1,1,1,1,1,1,1,1,1,1]
[null,null,null,null,null,null,null,null,null,null,null,null,null,null,null,null,null,null,null,null,null,null,null,null,null,null,null,null,null,null,null,null,null,null,null,null,null,null,null,null,null,null,null,null,null,null,null,null,null,null,"N/A","N/A","N/A","N/A","N/A","N/A","N/A","N/A","N/A","N/A",1,1,1,1,1,1,1,1,1,1]
[null,null,null,null,null,null,null,null,null,null,null,null,null,null,null,null,null,null,null,null,null,null,null,null,null,null,null,null,null,null,null,null,null,null,null,null,null,null,null,null,null,null,null,null,null,null,null,null,null,null,"N/A","N/A","N/A","N/A","N/A","N/A","N/A","N/A","N/A","N/A",1,1,1,1,1,1,1,1,1,1]
[null,null,null,null,null,null,null,null,null,null,null,null,null,null,null,null,null,null,null,null,null,null,null,null,null,null,null,null,null,null,null,null,null,null,null,null,null,null,null,null,null,null,null,null,null,null,null,null,null,null,"N/A","N/A","N/A","N/A","N/A","N/A","N/A","N/A","N/A","N/A",1,1,1,1,1,1,1,1,1,1]
[null,null,null,null,null,null,null,null,null,null,null,null,null,null,null,null,null,null,null,null,null,null,null,null,null,null,null,null,null,null,null,null,null,null,null,null,null,null,null,null,null,null,null,null,null,null,null,null,null,null,"N/A","N/A","N/A","N/A","N/A","N/A","N/A","N/A","N/A","N/A",1,1,1,1,1,1,1,1,1,1]
[null,null,null,null,null,null,null,null,null,null,null,null,null,null,null,null,null,null,null,null,null,null,null,null,null,null,null,null,null,null,null,null,null,null,null,null,null,null,null,null,null,null,null,null,null,null,null,null,null,null,"N/A","N/A","N/A","N/A","N/A","N/A","N/A","N/A","N/A","N/A",1,1,1,1,1,1,1,1,1,{"$f":"IF(BH156=\"N/A\",1,\"\")","v":1}]
[null,null,null,null,null,null,null,null,null,null,null,null,null,null,null,null,null,null,null,null,null,null,null,null,null,null,null,null,null,null,null,null,null,null,null,null,null,null,null,null,null,null,null,null,null,null,null,null,null,null,"N/A","N/A","N/A","N/A","N/A","N/A","N/A","N/A","N/A","N/A",1,1,1,1,1,1,1,1,1,1]
[null,null,null,null,null,null,null,null,null,null,null,null,null,null,null,null,null,null,null,null,null,null,null,null,null,null,null,null,null,null,null,null,null,null,null,null,null,null,null,null,null,null,null,null,null,null,null,null,null,null,"N/A","N/A","N/A","N/A","N/A","N/A","N/A","N/A","N/A","N/A",1,1,1,1,1,1,1,1,1,1]
[null,null,null,null,null,null,null,null,null,null,null,null,null,null,null,null,null,null,null,null,null,null,null,null,null,null,null,null,null,null,null,null,null,null,null,null,null,null,null,null,null,null,null,null,null,null,null,null,null,null,"N/A","N/A","N/A","N/A","N/A","N/A","N/A","N/A","N/A","N/A",1,1,{"$f":"IF(BA159=\"N/A\",1,\"\")","v":1},{"$f":"IF(BB159=\"N/A\",1,\"\")","v":1},{"$f":"IF(BC159=\"N/A\",1,\"\")","v":1},{"$f":"IF(BD159=\"N/A\",1,\"\")","v":1},{"$f":"IF(BE159=\"N/A\",1,\"\")","v":1},1,1,1]
[null,null,null,null,null,null,null,null,null,null,null,null,null,null,null,null,null,null,null,null,null,null,null,null,null,null,null,null,null,null,null,null,null,null,null,null,null,null,null,null,null,null,null,null,null,null,null,null,null,null,"N/A","N/A","N/A","N/A","N/A","N/A","N/A","N/A","N/A","N/A",{"$f":"IF(AY160=\"N/A\",1,\"\")","v":1},{"$f":"IF(AZ160=\"N/A\",1,\"\")","v":1},1,1,1,1,1,1,1,1]
[null,null,null,null,null,null,null,null,null,null,null,null,null,null,null,null,null,null,null,null,null,null,null,null,null,null,null,null,null,null,null,null,null,null,null,null,null,null,null,null,null,null,null,null,null,null,null,null,null,null,"N/A","N/A","N/A","N/A","N/A","N/A","N/A","N/A","N/A","N/A",1,1,1,1,1,1,1,1,1,1]
[null,null,null,null,null,null,null,null,null,null,null,null,null,null,null,null,null,null,null,null,null,null,null,null,null,null,null,null,null,null,null,null,null,null,null,null,null,null,null,null,null,null,null,null,null,null,null,null,null,null,"N/A","N/A","N/A","N/A","N/A","N/A","N/A","N/A","N/A","N/A",1,1,1,1,1,1,1,1,1,1]
[null,null,null,null,null,null,null,null,null,null,null,null,null,null,null,null,null,null,null,null,null,null,null,null,null,null,null,null,null,null,null,null,null,null,null,null,null,null,null,null,null,null,null,null,null,null,null,null,null,null,"N/A","N/A","N/A","N/A","N/A","N/A","N/A","N/A","N/A","N/A",1,1,1,1,1,1,1,1,1,1]
[null,null,null,null,null,null,null,null,null,null,null,null,null,null,null,null,null,null,null,null,null,null,null,null,null,null,null,null,null,null,null,null,null,null,null,null,null,null,null,null,null,null,null,null,null,null,null,null,null,null,"N/A","N/A","N/A","N/A","N/A","N/A","N/A","N/A","N/A","N/A",1,1,1,1,1,1,1,1,1,1]
[null,null,null,null,null,null,null,null,null,null,null,null,null,null,null,null,null,null,null,null,null,null,null,null,null,null,null,null,null,null,null,null,null,null,null,null,null,null,null,null,null,null,null,null,null,null,null,null,null,null,"N/A","N/A","N/A","N/A","N/A","N/A","N/A","N/A","N/A","N/A",1,1,1,1,1,1,1,1,1,1]
[null,null,null,null,null,null,null,null,null,null,null,null,null,null,null,null,null,null,null,null,null,null,null,null,null,null,null,null,null,null,null,null,null,null,null,null,null,null,null,null,null,null,null,null,null,null,null,null,null,null,"N/A","N/A","N/A","N/A","N/A","N/A","N/A","N/A","N/A","N/A",1,1,1,1,1,1,1,1,1,1]
[null,null,null,null,null,null,null,null,null,null,null,null,null,null,null,null,null,null,null,null,null,null,null,null,null,null,null,null,null,null,null,null,null,null,null,null,null,null,null,null,null,null,null,null,null,null,null,null,null,null,"N/A","N/A","N/A","N/A","N/A","N/A","N/A","N/A","N/A","N/A",1,1,1,1,1,1,1,1,1,1]
[null,null,null,null,null,null,null,null,null,null,null,null,null,null,null,null,null,null,null,null,null,null,null,null,null,null,null,null,null,null,null,null,null,null,null,null,null,null,null,null,null,null,null,null,null,null,null,null,null,null,"N/A","N/A","N/A","N/A","N/A","N/A","N/A","N/A","N/A","N/A",1,1,1,1,1,1,1,1,1,1]
[null,null,null,null,null,null,null,null,null,null,null,null,null,null,null,null,null,null,null,null,null,null,null,null,null,null,null,null,null,null,null,null,null,null,null,null,null,null,null,null,null,null,null,null,null,null,null,null,null,null,"N/A","N/A","N/A","N/A","N/A","N/A","N/A","N/A","N/A","N/A",1,1,1,1,1,1,1,1,1,1]
[null,null,null,null,null,null,null,null,null,null,null,null,null,null,null,null,null,null,null,null,null,null,null,null,null,null,null,null,null,null,null,null,null,null,null,null,null,null,null,null,null,null,null,null,null,null,null,null,null,null,"N/A","N/A","N/A","N/A","N/A","N/A","N/A","N/A","N/A","N/A",1,1,1,1,1,1,1,1,1,1]
[null,null,null,null,null,null,null,null,null,null,null,null,null,null,null,null,null,null,null,null,null,null,null,null,null,null,null,null,null,null,null,null,null,null,null,null,null,null,null,null,null,null,null,null,null,null,null,null,null,null,"N/A","N/A","N/A","N/A","N/A","N/A","N/A","N/A","N/A","N/A",1,1,1,1,1,1,1,1,1,1]
[null,null,null,null,null,null,null,null,null,null,null,null,null,null,null,null,null,null,null,null,null,null,null,null,null,null,null,null,null,null,null,null,null,null,null,null,null,null,null,null,null,null,null,null,null,null,null,null,null,null,"N/A","N/A","N/A","N/A","N/A","N/A","N/A","N/A","N/A","N/A",1,1,1,1,1,1,1,1,1,1]
[null,null,null,null,null,null,null,null,null,null,null,null,null,null,null,null,null,null,null,null,null,null,null,null,null,null,null,null,null,null,null,null,null,null,null,null,null,null,null,null,null,null,null,null,null,null,null,null,null,null,"N/A","N/A","N/A","N/A","N/A","N/A","N/A","N/A","N/A","N/A",1,1,1,1,1,1,1,1,1,1]
[null,null,null,null,null,null,null,null,null,null,null,null,null,null,null,null,null,null,null,null,null,null,null,null,null,null,null,null,null,null,null,null,null,null,null,null,null,null,null,null,null,null,null,null,null,null,null,null,null,null,"N/A","N/A","N/A","N/A","N/A","N/A","N/A","N/A","N/A","N/A",1,1,1,1,1,1,1,1,1,1]
[null,null,null,null,null,null,null,null,null,null,null,null,null,null,null,null,null,null,null,null,null,null,null,null,null,null,null,null,null,null,null,null,null,null,null,null,null,null,null,null,null,null,null,null,null,null,null,null,null,null,"N/A","N/A","N/A","N/A","N/A","N/A","N/A","N/A","N/A","N/A",1,1,1,1,1,1,1,1,1,1]
[null,null,null,null,null,null,null,null,null,null,null,null,null,null,null,null,null,null,null,null,null,null,null,null,null,null,null,null,null,null,null,null,null,null,null,null,null,null,null,null,null,null,null,null,null,null,null,null,null,null,"N/A","N/A","N/A","N/A","N/A","N/A","N/A","N/A","N/A","N/A",1,1,1,1,1,1,1,1,1,1]
[null,null,null,null,null,null,null,null,null,null,null,null,null,null,null,null,null,null,null,null,null,null,null,null,null,null,null,null,null,null,null,null,null,null,null,null,null,null,null,null,null,null,null,null,null,null,null,null,null,null,"N/A","N/A","N/A","N/A","N/A","N/A","N/A","N/A","N/A","N/A",1,1,1,1,1,1,1,1,1,1]
[null,null,null,null,null,null,null,null,null,null,null,null,null,null,null,null,null,null,null,null,null,null,null,null,null,null,null,null,null,null,null,null,null,null,null,null,null,null,null,null,null,null,null,null,null,null,null,null,null,null,"N/A","N/A","N/A","N/A","N/A","N/A","N/A","N/A","N/A","N/A",1,1,1,1,1,1,1,1,1,1]
[null,null,null,null,null,null,null,null,null,null,null,null,null,null,null,null,null,null,null,null,null,null,null,null,null,null,null,null,null,null,null,null,null,null,null,null,null,null,null,null,null,null,null,null,null,null,null,null,null,null,"N/A","N/A","N/A","N/A","N/A","N/A","N/A","N/A","N/A","N/A",1,1,1,1,1,1,1,1,1,1]
[null,null,null,null,null,null,null,null,null,null,null,null,null,null,null,null,null,null,null,null,null,null,null,null,null,null,null,null,null,null,null,null,null,null,null,null,null,null,null,null,null,null,null,null,null,null,null,null,null,null,"N/A","N/A","N/A","N/A","N/A","N/A","N/A","N/A","N/A","N/A",1,1,1,1,1,1,1,1,1,1]
[null,null,null,null,null,null,null,null,null,null,null,null,null,null,null,null,null,null,null,null,null,null,null,null,null,null,null,null,null,null,null,null,null,null,null,null,null,null,null,null,null,null,null,null,null,null,null,null,null,null,"N/A","N/A","N/A","N/A","N/A","N/A","N/A","N/A","N/A","N/A",1,1,1,1,1,1,1,1,1,1]
[null,null,null,null,null,null,null,null,null,null,null,null,null,null,null,null,null,null,null,null,null,null,null,null,null,null,null,null,null,null,null,null,null,null,null,null,null,null,null,null,null,null,null,null,null,null,null,null,null,null,"N/A","N/A","N/A","N/A","N/A","N/A","N/A","N/A","N/A","N/A",1,1,1,1,1,1,1,1,1,1]
[null,null,null,null,null,null,null,null,null,null,null,null,null,null,null,null,null,null,null,null,null,null,null,null,null,null,null,null,null,null,null,null,null,null,null,null,null,null,null,null,null,null,null,null,null,null,null,null,null,null,"N/A","N/A","N/A","N/A","N/A","N/A","N/A","N/A","N/A","N/A",1,1,1,1,1,1,1,1,1,1]
[null,null,null,null,null,null,null,null,null,null,null,null,null,null,null,null,null,null,null,null,null,null,null,null,null,null,null,null,null,null,null,null,null,null,null,null,null,null,null,null,null,null,null,null,null,null,null,null,null,null,"N/A","N/A","N/A","N/A","N/A","N/A","N/A","N/A","N/A","N/A",1,1,1,1,1,1,1,1,1,1]
[null,null,null,null,null,null,null,null,null,null,null,null,null,null,null,null,null,null,null,null,null,null,null,null,null,null,null,null,null,null,null,null,null,null,null,null,null,null,null,null,null,null,null,null,null,null,null,null,null,null,"N/A","N/A","N/A","N/A","N/A","N/A","N/A","N/A","N/A","N/A",1,1,1,1,1,1,1,1,1,1]
[null,null,null,null,null,null,null,null,null,null,null,null,null,null,null,null,null,null,null,null,null,null,null,null,null,null,null,null,null,null,null,null,null,null,null,null,null,null,null,null,null,null,null,null,null,null,null,null,null,null,"N/A","N/A","N/A","N/A","N/A","N/A","N/A","N/A","N/A","N/A",1,1,1,1,1,1,1,1,1,1]
[null,null,null,null,null,null,null,null,null,null,null,null,null,null,null,null,null,null,null,null,null,null,null,null,null,null,null,null,null,null,null,null,null,null,null,null,null,null,null,null,null,null,null,null,null,null,null,null,null,null,"N/A","N/A","N/A","N/A","N/A","N/A","N/A","N/A","N/A","N/A",1,1,1,1,1,1,1,1,1,1]
[null,null,null,null,null,null,null,null,null,null,null,null,null,null,null,null,null,null,null,null,null,null,null,null,null,null,null,null,null,null,null,null,null,null,null,null,null,null,null,null,null,null,null,null,null,null,null,null,null,null,"N/A","N/A","N/A","N/A","N/A","N/A","N/A","N/A","N/A","N/A",1,1,1,1,1,1,1,1,1,1]
[null,null,null,null,null,null,null,null,null,null,null,null,null,null,null,null,null,null,null,null,null,null,null,null,null,null,null,null,null,null,null,null,null,null,null,null,null,null,null,null,null,null,null,null,null,null,null,null,null,null,"N/A","N/A","N/A","N/A","N/A","N/A","N/A","N/A","N/A","N/A",1,1,1,1,1,1,1,1,1,1]
[null,null,null,null,null,null,null,null,null,null,null,null,null,null,null,null,null,null,null,null,null,null,null,null,null,null,null,null,null,null,null,null,null,null,null,null,null,null,null,null,null,null,null,null,null,null,null,null,null,null,"N/A","N/A","N/A","N/A","N/A","N/A","N/A","N/A","N/A","N/A",1,1,1,1,1,1,1,1,1,1]
[null,null,null,null,null,null,null,null,null,null,null,null,null,null,null,null,null,null,null,null,null,null,null,null,null,null,null,null,null,null,null,null,null,null,null,null,null,null,null,null,null,null,null,null,null,null,null,null,null,null,"N/A","N/A","N/A","N/A","N/A","N/A","N/A","N/A","N/A","N/A",1,1,{"$f":"IF(BA191=\"N/A\",1,\"\")","v":1},{"$f":"IF(BB191=\"N/A\",1,\"\")","v":1},{"$f":"IF(BC191=\"N/A\",1,\"\")","v":1},{"$f":"IF(BD191=\"N/A\",1,\"\")","v":1},{"$f":"IF(BE191=\"N/A\",1,\"\")","v":1},1,1,1]
[null,null,null,null,null,null,null,null,null,null,null,null,null,null,null,null,null,null,null,null,null,null,null,null,null,null,null,null,null,null,null,null,null,null,null,null,null,null,null,null,null,null,null,null,null,null,null,null,null,null,"N/A","N/A","N/A","N/A","N/A","N/A","N/A","N/A","N/A","N/A",{"$f":"IF(AY192=\"N/A\",1,\"\")","v":1},{"$f":"IF(AZ192=\"N/A\",1,\"\")","v":1},1,1,1,1,1,1,1,1]
[null,null,null,null,null,null,null,null,null,null,null,null,null,null,null,null,null,null,null,null,null,null,null,null,null,null,null,null,null,null,null,null,null,null,null,null,null,null,null,null,null,null,null,null,null,null,null,null,null,null,"N/A","N/A","N/A","N/A","N/A","N/A","N/A","N/A","N/A","N/A",1,1,1,1,1,1,1,1,1,1]
[null,null,null,null,null,null,null,null,null,null,null,null,null,null,null,null,null,null,null,null,null,null,null,null,null,null,null,null,null,null,null,null,null,null,null,null,null,null,null,null,null,null,null,null,null,null,null,null,null,null,"N/A","N/A","N/A","N/A","N/A","N/A","N/A","N/A","N/A","N/A",1,1,1,1,1,1,1,1,1,1]
[null,null,null,null,null,null,null,null,null,null,null,null,null,null,null,null,null,null,null,null,null,null,null,null,null,null,null,null,null,null,null,null,null,null,null,null,null,null,null,null,null,null,null,null,null,null,null,null,null,null,"N/A","N/A","N/A","N/A","N/A","N/A","N/A","N/A","N/A","N/A",1,1,1,1,1,1,1,1,1,1]
[null,null,null,null,null,null,null,null,null,null,null,null,null,null,null,null,null,null,null,null,null,null,null,null,null,null,null,null,null,null,null,null,null,null,null,null,null,null,null,null,null,null,null,null,null,null,null,null,null,null,"N/A","N/A","N/A","N/A","N/A","N/A","N/A","N/A","N/A","N/A",1,1,1,1,1,1,1,1,1,1]
[null,null,null,null,null,null,null,null,null,null,null,null,null,null,null,null,null,null,null,null,null,null,null,null,null,null,null,null,null,null,null,null,null,null,null,null,null,null,null,null,null,null,null,null,null,null,null,null,null,null,"N/A","N/A","N/A","N/A","N/A","N/A","N/A","N/A","N/A","N/A",1,1,1,1,1,1,1,1,1,1]
[null,null,null,null,null,null,null,null,null,null,null,null,null,null,null,null,null,null,null,null,null,null,null,null,null,null,null,null,null,null,null,null,null,null,null,null,null,null,null,null,null,null,null,null,null,null,null,null,null,null,"N/A","N/A","N/A","N/A","N/A","N/A","N/A","N/A","N/A","N/A",1,1,1,1,1,1,1,1,1,1]
[null,null,null,null,null,null,null,null,null,null,null,null,null,null,null,null,null,null,null,null,null,null,null,null,null,null,null,null,null,null,null,null,null,null,null,null,null,null,null,null,null,null,null,null,null,null,null,null,null,null,"N/A","N/A","N/A","N/A","N/A","N/A","N/A","N/A","N/A","N/A",1,1,1,1,1,1,1,1,1,1]
[null,null,null,null,null,null,null,null,null,null,null,null,null,null,null,null,null,null,null,null,null,null,null,null,null,null,null,null,null,null,null,null,null,null,null,null,null,null,null,null,null,null,null,null,null,null,null,null,null,null,"N/A","N/A","N/A","N/A","N/A","N/A","N/A","N/A","N/A","N/A",1,1,1,1,1,1,1,1,1,1]
[null,null,null,null,null,null,null,null,null,null,null,null,null,null,null,null,null,null,null,null,null,null,null,null,null,null,null,null,null,null,null,null,null,null,null,null,null,null,null,null,null,null,null,null,null,null,null,null,null,null,"N/A","N/A","N/A","N/A","N/A","N/A","N/A","N/A","N/A","N/A",1,1,1,1,1,1,1,1,1,1]
[null,null,null,null,null,null,null,null,null,null,null,null,null,null,null,null,null,null,null,null,null,null,null,null,null,null,null,null,null,null,null,null,null,null,null,null,null,null,null,null,null,null,null,null,null,null,null,null,null,null,"N/A","N/A","N/A","N/A","N/A","N/A","N/A","N/A","N/A","N/A",1,1,1,1,1,1,1,1,1,1]
[null,null,null,null,null,null,null,null,null,null,null,null,null,null,null,null,null,null,null,null,null,null,null,null,null,null,null,null,null,null,null,null,null,null,null,null,null,null,null,null,null,null,null,null,null,null,null,null,null,null,"N/A","N/A","N/A","N/A","N/A","N/A","N/A","N/A","N/A","N/A",1,1,1,1,1,1,1,1,1,1]
[null,null,null,null,null,null,null,null,null,null,null,null,null,null,null,null,null,null,null,null,null,null,null,null,null,null,null,null,null,null,null,null,null,null,null,null,null,null,null,null,null,null,null,null,null,null,null,null,null,null,"N/A","N/A","N/A","N/A","N/A","N/A","N/A","N/A","N/A","N/A",1,1,1,1,1,1,1,1,1,1]
[null,null,null,null,null,null,null,null,null,null,null,null,null,null,null,null,null,null,null,null,null,null,null,null,null,null,null,null,null,null,null,null,null,null,null,null,null,null,null,null,null,null,null,null,null,null,null,null,null,null,"N/A","N/A","N/A","N/A","N/A","N/A","N/A","N/A","N/A","N/A",1,1,1,1,1,1,1,1,1,1]
[null,null,null,null,null,null,null,null,null,null,null,null,null,null,null,null,null,null,null,null,null,null,null,null,null,null,null,null,null,null,null,null,null,null,null,null,null,null,null,null,null,null,null,null,null,null,null,null,null,null,"N/A","N/A","N/A","N/A","N/A","N/A","N/A","N/A","N/A","N/A",1,1,1,1,1,1,1,1,1,1]
[null,null,null,null,null,null,null,null,null,null,null,null,null,null,null,null,null,null,null,null,null,null,null,null,null,null,null,null,null,null,null,null,null,null,null,null,null,null,null,null,null,null,null,null,null,null,null,null,null,null,"N/A","N/A","N/A","N/A","N/A","N/A","N/A","N/A","N/A","N/A",1,1,1,1,1,1,1,1,1,1]
[null,null,null,null,null,null,null,null,null,null,null,null,null,null,null,null,null,null,null,null,null,null,null,null,null,null,null,null,null,null,null,null,null,null,null,null,null,null,null,null,null,null,null,null,null,null,null,null,null,null,{"$f":"IF(COUNTA(E208:J208)>0,(COUNTIF(E208:J208,\"=0\")*0+COUNTIF(E208:J208,\"=1\")*100+COUNTIF(E208:J208,\"=2\")*80+COUNTIF(E208:J208,\"=3\")*50+COUNTIF(E208:J208,\"=8\")*20+COUNTIF(E208:J208,\"=9\")*0)/COUNTA(E208:J208)/100,\"N/A\")","v":"N/A"},{"$f":"IF(COUNTA(K208:O208)>0,(COUNTIF(K208:O208,\"=0\")*0+COUNTIF(K208:O208,\"=1\")*100+COUNTIF(K208:O208,\"=2\")*80+COUNTIF(K208:O208,\"=3\")*50+COUNTIF(K208:O208,\"=8\")*20+COUNTIF(K208:O208,\"=9\")*0)/COUNTA(K208:O208)/100,\"N/A\")","v":"N/A"},{"$f":"IF(COUNTA(P208:U208)>0,(COUNTIF(P208:U208,\"=0\")*0+COUNTIF(P208:U208,\"=1\")*100+COUNTIF(P208:U208,\"=2\")*80+COUNTIF(P208:U208,\"=3\")*50+COUNTIF(P208:U208,\"=8\")*20+COUNTIF(P208:U208,\"=9\")*0)/COUNTA(P208:U208)/100,\"N/A\")","v":"N/A"},{"$f":"IF(COUNTA(V208)<>0,(COUNTIF(V208,\"=0\")*0+COUNTIF(V208,\"=1\")*100+COUNTIF(V208,\"=2\")*80+COUNTIF(V208,\"=3\")*50+COUNTIF(V208,\"=8\")*20+COUNTIF(V208,\"=9\")*0)/COUNTA(V208)/100,\"N/A\")","v":"N/A"},{"$f":"IF(COUNTA(W208:X208)>0,(COUNTIF(W208:X208,\"=0\")*0+COUNTIF(W208:X208,\"=1\")*100+COUNTIF(W208:X208,\"=2\")*80+COUNTIF(W208:X208,\"=3\")*50+COUNTIF(W208:X208,\"=8\")*20+COUNTIF(W208:X208,\"=9\")*0)/COUNTA(W208:X208)/100,\"N/A\")","v":"N/A"},{"$f":"IF(COUNTA(Y208:AJ208)>0,(COUNTIF(Y208:AJ208,\"=0\")*0+COUNTIF(Y208:AJ208,\"=1\")*100+COUNTIF(Y208:AJ208,\"=2\")*80+COUNTIF(Y208:AJ208,\"=3\")*50+COUNTIF(Y208:AJ208,\"=8\")*20+COUNTIF(Y208:AJ208,\"=9\")*0)/COUNTA(Y208:AJ208)/100,\"N/A\")","v":"N/A"},{"$f":"IF(COUNTA(AK208:AP208)>0,(COUNTIF(AK208:AP208,\"=0\")*0+COUNTIF(AK208:AP208,\"=1\")*100+COUNTIF(AK208:AP208,\"=2\")*80+COUNTIF(AK208:AP208,\"=3\")*50+COUNTIF(AK208:AP208,\"=8\")*20+COUNTIF(AK208:AP208,\"=9\")*0)/COUNTA(AK208:AP208)/100,\"N/A\")","v":"N/A"},{"$f":"IF(COUNTA(AQ208:AU208)>0,(COUNTIF(AQ208:AU208,\"=0\")*0+COUNTIF(AQ208:AU208,\"=1\")*100+COUNTIF(AQ208:AU208,\"=2\")*80+COUNTIF(AQ208:AU208,\"=3\")*50+COUNTIF(AQ208:AU208,\"=8\")*20+COUNTIF(AQ208:AU208,\"=9\")*0)/COUNTA(AQ208:AU208)/100,\"N/A\")","v":"N/A"},{"$f":"IF(COUNTA(AV208:AX208)>0,(COUNTIF(AV208:AX208,\"=0\")*0+COUNTIF(AV208:AX208,\"=1\")*100+COUNTIF(AV208:AX208,\"=2\")*80+COUNTIF(AV208:AX208,\"=3\")*50+COUNTIF(AV208:AX208,\"=8\")*20+COUNTIF(AV208:AX208,\"=9\")*0)/COUNTA(AV208:AX208)/100,\"N/A\")","v":"N/A"},{"$f":"IF(AND(COUNTA(E208:AX208)<>0,B208<>\"\"),AVERAGE(BA208:BG208),\"N/A\")","v":"N/A"},1,1,1,1,1,1,1,{"$f":"IF(BF208=\"N/A\",1,\"\")","v":1},{"$f":"IF(BG208=\"N/A\",1,\"\")","v":1},1]
[null,null,null,null,null,null,null,null,null,null,null,null,null,null,null,null,null,null,null,null,null,null,null,null,null,null,null,null,null,null,null,null,null,null,null,null,null,null,null,null,null,null,null,null,null,null,null,null,null,null,"N/A","N/A","N/A","N/A","N/A","N/A","N/A","N/A","N/A","N/A",1,1,1,1,1,1,1,1,1,1]
[null,null,null,null,null,null,null,null,null,null,null,null,null,null,null,null,null,null,null,null,null,null,null,null,null,null,null,null,null,null,null,null,null,null,null,null,null,null,null,null,null,null,null,null,null,null,null,null,null,null,"N/A","N/A","N/A","N/A","N/A","N/A","N/A","N/A","N/A","N/A",1,1,1,1,1,1,1,1,1,1]
[null,null,null,null,null,null,null,null,null,null,null,null,null,null,null,null,null,null,null,null,null,null,null,null,null,null,null,null,null,null,null,null,null,null,null,null,null,null,null,null,null,null,null,null,null,null,null,null,null,null,"N/A","N/A","N/A","N/A","N/A","N/A","N/A","N/A","N/A","N/A",1,1,1,1,1,1,1,1,1,1]
[null,null,null,null,null,null,null,null,null,null,null,null,null,null,null,null,null,null,null,null,null,null,null,null,null,null,null,null,null,null,null,null,null,null,null,null,null,null,null,null,null,null,null,null,null,null,null,null,null,null,"N/A","N/A","N/A","N/A","N/A","N/A","N/A","N/A","N/A","N/A",1,1,1,1,1,1,1,1,1,1]
[null,null,null,null,null,null,null,null,null,null,null,null,null,null,null,null,null,null,null,null,null,null,null,null,null,null,null,null,null,null,null,null,null,null,null,null,null,null,null,null,null,null,null,null,null,null,null,null,null,null,"N/A","N/A","N/A","N/A","N/A","N/A","N/A","N/A","N/A","N/A",1,1,1,1,1,1,1,1,1,1]
[null,null,null,null,null,null,null,null,null,null,null,null,null,null,null,null,null,null,null,null,null,null,null,null,null,null,null,null,null,null,null,null,null,null,null,null,null,null,null,null,null,null,null,null,null,null,null,null,null,null,"N/A","N/A","N/A","N/A","N/A","N/A","N/A","N/A","N/A","N/A",1,1,1,1,1,1,1,1,1,1]
[null,null,null,null,null,null,null,null,null,null,null,null,null,null,null,null,null,null,null,null,null,null,null,null,null,null,null,null,null,null,null,null,null,null,null,null,null,null,null,null,null,null,null,null,null,null,null,null,null,null,"N/A","N/A","N/A","N/A","N/A","N/A","N/A","N/A","N/A","N/A",1,1,1,1,1,1,1,1,1,1]
[null,null,null,null,null,null,null,null,null,null,null,null,null,null,null,null,null,null,null,null,null,null,null,null,null,null,null,null,null,null,null,null,null,null,null,null,null,null,null,null,null,null,null,null,null,null,null,null,null,null,"N/A","N/A","N/A","N/A","N/A","N/A","N/A","N/A","N/A","N/A",{"$f":"IF(AY216=\"N/A\",1,\"\")","v":1},{"$f":"IF(AZ216=\"N/A\",1,\"\")","v":1},{"$f":"IF(BA216=\"N/A\",1,\"\")","v":1},{"$f":"IF(BB216=\"N/A\",1,\"\")","v":1},{"$f":"IF(BC216=\"N/A\",1,\"\")","v":1},{"$f":"IF(BD216=\"N/A\",1,\"\")","v":1},1,1,1,1]
[null,null,null,null,null,null,null,null,null,null,null,null,null,null,null,null,null,null,null,null,null,null,null,null,null,null,null,null,null,null,null,null,null,null,null,null,null,null,null,null,null,null,null,null,null,null,null,null,null,null,"N/A","N/A","N/A","N/A","N/A","N/A","N/A","N/A","N/A","N/A",1,1,1,1,1,1,1,1,1,1]
[null,null,null,null,null,null,null,null,null,null,null,null,null,null,null,null,null,null,null,null,null,null,null,null,null,null,null,null,null,null,null,null,null,null,null,null,null,null,null,null,null,null,null,null,null,null,null,null,null,null,"N/A","N/A","N/A","N/A","N/A","N/A","N/A","N/A","N/A","N/A",1,1,1,1,1,1,1,1,1,1]
[null,null,null,null,null,null,null,null,null,null,null,null,null,null,null,null,null,null,null,null,null,null,null,null,null,null,null,null,null,null,null,null,null,null,null,null,null,null,null,null,null,null,null,null,null,null,null,null,null,null,"N/A","N/A","N/A","N/A","N/A","N/A","N/A","N/A","N/A","N/A",1,1,1,1,1,1,1,1,1,1]
[null,null,null,null,null,null,null,null,null,null,null,null,null,null,null,null,null,null,null,null,null,null,null,null,null,null,null,null,null,null,null,null,null,null,null,null,null,null,null,null,null,null,null,null,null,null,null,null,null,null,"N/A","N/A","N/A","N/A","N/A","N/A","N/A","N/A","N/A","N/A",1,1,1,1,1,{"$f":"IF(BD220=\"N/A\",1,\"\")","v":1},{"$f":"IF(BE220=\"N/A\",1,\"\")","v":1},1,1,{"$f":"IF(BH220=\"N/A\",1,\"\")","v":1}]
[null,null,null,null,null,null,null,null,null,null,null,null,null,null,null,null,null,null,null,null,null,null,null,null,null,null,null,null,null,null,null,null,null,null,null,null,null,null,null,null,null,null,null,null,null,null,null,null,null,null,"N/A","N/A","N/A","N/A","N/A","N/A","N/A","N/A","N/A","N/A",1,1,1,1,1,1,1,1,1,1]
[null,null,null,null,null,null,null,null,null,null,null,null,null,null,null,null,null,null,null,null,null,null,null,null,null,null,null,null,null,null,null,null,null,null,null,null,null,null,null,null,null,null,null,null,null,null,null,null,null,null,"N/A","N/A","N/A","N/A","N/A","N/A","N/A","N/A","N/A","N/A",1,1,1,1,1,1,1,1,1,1]
[null,null,null,null,null,null,null,null,null,null,null,null,null,null,null,null,null,null,null,null,null,null,null,null,null,null,null,null,null,null,null,null,null,null,null,null,null,null,null,null,null,null,null,null,null,null,null,null,null,null,"N/A","N/A","N/A","N/A","N/A","N/A","N/A","N/A","N/A","N/A",1,1,1,1,1,1,1,1,1,1]
[null,null,null,null,null,null,null,null,null,null,null,null,null,null,null,null,null,null,null,null,null,null,null,null,null,null,null,null,null,null,null,null,null,null,null,null,null,null,null,null,null,null,null,null,null,null,null,null,null,null,"N/A","N/A","N/A","N/A","N/A","N/A","N/A","N/A","N/A","N/A",1,1,1,1,1,1,1,1,1,1]
[null,null,null,null,null,null,null,null,null,null,null,null,null,null,null,null,null,null,null,null,null,null,null,null,null,null,null,null,null,null,null,null,null,null,null,null,null,null,null,null,null,null,null,null,null,null,null,null,null,null,"N/A","N/A","N/A","N/A","N/A","N/A","N/A","N/A","N/A","N/A",1,1,1,1,1,1,1,1,1,1]
[null,null,null,null,null,null,null,null,null,null,null,null,null,null,null,null,null,null,null,null,null,null,null,null,null,null,null,null,null,null,null,null,null,null,null,null,null,null,null,null,null,null,null,null,null,null,null,null,null,null,"N/A","N/A","N/A","N/A","N/A","N/A","N/A","N/A","N/A","N/A",1,1,1,1,1,1,1,1,1,1]
[null,null,null,null,null,null,null,null,null,null,null,null,null,null,null,null,null,null,null,null,null,null,null,null,null,null,null,null,null,null,null,null,null,null,null,null,null,null,null,null,null,null,null,null,null,null,null,null,null,null,"N/A","N/A","N/A","N/A","N/A","N/A","N/A","N/A","N/A","N/A",1,1,1,1,1,1,1,1,1,1]
[null,null,null,null,null,null,null,null,null,null,null,null,null,null,null,null,null,null,null,null,null,null,null,null,null,null,null,null,null,null,null,null,null,null,null,null,null,null,null,null,null,null,null,null,null,null,null,null,null,null,"N/A","N/A","N/A","N/A","N/A","N/A","N/A","N/A","N/A","N/A",1,1,1,1,1,1,1,1,1,1]
[null,null,null,null,null,null,null,null,null,null,null,null,null,null,null,null,null,null,null,null,null,null,null,null,null,null,null,null,null,null,null,null,null,null,null,null,null,null,null,null,null,null,null,null,null,null,null,null,null,null,"N/A","N/A","N/A","N/A","N/A","N/A","N/A","N/A","N/A","N/A",1,1,1,1,1,1,1,1,1,1]
[null,null,null,null,null,null,null,null,null,null,null,null,null,null,null,null,null,null,null,null,null,null,null,null,null,null,null,null,null,null,null,null,null,null,null,null,null,null,null,null,null,null,null,null,null,null,null,null,null,null,"N/A","N/A","N/A","N/A","N/A","N/A","N/A","N/A","N/A","N/A",1,1,1,1,1,1,1,1,1,1]
[null,null,null,null,null,null,null,null,null,null,null,null,null,null,null,null,null,null,null,null,null,null,null,null,null,null,null,null,null,null,null,null,null,null,null,null,null,null,null,null,null,null,null,null,null,null,null,null,null,null,"N/A","N/A","N/A","N/A","N/A","N/A","N/A","N/A","N/A","N/A",1,1,1,1,1,1,1,1,1,1]
[null,null,null,null,null,null,null,null,null,null,null,null,null,null,null,null,null,null,null,null,null,null,null,null,null,null,null,null,null,null,null,null,null,null,null,null,null,null,null,null,null,null,null,null,null,null,null,null,null,null,"N/A","N/A","N/A","N/A","N/A","N/A","N/A","N/A","N/A","N/A",1,1,1,1,1,1,1,1,1,1]
[null,null,null,null,null,null,null,null,null,null,null,null,null,null,null,null,null,null,null,null,null,null,null,null,null,null,null,null,null,null,null,null,null,null,null,null,null,null,null,null,null,null,null,null,null,null,null,null,null,null,"N/A","N/A","N/A","N/A","N/A","N/A","N/A","N/A","N/A","N/A",1,1,1,1,1,1,1,1,1,1]
[null,null,null,null,null,null,null,null,null,null,null,null,null,null,null,null,null,null,null,null,null,null,null,null,null,null,null,null,null,null,null,null,null,null,null,null,null,null,null,null,null,null,null,null,null,null,null,null,null,null,"N/A","N/A","N/A","N/A","N/A","N/A","N/A","N/A","N/A","N/A",1,1,1,1,1,1,1,1,1,1]
[null,null,null,null,null,null,null,null,null,null,null,null,null,null,null,null,null,null,null,null,null,null,null,null,null,null,null,null,null,null,null,null,null,null,null,null,null,null,null,null,null,null,null,null,null,null,null,null,null,null,"N/A","N/A","N/A","N/A","N/A","N/A","N/A","N/A","N/A","N/A",1,1,1,1,1,1,1,1,1,1]
[null,null,null,null,null,null,null,null,null,null,null,null,null,null,null,null,null,null,null,null,null,null,null,null,null,null,null,null,null,null,null,null,null,null,null,null,null,null,null,null,null,null,null,null,null,null,null,null,null,null,"N/A","N/A","N/A","N/A","N/A","N/A","N/A","N/A","N/A","N/A",1,1,1,1,1,1,1,1,1,1]
[null,null,null,null,null,null,null,null,null,null,null,null,null,null,null,null,null,null,null,null,null,null,null,null,null,null,null,null,null,null,null,null,null,null,null,null,null,null,null,null,null,null,null,null,null,null,null,null,null,null,"N/A","N/A","N/A","N/A","N/A","N/A","N/A","N/A","N/A","N/A",1,1,1,1,1,1,1,1,1,1]
[null,null,null,null,null,null,null,null,null,null,null,null,null,null,null,null,null,null,null,null,null,null,null,null,null,null,null,null,null,null,null,null,null,null,null,null,null,null,null,null,null,null,null,null,null,null,null,null,null,null,"N/A","N/A","N/A","N/A","N/A","N/A","N/A","N/A","N/A","N/A",1,1,1,1,1,1,1,1,1,1]
[null,null,null,null,null,null,null,null,null,null,null,null,null,null,null,null,null,null,null,null,null,null,null,null,null,null,null,null,null,null,null,null,null,null,null,null,null,null,null,null,null,null,null,null,null,null,null,null,null,null,"N/A","N/A","N/A","N/A","N/A","N/A","N/A","N/A","N/A","N/A",1,1,1,1,1,1,1,1,1,1]
[null,null,null,null,null,null,null,null,null,null,null,null,null,null,null,null,null,null,null,null,null,null,null,null,null,null,null,null,null,null,null,null,null,null,null,null,null,null,null,null,null,null,null,null,null,null,null,null,null,null,"N/A","N/A","N/A","N/A","N/A","N/A","N/A","N/A","N/A","N/A",1,1,1,1,1,1,1,1,1,1]
[null,null,null,null,null,null,null,null,null,null,null,null,null,null,null,null,null,null,null,null,null,null,null,null,null,null,null,null,null,null,null,null,null,null,null,null,null,null,null,null,null,null,null,null,null,null,null,null,null,null,"N/A","N/A","N/A","N/A","N/A","N/A","N/A","N/A","N/A","N/A",1,1,1,1,1,1,1,1,1,1]
[null,null,null,null,null,null,null,null,null,null,null,null,null,null,null,null,null,null,null,null,null,null,null,null,null,null,null,null,null,null,null,null,null,null,null,null,null,null,null,null,null,null,null,null,null,null,null,null,null,null,"N/A","N/A","N/A","N/A","N/A","N/A","N/A","N/A","N/A","N/A",1,1,1,1,1,1,1,1,1,1]
[null,null,null,null,null,null,null,null,null,null,null,null,null,null,null,null,null,null,null,null,null,null,null,null,null,null,null,null,null,null,null,null,null,null,null,null,null,null,null,null,null,null,null,null,null,null,null,null,null,null,"N/A","N/A","N/A","N/A","N/A","N/A","N/A","N/A","N/A","N/A",1,1,1,1,1,1,1,1,1,1]
[null,null,null,null,null,null,null,null,null,null,null,null,null,null,null,null,null,null,null,null,null,null,null,null,null,null,null,null,null,null,null,null,null,null,null,null,null,null,null,null,null,null,null,null,null,null,null,null,null,null,"N/A","N/A","N/A","N/A","N/A","N/A","N/A","N/A","N/A","N/A",1,1,1,1,1,1,1,1,1,1]
[null,null,null,null,null,null,null,null,null,null,null,null,null,null,null,null,null,null,null,null,null,null,null,null,null,null,null,null,null,null,null,null,null,null,null,null,null,null,null,null,null,null,null,null,null,null,null,null,null,null,"N/A","N/A","N/A","N/A","N/A","N/A","N/A","N/A","N/A","N/A",1,1,1,1,1,1,1,1,1,1]
[null,null,null,null,null,null,null,null,null,null,null,null,null,null,null,null,null,null,null,null,null,null,null,null,null,null,null,null,null,null,null,null,null,null,null,null,null,null,null,null,null,null,null,null,null,null,null,null,null,null,"N/A","N/A","N/A","N/A","N/A","N/A","N/A","N/A","N/A","N/A",1,1,1,1,1,1,1,1,1,1]
[null,null,null,null,null,null,null,null,null,null,null,null,null,null,null,null,null,null,null,null,null,null,null,null,null,null,null,null,null,null,null,null,null,null,null,null,null,null,null,null,null,null,null,null,null,null,null,null,null,null,"N/A","N/A","N/A","N/A","N/A","N/A","N/A","N/A","N/A","N/A",1,1,1,1,1,1,1,1,1,1]
[null,null,null,null,null,null,null,null,null,null,null,null,null,null,null,null,null,null,null,null,null,null,null,null,null,null,null,null,null,null,null,null,null,null,null,null,null,null,null,null,null,null,null,null,null,null,null,null,null,null,"N/A","N/A","N/A","N/A","N/A","N/A","N/A","N/A","N/A","N/A",1,1,1,1,1,1,1,1,1,1]
[null,null,null,null,null,null,null,null,null,null,null,null,null,null,null,null,null,null,null,null,null,null,null,null,null,null,null,null,null,null,null,null,null,null,null,null,null,null,null,null,null,null,null,null,null,null,null,null,null,null,"N/A","N/A","N/A","N/A","N/A","N/A","N/A","N/A","N/A","N/A",{"$f":"IF(AY249=\"N/A\",1,\"\")","v":1},{"$f":"IF(AZ249=\"N/A\",1,\"\")","v":1},{"$f":"IF(BA249=\"N/A\",1,\"\")","v":1},{"$f":"IF(BB249=\"N/A\",1,\"\")","v":1},{"$f":"IF(BC249=\"N/A\",1,\"\")","v":1},{"$f":"IF(BD249=\"N/A\",1,\"\")","v":1},{"$f":"IF(BE249=\"N/A\",1,\"\")","v":1},1,1,{"$f":"IF(BH249=\"N/A\",1,\"\")","v":1}]
[null,null,null,null,null,null,null,null,null,null,null,null,null,null,null,null,null,null,null,null,null,null,null,null,null,null,null,null,null,null,null,null,null,null,null,null,null,null,null,null,null,null,null,null,null,null,null,null,null,null,"N/A","N/A","N/A","N/A","N/A","N/A","N/A","N/A","N/A","N/A",1,1,1,1,1,1,1,1,1,1]
[null,null,null,null,null,null,null,null,null,null,null,null,null,null,null,null,null,null,null,null,null,null,null,null,null,null,null,null,null,null,null,null,null,null,null,null,null,null,null,null,null,null,null,null,null,null,null,null,null,null,"N/A","N/A","N/A","N/A","N/A","N/A","N/A","N/A","N/A","N/A",1,1,1,1,1,1,1,1,1,1]
[null,null,null,null,null,null,null,null,null,null,null,null,null,null,null,null,null,null,null,null,null,null,null,null,null,null,null,null,null,null,null,null,null,null,null,null,null,null,null,null,null,null,null,null,null,null,null,null,null,null,"N/A","N/A","N/A","N/A","N/A","N/A","N/A","N/A","N/A","N/A",1,1,1,1,1,1,1,1,1,1]
[null,null,null,null,null,null,null,null,null,null,null,null,null,null,null,null,null,null,null,null,null,null,null,null,null,null,null,null,null,null,null,null,null,null,null,null,null,null,null,null,null,null,null,null,null,null,null,null,null,null,"N/A","N/A","N/A","N/A","N/A","N/A","N/A","N/A","N/A","N/A",1,1,1,1,1,1,1,1,1,1]
[null,null,null,null,null,null,null,null,null,null,null,null,null,null,null,null,null,null,null,null,null,null,null,null,null,null,null,null,null,null,null,null,null,null,null,null,null,null,null,null,null,null,null,null,null,null,null,null,null,null,"N/A","N/A","N/A","N/A","N/A","N/A","N/A","N/A","N/A","N/A",1,1,1,1,1,1,1,1,1,1]
[null,null,null,null,null,null,null,null,null,null,null,null,null,null,null,null,null,null,null,null,null,null,null,null,null,null,null,null,null,null,null,null,null,null,null,null,null,null,null,null,null,null,null,null,null,null,null,null,null,null,"N/A","N/A","N/A","N/A","N/A","N/A","N/A","N/A","N/A","N/A",1,1,1,1,1,1,1,1,1,1]
[null,null,null,null,null,null,null,null,null,null,null,null,null,null,null,null,null,null,null,null,null,null,null,null,null,null,null,null,null,null,null,null,null,null,null,null,null,null,null,null,null,null,null,null,null,null,null,null,null,null,"N/A","N/A","N/A","N/A","N/A","N/A","N/A","N/A","N/A","N/A",1,1,1,1,1,1,1,1,1,1]
[null,null,null,null,null,null,null,null,null,null,null,null,null,null,null,null,null,null,null,null,null,null,null,null,null,null,null,null,null,null,null,null,null,null,null,null,null,null,null,null,null,null,null,null,null,null,null,null,null,null,"N/A","N/A","N/A","N/A","N/A","N/A","N/A","N/A","N/A","N/A",1,1,1,1,1,1,1,1,1,1]
[null,null,null,null,null,null,null,null,null,null,null,null,null,null,null,null,null,null,null,null,null,null,null,null,null,null,null,null,null,null,null,null,null,null,null,null,null,null,null,null,null,null,null,null,null,null,null,null,null,null,"N/A","N/A","N/A","N/A","N/A","N/A","N/A","N/A","N/A","N/A",1,1,1,1,1,1,1,1,1,1]
[null,null,null,null,null,null,null,null,null,null,null,null,null,null,null,null,null,null,null,null,null,null,null,null,null,null,null,null,null,null,null,null,null,null,null,null,null,null,null,null,null,null,null,null,null,null,null,null,null,null,"N/A","N/A","N/A","N/A","N/A","N/A","N/A","N/A","N/A","N/A",1,1,1,1,1,1,1,1,1,1]
[null,null,null,null,null,null,null,null,null,null,null,null,null,null,null,null,null,null,null,null,null,null,null,null,null,null,null,null,null,null,null,null,null,null,null,null,null,null,null,null,null,null,null,null,null,null,null,null,null,null,"N/A","N/A","N/A","N/A","N/A","N/A","N/A","N/A","N/A","N/A",1,1,1,1,1,1,1,1,1,1]
[null,null,null,null,null,null,null,null,null,null,null,null,null,null,null,null,null,null,null,null,null,null,null,null,null,null,null,null,null,null,null,null,null,null,null,null,null,null,null,null,null,null,null,null,null,null,null,null,null,null,"N/A","N/A","N/A","N/A","N/A","N/A","N/A","N/A","N/A","N/A",1,1,1,1,1,1,1,1,1,1]
[null,null,null,null,null,null,null,null,null,null,null,null,null,null,null,null,null,null,null,null,null,null,null,null,null,null,null,null,null,null,null,null,null,null,null,null,null,null,null,null,null,null,null,null,null,null,null,null,null,null,"N/A","N/A","N/A","N/A","N/A","N/A","N/A","N/A","N/A","N/A",1,1,1,1,1,1,1,1,1,1]
[null,null,null,null,null,null,null,null,null,null,null,null,null,null,null,null,null,null,null,null,null,null,null,null,null,null,null,null,null,null,null,null,null,null,null,null,null,null,null,null,null,null,null,null,null,null,null,null,null,null,"N/A","N/A","N/A","N/A","N/A","N/A","N/A","N/A","N/A","N/A",1,1,1,1,1,1,1,1,1,1]
[null,null,null,null,null,null,null,null,null,null,null,null,null,null,null,null,null,null,null,null,null,null,null,null,null,null,null,null,null,null,null,null,null,null,null,null,null,null,null,null,null,null,null,null,null,null,null,null,null,null,"N/A","N/A","N/A","N/A","N/A","N/A","N/A","N/A","N/A","N/A",1,1,1,1,1,1,1,1,1,1]
[null,null,null,null,null,null,null,null,null,null,null,null,null,null,null,null,null,null,null,null,null,null,null,null,null,null,null,null,null,null,null,null,null,null,null,null,null,null,null,null,null,null,null,null,null,null,null,null,null,null,"N/A","N/A","N/A","N/A","N/A","N/A","N/A","N/A","N/A","N/A",1,1,1,1,1,1,1,1,1,1]
[null,null,null,null,null,null,null,null,null,null,null,null,null,null,null,null,null,null,null,null,null,null,null,null,null,null,null,null,null,null,null,null,null,null,null,null,null,null,null,null,null,null,null,null,null,null,null,null,null,null,"N/A","N/A","N/A","N/A","N/A","N/A","N/A","N/A","N/A","N/A",1,1,1,1,1,1,1,1,1,1]
[null,null,null,null,null,null,null,null,null,null,null,null,null,null,null,null,null,null,null,null,null,null,null,null,null,null,null,null,null,null,null,null,null,null,null,null,null,null,null,null,null,null,null,null,null,null,null,null,null,null,"N/A","N/A","N/A","N/A","N/A","N/A","N/A","N/A","N/A","N/A",1,1,1,1,1,1,1,1,1,1]
[null,null,null,null,null,null,null,null,null,null,null,null,null,null,null,null,null,null,null,null,null,null,null,null,null,null,null,null,null,null,null,null,null,null,null,null,null,null,null,null,null,null,null,null,null,null,null,null,null,null,"N/A","N/A","N/A","N/A","N/A","N/A","N/A","N/A","N/A","N/A",1,1,1,1,1,1,1,1,1,1]
[null,null,null,null,null,null,null,null,null,null,null,null,null,null,null,null,null,null,null,null,null,null,null,null,null,null,null,null,null,null,null,null,null,null,null,null,null,null,null,null,null,null,null,null,null,null,null,null,null,null,"N/A","N/A","N/A","N/A","N/A","N/A","N/A","N/A","N/A","N/A",1,1,1,1,1,1,1,1,1,1]
[null,null,null,null,null,null,null,null,null,null,null,null,null,null,null,null,null,null,null,null,null,null,null,null,null,null,null,null,null,null,null,null,null,null,null,null,null,null,null,null,null,null,null,null,null,null,null,null,null,null,"N/A","N/A","N/A","N/A","N/A","N/A","N/A","N/A","N/A","N/A",1,1,1,1,1,1,1,1,1,1]
[null,null,null,null,null,null,null,null,null,null,null,null,null,null,null,null,null,null,null,null,null,null,null,null,null,null,null,null,null,null,null,null,null,null,null,null,null,null,null,null,null,null,null,null,null,null,null,null,null,null,"N/A","N/A","N/A","N/A","N/A","N/A","N/A","N/A","N/A","N/A",1,1,1,1,1,1,1,1,1,1]
[null,null,null,null,null,null,null,null,null,null,null,null,null,null,null,null,null,null,null,null,null,null,null,null,null,null,null,null,null,null,null,null,null,null,null,null,null,null,null,null,null,null,null,null,null,null,null,null,null,null,{"$f":"IF(COUNTA(E272:J272)>0,(COUNTIF(E272:J272,\"=0\")*0+COUNTIF(E272:J272,\"=1\")*100+COUNTIF(E272:J272,\"=2\")*80+COUNTIF(E272:J272,\"=3\")*50+COUNTIF(E272:J272,\"=8\")*20+COUNTIF(E272:J272,\"=9\")*0)/COUNTA(E272:J272)/100,\"N/A\")","v":"N/A"},{"$f":"IF(COUNTA(K272:O272)>0,(COUNTIF(K272:O272,\"=0\")*0+COUNTIF(K272:O272,\"=1\")*100+COUNTIF(K272:O272,\"=2\")*80+COUNTIF(K272:O272,\"=3\")*50+COUNTIF(K272:O272,\"=8\")*20+COUNTIF(K272:O272,\"=9\")*0)/COUNTA(K272:O272)/100,\"N/A\")","v":"N/A"},{"$f":"IF(COUNTA(P272:U272)>0,(COUNTIF(P272:U272,\"=0\")*0+COUNTIF(P272:U272,\"=1\")*100+COUNTIF(P272:U272,\"=2\")*80+COUNTIF(P272:U272,\"=3\")*50+COUNTIF(P272:U272,\"=8\")*20+COUNTIF(P272:U272,\"=9\")*0)/COUNTA(P272:U272)/100,\"N/A\")","v":"N/A"},{"$f":"IF(COUNTA(V272)<>0,(COUNTIF(V272,\"=0\")*0+COUNTIF(V272,\"=1\")*100+COUNTIF(V272,\"=2\")*80+COUNTIF(V272,\"=3\")*50+COUNTIF(V272,\"=8\")*20+COUNTIF(V272,\"=9\")*0)/COUNTA(V272)/100,\"N/A\")","v":"N/A"},{"$f":"IF(COUNTA(W272:X272)>0,(COUNTIF(W272:X272,\"=0\")*0+COUNTIF(W272:X272,\"=1\")*100+COUNTIF(W272:X272,\"=2\")*80+COUNTIF(W272:X272,\"=3\")*50+COUNTIF(W272:X272,\"=8\")*20+COUNTIF(W272:X272,\"=9\")*0)/COUNTA(W272:X272)/100,\"N/A\")","v":"N/A"},{"$f":"IF(COUNTA(Y272:AJ272)>0,(COUNTIF(Y272:AJ272,\"=0\")*0+COUNTIF(Y272:AJ272,\"=1\")*100+COUNTIF(Y272:AJ272,\"=2\")*80+COUNTIF(Y272:AJ272,\"=3\")*50+COUNTIF(Y272:AJ272,\"=8\")*20+COUNTIF(Y272:AJ272,\"=9\")*0)/COUNTA(Y272:AJ272)/100,\"N/A\")","v":"N/A"},{"$f":"IF(COUNTA(AK272:AP272)>0,(COUNTIF(AK272:AP272,\"=0\")*0+COUNTIF(AK272:AP272,\"=1\")*100+COUNTIF(AK272:AP272,\"=2\")*80+COUNTIF(AK272:AP272,\"=3\")*50+COUNTIF(AK272:AP272,\"=8\")*20+COUNTIF(AK272:AP272,\"=9\")*0)/COUNTA(AK272:AP272)/100,\"N/A\")","v":"N/A"},{"$f":"IF(COUNTA(AQ272:AU272)>0,(COUNTIF(AQ272:AU272,\"=0\")*0+COUNTIF(AQ272:AU272,\"=1\")*100+COUNTIF(AQ272:AU272,\"=2\")*80+COUNTIF(AQ272:AU272,\"=3\")*50+COUNTIF(AQ272:AU272,\"=8\")*20+COUNTIF(AQ272:AU272,\"=9\")*0)/COUNTA(AQ272:AU272)/100,\"N/A\")","v":"N/A"},{"$f":"IF(COUNTA(AV272:AX272)>0,(COUNTIF(AV272:AX272,\"=0\")*0+COUNTIF(AV272:AX272,\"=1\")*100+COUNTIF(AV272:AX272,\"=2\")*80+COUNTIF(AV272:AX272,\"=3\")*50+COUNTIF(AV272:AX272,\"=8\")*20+COUNTIF(AV272:AX272,\"=9\")*0)/COUNTA(AV272:AX272)/100,\"N/A\")","v":"N/A"},{"$f":"IF(AND(COUNTA(E272:AX272)<>0,B272<>\"\"),AVERAGE(BA272:BG272),\"N/A\")","v":"N/A"},1,1,1,1,1,1,1,{"$f":"IF(BF272=\"N/A\",1,\"\")","v":1},{"$f":"IF(BG272=\"N/A\",1,\"\")","v":1},1]
[null,null,null,null,null,null,null,null,null,null,null,null,null,null,null,null,null,null,null,null,null,null,null,null,null,null,null,null,null,null,null,null,null,null,null,null,null,null,null,null,null,null,null,null,null,null,null,null,null,null,"N/A","N/A","N/A","N/A","N/A","N/A","N/A","N/A","N/A","N/A",1,1,1,1,1,1,1,1,1,1]
[null,null,null,null,null,null,null,null,null,null,null,null,null,null,null,null,null,null,null,null,null,null,null,null,null,null,null,null,null,null,null,null,null,null,null,null,null,null,null,null,null,null,null,null,null,null,null,null,null,null,"N/A","N/A","N/A","N/A","N/A","N/A","N/A","N/A","N/A","N/A",1,1,1,1,1,1,1,1,1,1]
[null,null,null,null,null,null,null,null,null,null,null,null,null,null,null,null,null,null,null,null,null,null,null,null,null,null,null,null,null,null,null,null,null,null,null,null,null,null,null,null,null,null,null,null,null,null,null,null,null,null,"N/A","N/A","N/A","N/A","N/A","N/A","N/A","N/A","N/A","N/A",1,1,1,1,1,1,1,1,1,1]
[null,null,null,null,null,null,null,null,null,null,null,null,null,null,null,null,null,null,null,null,null,null,null,null,null,null,null,null,null,null,null,null,null,null,null,null,null,null,null,null,null,null,null,null,null,null,null,null,null,null,"N/A","N/A","N/A","N/A","N/A","N/A","N/A","N/A","N/A","N/A",1,1,1,1,1,1,1,1,1,1]
[null,null,null,null,null,null,null,null,null,null,null,null,null,null,null,null,null,null,null,null,null,null,null,null,null,null,null,null,null,null,null,null,null,null,null,null,null,null,null,null,null,null,null,null,null,null,null,null,null,null,"N/A","N/A","N/A","N/A","N/A","N/A","N/A","N/A","N/A","N/A",1,1,1,1,1,1,1,1,1,1]
[null,null,null,null,null,null,null,null,null,null,null,null,null,null,null,null,null,null,null,null,null,null,null,null,null,null,null,null,null,null,null,null,null,null,null,null,null,null,null,null,null,null,null,null,null,null,null,null,null,null,"N/A","N/A","N/A","N/A","N/A","N/A","N/A","N/A","N/A","N/A",1,1,1,1,1,1,1,1,1,1]
[null,null,null,null,null,null,null,null,null,null,null,null,null,null,null,null,null,null,null,null,null,null,null,null,null,null,null,null,null,null,null,null,null,null,null,null,null,null,null,null,null,null,null,null,null,null,null,null,null,null,"N/A","N/A","N/A","N/A","N/A","N/A","N/A","N/A","N/A","N/A",1,1,1,1,1,1,1,1,1,1]
[null,null,null,null,null,null,null,null,null,null,null,null,null,null,null,null,null,null,null,null,null,null,null,null,null,null,null,null,null,null,null,null,null,null,null,null,null,null,null,null,null,null,null,null,null,null,null,null,null,null,"N/A","N/A","N/A","N/A","N/A","N/A","N/A","N/A","N/A","N/A",1,1,1,1,1,1,1,1,1,1]
[null,null,null,null,null,null,null,null,null,null,null,null,null,null,null,null,null,null,null,null,null,null,null,null,null,null,null,null,null,null,null,null,null,null,null,null,null,null,null,null,null,null,null,null,null,null,null,null,null,null,"N/A","N/A","N/A","N/A","N/A","N/A","N/A","N/A","N/A","N/A",{"$f":"IF(AY281=\"N/A\",1,\"\")","v":1},{"$f":"IF(AZ281=\"N/A\",1,\"\")","v":1},{"$f":"IF(BA281=\"N/A\",1,\"\")","v":1},{"$f":"IF(BB281=\"N/A\",1,\"\")","v":1},{"$f":"IF(BC281=\"N/A\",1,\"\")","v":1},{"$f":"IF(BD281=\"N/A\",1,\"\")","v":1},{"$f":"IF(BE281=\"N/A\",1,\"\")","v":1},1,1,1]
[null,null,null,null,null,null,null,null,null,null,null,null,null,null,null,null,null,null,null,null,null,null,null,null,null,null,null,null,null,null,null,null,null,null,null,null,null,null,null,null,null,null,null,null,null,null,null,null,null,null,"N/A","N/A","N/A","N/A","N/A","N/A","N/A","N/A","N/A","N/A",1,1,1,1,1,1,1,1,1,1]
[null,null,null,null,null,null,null,null,null,null,null,null,null,null,null,null,null,null,null,null,null,null,null,null,null,null,null,null,null,null,null,null,null,null,null,null,null,null,null,null,null,null,null,null,null,null,null,null,null,null,"N/A","N/A","N/A","N/A","N/A","N/A","N/A","N/A","N/A","N/A",1,1,1,1,1,1,1,1,1,1]
[null,null,null,null,null,null,null,null,null,null,null,null,null,null,null,null,null,null,null,null,null,null,null,null,null,null,null,null,null,null,null,null,null,null,null,null,null,null,null,null,null,null,null,null,null,null,null,null,null,null,"N/A","N/A","N/A","N/A","N/A","N/A","N/A","N/A","N/A","N/A",1,1,1,1,1,1,1,1,1,1]
[null,null,null,null,null,null,null,null,null,null,null,null,null,null,null,null,null,null,null,null,null,null,null,null,null,null,null,null,null,null,null,null,null,null,null,null,null,null,null,null,null,null,null,null,null,null,null,null,null,null,"N/A","N/A","N/A","N/A","N/A","N/A","N/A","N/A","N/A","N/A",1,1,1,1,1,1,1,1,1,1]
[null,null,null,null,null,null,null,null,null,null,null,null,null,null,null,null,null,null,null,null,null,null,null,null,null,null,null,null,null,null,null,null,null,null,null,null,null,null,null,null,null,null,null,null,null,null,null,null,null,null,"N/A","N/A","N/A","N/A","N/A","N/A","N/A","N/A","N/A","N/A",1,1,1,1,1,1,1,1,1,1]
[null,null,null,null,null,null,null,null,null,null,null,null,null,null,null,null,null,null,null,null,null,null,null,null,null,null,null,null,null,null,null,null,null,null,null,null,null,null,null,null,null,null,null,null,null,null,null,null,null,null,"N/A","N/A","N/A","N/A","N/A","N/A","N/A","N/A","N/A","N/A",1,1,1,1,1,1,1,1,1,1]
[null,null,null,null,null,null,null,null,null,null,null,null,null,null,null,null,null,null,null,null,null,null,null,null,null,null,null,null,null,null,null,null,null,null,null,null,null,null,null,null,null,null,null,null,null,null,null,null,null,null,"N/A","N/A","N/A","N/A","N/A","N/A","N/A","N/A","N/A","N/A",1,1,1,1,1,1,1,1,1,1]
[null,null,null,null,null,null,null,null,null,null,null,null,null,null,null,null,null,null,null,null,null,null,null,null,null,null,null,null,null,null,null,null,null,null,null,null,null,null,null,null,null,null,null,null,null,null,null,null,null,null,"N/A","N/A","N/A","N/A","N/A","N/A","N/A","N/A","N/A","N/A",1,1,1,1,1,1,1,1,1,1]
[null,null,null,null,null,null,null,null,null,null,null,null,null,null,null,null,null,null,null,null,null,null,null,null,null,null,null,null,null,null,null,null,null,null,null,null,null,null,null,null,null,null,null,null,null,null,null,null,null,null,"N/A","N/A","N/A","N/A","N/A","N/A","N/A","N/A","N/A","N/A",1,1,1,1,1,1,1,1,1,1]
[null,null,null,null,null,null,null,null,null,null,null,null,null,null,null,null,null,null,null,null,null,null,null,null,null,null,null,null,null,null,null,null,null,null,null,null,null,null,null,null,null,null,null,null,null,null,null,null,null,null,"N/A","N/A","N/A","N/A","N/A","N/A","N/A","N/A","N/A","N/A",1,1,1,1,1,1,1,1,1,1]
[null,null,null,null,null,null,null,null,null,null,null,null,null,null,null,null,null,null,null,null,null,null,null,null,null,null,null,null,null,null,null,null,null,null,null,null,null,null,null,null,null,null,null,null,null,null,null,null,null,null,"N/A","N/A","N/A","N/A","N/A","N/A","N/A","N/A","N/A","N/A",1,1,1,1,1,1,1,1,1,1]
[null,null,null,null,null,null,null,null,null,null,null,null,null,null,null,null,null,null,null,null,null,null,null,null,null,null,null,null,null,null,null,null,null,null,null,null,null,null,null,null,null,null,null,null,null,null,null,null,null,null,"N/A","N/A","N/A","N/A","N/A","N/A","N/A","N/A","N/A","N/A",1,1,1,1,1,1,1,1,1,1]
[null,null,null,null,null,null,null,null,null,null,null,null,null,null,null,null,null,null,null,null,null,null,null,null,null,null,null,null,null,null,null,null,null,null,null,null,null,null,null,null,null,null,null,null,null,null,null,null,null,null,"N/A","N/A","N/A","N/A","N/A","N/A","N/A","N/A","N/A","N/A",1,1,1,1,1,1,1,1,1,1]
[null,null,null,null,null,null,null,null,null,null,null,null,null,null,null,null,null,null,null,null,null,null,null,null,null,null,null,null,null,null,null,null,null,null,null,null,null,null,null,null,null,null,null,null,null,null,null,null,null,null,"N/A","N/A","N/A","N/A","N/A","N/A","N/A","N/A","N/A","N/A",1,1,1,1,1,1,1,1,1,1]
[null,null,null,null,null,null,null,null,null,null,null,null,null,null,null,null,null,null,null,null,null,null,null,null,null,null,null,null,null,null,null,null,null,null,null,null,null,null,null,null,null,null,null,null,null,null,null,null,null,null,"N/A","N/A","N/A","N/A","N/A","N/A","N/A","N/A","N/A","N/A",1,1,1,1,1,1,1,1,1,1]
[null,null,null,null,null,null,null,null,null,null,null,null,null,null,null,null,null,null,null,null,null,null,null,null,null,null,null,null,null,null,null,null,null,null,null,null,null,null,null,null,null,null,null,null,null,null,null,null,null,null,"N/A","N/A","N/A","N/A","N/A","N/A","N/A","N/A","N/A","N/A",1,1,1,1,1,1,1,1,1,1]
[null,null,null,null,null,null,null,null,null,null,null,null,null,null,null,null,null,null,null,null,null,null,null,null,null,null,null,null,null,null,null,null,null,null,null,null,null,null,null,null,null,null,null,null,null,null,null,null,null,null,"N/A","N/A","N/A","N/A","N/A","N/A","N/A","N/A","N/A","N/A",1,1,1,1,1,1,1,1,1,1]
[null,null,null,null,null,null,null,null,null,null,null,null,null,null,null,null,null,null,null,null,null,null,null,null,null,null,null,null,null,null,null,null,null,null,null,null,null,null,null,null,null,null,null,null,null,null,null,null,null,null,"N/A","N/A","N/A","N/A","N/A","N/A","N/A","N/A","N/A","N/A",1,1,1,1,1,1,1,1,1,1]
[null,null,null,null,null,null,null,null,null,null,null,null,null,null,null,null,null,null,null,null,null,null,null,null,null,null,null,null,null,null,null,null,null,null,null,null,null,null,null,null,null,null,null,null,null,null,null,null,null,null,"N/A","N/A","N/A","N/A","N/A","N/A","N/A","N/A","N/A","N/A",1,1,1,{"$f":"IF(BB300=\"N/A\",1,\"\")","v":1},{"$f":"IF(BC300=\"N/A\",1,\"\")","v":1},{"$f":"IF(BD300=\"N/A\",1,\"\")","v":1},{"$f":"IF(BE300=\"N/A\",1,\"\")","v":1},1,1,{"$f":"IF(BH300=\"N/A\",1,\"\")","v":1}]
[null,null,null,null,null,null,null,null,null,null,null,null,null,null,null,null,null,null,null,null,null,null,null,null,null,null,null,null,null,null,null,null,null,null,null,null,null,null,null,null,null,null,null,null,null,null,null,null,null,null,"N/A","N/A","N/A","N/A","N/A","N/A","N/A","N/A","N/A","N/A",1,1,1,1,1,1,1,1,1,1]
[null,null,null,null,null,null,null,null,null,null,null,null,null,null,null,null,null,null,null,null,null,null,null,null,null,null,null,null,null,null,null,null,null,null,null,null,null,null,null,null,null,null,null,null,null,null,null,null,null,null,"N/A","N/A","N/A","N/A","N/A","N/A","N/A","N/A","N/A","N/A",1,1,1,1,1,1,1,1,1,1]
[null,null,null,null,null,null,null,null,null,null,null,null,null,null,null,null,null,null,null,null,null,null,null,null,null,null,null,null,null,null,null,null,null,null,null,null,null,null,null,null,null,null,null,null,null,null,null,null,null,null,"N/A","N/A","N/A","N/A","N/A","N/A","N/A","N/A","N/A","N/A",1,1,1,1,1,1,1,1,1,1]
[null,null,null,null,null,null,null,null,null,null,null,null,null,null,null,null,null,null,null,null,null,null,null,null,null,null,null,null,null,null,null,null,null,null,null,null,null,null,null,null,null,null,null,null,null,null,null,null,null,null,"N/A","N/A","N/A","N/A","N/A","N/A","N/A","N/A","N/A","N/A",1,1,1,1,1,1,1,1,1,1]
[null,null,null,null,null,null,null,null,null,null,null,null,null,null,null,null,null,null,null,null,null,null,null,null,null,null,null,null,null,null,null,null,null,null,null,null,null,null,null,null,null,null,null,null,null,null,null,null,null,null,"N/A","N/A","N/A","N/A","N/A","N/A","N/A","N/A","N/A","N/A",1,1,1,1,1,1,1,1,1,1]
[null,null,null,null,null,null,null,null,null,null,null,null,null,null,null,null,null,null,null,null,null,null,null,null,null,null,null,null,null,null,null,null,null,null,null,null,null,null,null,null,null,null,null,null,null,null,null,null,null,null,"N/A","N/A","N/A","N/A","N/A","N/A","N/A","N/A","N/A","N/A",1,1,1,1,1,1,1,1,1,1]
[null,null,null,null,null,null,null,null,null,null,null,null,null,null,null,null,null,null,null,null,null,null,null,null,null,null,null,null,null,null,null,null,null,null,null,null,null,null,null,null,null,null,null,null,null,null,null,null,null,null,"N/A","N/A","N/A","N/A","N/A","N/A","N/A","N/A","N/A","N/A",1,1,1,1,1,1,1,1,1,1]
[null,null,null,null,null,null,null,null,null,null,null,null,null,null,null,null,null,null,null,null,null,null,null,null,null,null,null,null,null,null,null,null,null,null,null,null,null,null,null,null,null,null,null,null,null,null,null,null,null,null,"N/A","N/A","N/A","N/A","N/A","N/A","N/A","N/A","N/A","N/A",1,1,1,1,1,1,1,1,1,1]
[null,null,null,null,null,null,null,null,null,null,null,null,null,null,null,null,null,null,null,null,null,null,null,null,null,null,null,null,null,null,null,null,null,null,null,null,null,null,null,null,null,null,null,null,null,null,null,null,null,null,"N/A","N/A","N/A","N/A","N/A","N/A","N/A","N/A","N/A","N/A",1,1,1,1,1,1,1,1,1,1]
[null,null,null,null,null,null,null,null,null,null,null,null,null,null,null,null,null,null,null,null,null,null,null,null,null,null,null,null,null,null,null,null,null,null,null,null,null,null,null,null,null,null,null,null,null,null,null,null,null,null,"N/A","N/A","N/A","N/A","N/A","N/A","N/A","N/A","N/A","N/A",1,1,1,1,1,1,1,1,1,1]
[null,null,null,null,null,null,null,null,null,null,null,null,null,null,null,null,null,null,null,null,null,null,null,null,null,null,null,null,null,null,null,null,null,null,null,null,null,null,null,null,null,null,null,null,null,null,null,null,null,null,"N/A","N/A","N/A","N/A","N/A","N/A","N/A","N/A","N/A","N/A",1,1,1,1,1,1,1,1,1,1]
[null,null,null,null,null,null,null,null,null,null,null,null,null,null,null,null,null,null,null,null,null,null,null,null,null,null,null,null,null,null,null,null,null,null,null,null,null,null,null,null,null,null,null,null,null,null,null,null,null,null,"N/A","N/A","N/A","N/A","N/A","N/A","N/A","N/A","N/A","N/A",1,1,1,1,1,1,1,1,1,1]
[null,null,null,null,null,null,null,null,null,null,null,null,null,null,null,null,null,null,null,null,null,null,null,null,null,null,null,null,null,null,null,null,null,null,null,null,null,null,null,null,null,null,null,null,null,null,null,null,null,null,"N/A","N/A","N/A","N/A","N/A","N/A","N/A","N/A","N/A","N/A",{"$f":"IF(AY313=\"N/A\",1,\"\")","v":1},1,1,1,1,1,1,1,1,{"$f":"IF(BH313=\"N/A\",1,\"\")","v":1}]
[null,null,null,null,null,null,null,null,null,null,null,null,null,null,null,null,null,null,null,null,null,null,null,null,null,null,null,null,null,null,null,null,null,null,null,null,null,null,null,null,null,null,null,null,null,null,null,null,null,null,"N/A","N/A","N/A","N/A","N/A","N/A","N/A","N/A","N/A","N/A",{"$f":"IF(AY314=\"N/A\",1,\"\")","v":1},{"$f":"IF(AZ314=\"N/A\",1,\"\")","v":1},{"$f":"IF(BA314=\"N/A\",1,\"\")","v":1},{"$f":"IF(BB314=\"N/A\",1,\"\")","v":1},{"$f":"IF(BC314=\"N/A\",1,\"\")","v":1},{"$f":"IF(BD314=\"N/A\",1,\"\")","v":1},{"$f":"IF(BE314=\"N/A\",1,\"\")","v":1},1,1,1]
[null,null,null,null,null,null,null,null,null,null,null,null,null,null,null,null,null,null,null,null,null,null,null,null,null,null,null,null,null,null,null,null,null,null,null,null,null,null,null,null,null,null,null,null,null,null,null,null,null,null,"N/A","N/A","N/A","N/A","N/A","N/A","N/A","N/A","N/A","N/A",1,1,1,1,1,1,1,1,1,1]
[null,null,null,null,null,null,null,null,null,null,null,null,null,null,null,null,null,null,null,null,null,null,null,null,null,null,null,null,null,null,null,null,null,null,null,null,null,null,null,null,null,null,null,null,null,null,null,null,null,null,"N/A","N/A","N/A","N/A","N/A","N/A","N/A","N/A","N/A","N/A",1,1,1,1,1,1,1,1,1,1]
[null,null,null,null,null,null,null,null,null,null,null,null,null,null,null,null,null,null,null,null,null,null,null,null,null,null,null,null,null,null,null,null,null,null,null,null,null,null,null,null,null,null,null,null,null,null,null,null,null,null,"N/A","N/A","N/A","N/A","N/A","N/A","N/A","N/A","N/A","N/A",1,1,1,1,1,1,1,1,1,1]
[null,null,null,null,null,null,null,null,null,null,null,null,null,null,null,null,null,null,null,null,null,null,null,null,null,null,null,null,null,null,null,null,null,null,null,null,null,null,null,null,null,null,null,null,null,null,null,null,null,null,"N/A","N/A","N/A","N/A","N/A","N/A","N/A","N/A","N/A","N/A",1,1,1,1,1,1,1,1,1,1]
[null,null,null,null,null,null,null,null,null,null,null,null,null,null,null,null,null,null,null,null,null,null,null,null,null,null,null,null,null,null,null,null,null,null,null,null,null,null,null,null,null,null,null,null,null,null,null,null,null,null,"N/A","N/A","N/A","N/A","N/A","N/A","N/A","N/A","N/A","N/A",1,1,1,1,1,1,1,1,1,1]
[null,null,null,null,null,null,null,null,null,null,null,null,null,null,null,null,null,null,null,null,null,null,null,null,null,null,null,null,null,null,null,null,null,null,null,null,null,null,null,null,null,null,null,null,null,null,null,null,null,null,"N/A","N/A","N/A","N/A","N/A","N/A","N/A","N/A","N/A","N/A",1,1,1,1,1,1,1,1,1,1]
[null,null,null,null,null,null,null,null,null,null,null,null,null,null,null,null,null,null,null,null,null,null,null,null,null,null,null,null,null,null,null,null,null,null,null,null,null,null,null,null,null,null,null,null,null,null,null,null,null,null,"N/A","N/A","N/A","N/A","N/A","N/A","N/A","N/A","N/A","N/A",1,1,1,1,1,1,1,1,1,1]
[null,null,null,null,null,null,null,null,null,null,null,null,null,null,null,null,null,null,null,null,null,null,null,null,null,null,null,null,null,null,null,null,null,null,null,null,null,null,null,null,null,null,null,null,null,null,null,null,null,null,"N/A","N/A","N/A","N/A","N/A","N/A","N/A","N/A","N/A","N/A",1,1,1,1,1,1,1,1,1,1]
[null,null,null,null,null,null,null,null,null,null,null,null,null,null,null,null,null,null,null,null,null,null,null,null,null,null,null,null,null,null,null,null,null,null,null,null,null,null,null,null,null,null,null,null,null,null,null,null,null,null,"N/A","N/A","N/A","N/A","N/A","N/A","N/A","N/A","N/A","N/A",1,1,1,1,1,1,1,1,1,1]
[null,null,null,null,null,null,null,null,null,null,null,null,null,null,null,null,null,null,null,null,null,null,null,null,null,null,null,null,null,null,null,null,null,null,null,null,null,null,null,null,null,null,null,null,null,null,null,null,null,null,"N/A","N/A","N/A","N/A","N/A","N/A","N/A","N/A","N/A","N/A",1,1,1,1,1,1,1,1,1,1]
[null,null,null,null,null,null,null,null,null,null,null,null,null,null,null,null,null,null,null,null,null,null,null,null,null,null,null,null,null,null,null,null,null,null,null,null,null,null,null,null,null,null,null,null,null,null,null,null,null,null,"N/A","N/A","N/A","N/A","N/A","N/A","N/A","N/A","N/A","N/A",1,1,1,1,1,1,1,1,1,1]
[null,null,null,null,null,null,null,null,null,null,null,null,null,null,null,null,null,null,null,null,null,null,null,null,null,null,null,null,null,null,null,null,null,null,null,null,null,null,null,null,null,null,null,null,null,null,null,null,null,null,"N/A","N/A","N/A","N/A","N/A","N/A","N/A","N/A","N/A","N/A",1,1,1,1,1,1,1,1,1,1]
[null,null,null,null,null,null,null,null,null,null,null,null,null,null,null,null,null,null,null,null,null,null,null,null,null,null,null,null,null,null,null,null,null,null,null,null,null,null,null,null,null,null,null,null,null,null,null,null,null,null,"N/A","N/A","N/A","N/A","N/A","N/A","N/A","N/A","N/A","N/A",1,1,1,1,1,1,1,1,1,1]
[null,null,null,null,null,null,null,null,null,null,null,null,null,null,null,null,null,null,null,null,null,null,null,null,null,null,null,null,null,null,null,null,null,null,null,null,null,null,null,null,null,null,null,null,null,null,null,null,null,null,"N/A","N/A","N/A","N/A","N/A","N/A","N/A","N/A","N/A","N/A",1,1,1,1,1,1,1,1,1,1]
[null,null,null,null,null,null,null,null,null,null,null,null,null,null,null,null,null,null,null,null,null,null,null,null,null,null,null,null,null,null,null,null,null,null,null,null,null,null,null,null,null,null,null,null,null,null,null,null,null,null,"N/A","N/A","N/A","N/A","N/A","N/A","N/A","N/A","N/A","N/A",1,1,1,1,1,1,1,1,1,1]
[null,null,null,null,null,null,null,null,null,null,null,null,null,null,null,null,null,null,null,null,null,null,null,null,null,null,null,null,null,null,null,null,null,null,null,null,null,null,null,null,null,null,null,null,null,null,null,null,null,null,"N/A","N/A","N/A","N/A","N/A","N/A","N/A","N/A","N/A","N/A",1,1,1,1,1,1,1,1,1,1]
[null,null,null,null,null,null,null,null,null,null,null,null,null,null,null,null,null,null,null,null,null,null,null,null,null,null,null,null,null,null,null,null,null,null,null,null,null,null,null,null,null,null,null,null,null,null,null,null,null,null,"N/A","N/A","N/A","N/A","N/A","N/A","N/A","N/A","N/A","N/A",1,1,1,1,1,1,1,1,1,1]
[null,null,null,null,null,null,null,null,null,null,null,null,null,null,null,null,null,null,null,null,null,null,null,null,null,null,null,null,null,null,null,null,null,null,null,null,null,null,null,null,null,null,null,null,null,null,null,null,null,null,"N/A","N/A","N/A","N/A","N/A","N/A","N/A","N/A","N/A","N/A",1,1,1,1,1,1,1,1,1,1]
[null,null,null,null,null,null,null,null,null,null,null,null,null,null,null,null,null,null,null,null,null,null,null,null,null,null,null,null,null,null,null,null,null,null,null,null,null,null,null,null,null,null,null,null,null,null,null,null,null,null,"N/A","N/A","N/A","N/A","N/A","N/A","N/A","N/A","N/A","N/A",1,1,1,1,1,1,1,1,1,1]
[null,null,null,null,null,null,null,null,null,null,null,null,null,null,null,null,null,null,null,null,null,null,null,null,null,null,null,null,null,null,null,null,null,null,null,null,null,null,null,null,null,null,null,null,null,null,null,null,null,null,"N/A","N/A","N/A","N/A","N/A","N/A","N/A","N/A","N/A","N/A",1,1,1,1,1,1,1,1,1,1]
[null,null,null,null,null,null,null,null,null,null,null,null,null,null,null,null,null,null,null,null,null,null,null,null,null,null,null,null,null,null,null,null,null,null,null,null,null,null,null,null,null,null,null,null,null,null,null,null,null,null,"N/A","N/A","N/A","N/A","N/A","N/A","N/A","N/A","N/A","N/A",1,1,1,1,1,1,1,1,1,1]
[null,null,null,null,null,null,null,null,null,null,null,null,null,null,null,null,null,null,null,null,null,null,null,null,null,null,null,null,null,null,null,null,null,null,null,null,null,null,null,null,null,null,null,null,null,null,null,null,null,null,{"$f":"IF(COUNTA(E336:J336)>0,(COUNTIF(E336:J336,\"=0\")*0+COUNTIF(E336:J336,\"=1\")*100+COUNTIF(E336:J336,\"=2\")*80+COUNTIF(E336:J336,\"=3\")*50+COUNTIF(E336:J336,\"=8\")*20+COUNTIF(E336:J336,\"=9\")*0)/COUNTA(E336:J336)/100,\"N/A\")","v":"N/A"},{"$f":"IF(COUNTA(K336:O336)>0,(COUNTIF(K336:O336,\"=0\")*0+COUNTIF(K336:O336,\"=1\")*100+COUNTIF(K336:O336,\"=2\")*80+COUNTIF(K336:O336,\"=3\")*50+COUNTIF(K336:O336,\"=8\")*20+COUNTIF(K336:O336,\"=9\")*0)/COUNTA(K336:O336)/100,\"N/A\")","v":"N/A"},{"$f":"IF(COUNTA(P336:U336)>0,(COUNTIF(P336:U336,\"=0\")*0+COUNTIF(P336:U336,\"=1\")*100+COUNTIF(P336:U336,\"=2\")*80+COUNTIF(P336:U336,\"=3\")*50+COUNTIF(P336:U336,\"=8\")*20+COUNTIF(P336:U336,\"=9\")*0)/COUNTA(P336:U336)/100,\"N/A\")","v":"N/A"},{"$f":"IF(COUNTA(V336)<>0,(COUNTIF(V336,\"=0\")*0+COUNTIF(V336,\"=1\")*100+COUNTIF(V336,\"=2\")*80+COUNTIF(V336,\"=3\")*50+COUNTIF(V336,\"=8\")*20+COUNTIF(V336,\"=9\")*0)/COUNTA(V336)/100,\"N/A\")","v":"N/A"},{"$f":"IF(COUNTA(W336:X336)>0,(COUNTIF(W336:X336,\"=0\")*0+COUNTIF(W336:X336,\"=1\")*100+COUNTIF(W336:X336,\"=2\")*80+COUNTIF(W336:X336,\"=3\")*50+COUNTIF(W336:X336,\"=8\")*20+COUNTIF(W336:X336,\"=9\")*0)/COUNTA(W336:X336)/100,\"N/A\")","v":"N/A"},{"$f":"IF(COUNTA(Y336:AJ336)>0,(COUNTIF(Y336:AJ336,\"=0\")*0+COUNTIF(Y336:AJ336,\"=1\")*100+COUNTIF(Y336:AJ336,\"=2\")*80+COUNTIF(Y336:AJ336,\"=3\")*50+COUNTIF(Y336:AJ336,\"=8\")*20+COUNTIF(Y336:AJ336,\"=9\")*0)/COUNTA(Y336:AJ336)/100,\"N/A\")","v":"N/A"},{"$f":"IF(COUNTA(AK336:AP336)>0,(COUNTIF(AK336:AP336,\"=0\")*0+COUNTIF(AK336:AP336,\"=1\")*100+COUNTIF(AK336:AP336,\"=2\")*80+COUNTIF(AK336:AP336,\"=3\")*50+COUNTIF(AK336:AP336,\"=8\")*20+COUNTIF(AK336:AP336,\"=9\")*0)/COUNTA(AK336:AP336)/100,\"N/A\")","v":"N/A"},{"$f":"IF(COUNTA(AQ336:AU336)>0,(COUNTIF(AQ336:AU336,\"=0\")*0+COUNTIF(AQ336:AU336,\"=1\")*100+COUNTIF(AQ336:AU336,\"=2\")*80+COUNTIF(AQ336:AU336,\"=3\")*50+COUNTIF(AQ336:AU336,\"=8\")*20+COUNTIF(AQ336:AU336,\"=9\")*0)/COUNTA(AQ336:AU336)/100,\"N/A\")","v":"N/A"},{"$f":"IF(COUNTA(AV336:AX336)>0,(COUNTIF(AV336:AX336,\"=0\")*0+COUNTIF(AV336:AX336,\"=1\")*100+COUNTIF(AV336:AX336,\"=2\")*80+COUNTIF(AV336:AX336,\"=3\")*50+COUNTIF(AV336:AX336,\"=8\")*20+COUNTIF(AV336:AX336,\"=9\")*0)/COUNTA(AV336:AX336)/100,\"N/A\")","v":"N/A"},{"$f":"IF(AND(COUNTA(E336:AX336)<>0,B336<>\"\"),AVERAGE(BA336:BG336),\"N/A\")","v":"N/A"},1,1,1,1,1,1,1,{"$f":"IF(BF336=\"N/A\",1,\"\")","v":1},{"$f":"IF(BG336=\"N/A\",1,\"\")","v":1},1]
[null,null,null,null,null,null,null,null,null,null,null,null,null,null,null,null,null,null,null,null,null,null,null,null,null,null,null,null,null,null,null,null,null,null,null,null,null,null,null,null,null,null,null,null,null,null,null,null,null,null,"N/A","N/A","N/A","N/A","N/A","N/A","N/A","N/A","N/A","N/A",1,1,1,1,1,1,1,1,1,1]
[null,null,null,null,null,null,null,null,null,null,null,null,null,null,null,null,null,null,null,null,null,null,null,null,null,null,null,null,null,null,null,null,null,null,null,null,null,null,null,null,null,null,null,null,null,null,null,null,null,null,"N/A","N/A","N/A","N/A","N/A","N/A","N/A","N/A","N/A","N/A",1,1,1,1,1,1,1,1,1,1]
[null,null,null,null,null,null,null,null,null,null,null,null,null,null,null,null,null,null,null,null,null,null,null,null,null,null,null,null,null,null,null,null,null,null,null,null,null,null,null,null,null,null,null,null,null,null,null,null,null,null,"N/A","N/A","N/A","N/A","N/A","N/A","N/A","N/A","N/A","N/A",1,1,1,1,1,1,1,1,1,1]
[null,null,null,null,null,null,null,null,null,null,null,null,null,null,null,null,null,null,null,null,null,null,null,null,null,null,null,null,null,null,null,null,null,null,null,null,null,null,null,null,null,null,null,null,null,null,null,null,null,null,"N/A","N/A","N/A","N/A","N/A","N/A","N/A","N/A","N/A","N/A",1,1,1,1,1,1,1,1,1,1]
[null,null,null,null,null,null,null,null,null,null,null,null,null,null,null,null,null,null,null,null,null,null,null,null,null,null,null,null,null,null,null,null,null,null,null,null,null,null,null,null,null,null,null,null,null,null,null,null,null,null,"N/A","N/A","N/A","N/A","N/A","N/A","N/A","N/A","N/A","N/A",1,1,1,1,1,1,1,1,1,1]
[null,null,null,null,null,null,null,null,null,null,null,null,null,null,null,null,null,null,null,null,null,null,null,null,null,null,null,null,null,null,null,null,null,null,null,null,null,null,null,null,null,null,null,null,null,null,null,null,null,null,"N/A","N/A","N/A","N/A","N/A","N/A","N/A","N/A","N/A","N/A",1,1,1,1,1,1,1,1,1,1]
[null,null,null,null,null,null,null,null,null,null,null,null,null,null,null,null,null,null,null,null,null,null,null,null,null,null,null,null,null,null,null,null,null,null,null,null,null,null,null,null,null,null,null,null,null,null,null,null,null,null,"N/A","N/A","N/A","N/A","N/A","N/A","N/A","N/A","N/A","N/A",1,1,1,1,1,1,1,1,1,1]
[null,null,null,null,null,null,null,null,null,null,null,null,null,null,null,null,null,null,null,null,null,null,null,null,null,null,null,null,null,null,null,null,null,null,null,null,null,null,null,null,null,null,null,null,null,null,null,null,null,null,"N/A","N/A","N/A","N/A","N/A","N/A","N/A","N/A","N/A","N/A",1,1,1,1,1,1,1,1,1,1]
[null,null,null,null,null,null,null,null,null,null,null,null,null,null,null,null,null,null,null,null,null,null,null,null,null,null,null,null,null,null,null,null,null,null,null,null,null,null,null,null,null,null,null,null,null,null,null,null,null,null,{"$f":"IF(COUNTA(E345:J345)>0,(COUNTIF(E345:J345,\"=0\")*0+COUNTIF(E345:J345,\"=1\")*100+COUNTIF(E345:J345,\"=2\")*80+COUNTIF(E345:J345,\"=3\")*50+COUNTIF(E345:J345,\"=8\")*20+COUNTIF(E345:J345,\"=9\")*0)/COUNTA(E345:J345)/100,\"N/A\")","v":"N/A"},{"$f":"IF(COUNTA(K345:O345)>0,(COUNTIF(K345:O345,\"=0\")*0+COUNTIF(K345:O345,\"=1\")*100+COUNTIF(K345:O345,\"=2\")*80+COUNTIF(K345:O345,\"=3\")*50+COUNTIF(K345:O345,\"=8\")*20+COUNTIF(K345:O345,\"=9\")*0)/COUNTA(K345:O345)/100,\"N/A\")","v":"N/A"},{"$f":"IF(COUNTA(P345:U345)>0,(COUNTIF(P345:U345,\"=0\")*0+COUNTIF(P345:U345,\"=1\")*100+COUNTIF(P345:U345,\"=2\")*80+COUNTIF(P345:U345,\"=3\")*50+COUNTIF(P345:U345,\"=8\")*20+COUNTIF(P345:U345,\"=9\")*0)/COUNTA(P345:U345)/100,\"N/A\")","v":"N/A"},{"$f":"IF(COUNTA(V345)<>0,(COUNTIF(V345,\"=0\")*0+COUNTIF(V345,\"=1\")*100+COUNTIF(V345,\"=2\")*80+COUNTIF(V345,\"=3\")*50+COUNTIF(V345,\"=8\")*20+COUNTIF(V345,\"=9\")*0)/COUNTA(V345)/100,\"N/A\")","v":"N/A"},{"$f":"IF(COUNTA(W345:X345)>0,(COUNTIF(W345:X345,\"=0\")*0+COUNTIF(W345:X345,\"=1\")*100+COUNTIF(W345:X345,\"=2\")*80+COUNTIF(W345:X345,\"=3\")*50+COUNTIF(W345:X345,\"=8\")*20+COUNTIF(W345:X345,\"=9\")*0)/COUNTA(W345:X345)/100,\"N/A\")","v":"N/A"},{"$f":"IF(COUNTA(Y345:AJ345)>0,(COUNTIF(Y345:AJ345,\"=0\")*0+COUNTIF(Y345:AJ345,\"=1\")*100+COUNTIF(Y345:AJ345,\"=2\")*80+COUNTIF(Y345:AJ345,\"=3\")*50+COUNTIF(Y345:AJ345,\"=8\")*20+COUNTIF(Y345:AJ345,\"=9\")*0)/COUNTA(Y345:AJ345)/100,\"N/A\")","v":"N/A"},{"$f":"IF(COUNTA(AK345:AP345)>0,(COUNTIF(AK345:AP345,\"=0\")*0+COUNTIF(AK345:AP345,\"=1\")*100+COUNTIF(AK345:AP345,\"=2\")*80+COUNTIF(AK345:AP345,\"=3\")*50+COUNTIF(AK345:AP345,\"=8\")*20+COUNTIF(AK345:AP345,\"=9\")*0)/COUNTA(AK345:AP345)/100,\"N/A\")","v":"N/A"},{"$f":"IF(COUNTA(AQ345:AU345)>0,(COUNTIF(AQ345:AU345,\"=0\")*0+COUNTIF(AQ345:AU345,\"=1\")*100+COUNTIF(AQ345:AU345,\"=2\")*80+COUNTIF(AQ345:AU345,\"=3\")*50+COUNTIF(AQ345:AU345,\"=8\")*20+COUNTIF(AQ345:AU345,\"=9\")*0)/COUNTA(AQ345:AU345)/100,\"N/A\")","v":"N/A"},{"$f":"IF(COUNTA(AV345:AX345)>0,(COUNTIF(AV345:AX345,\"=0\")*0+COUNTIF(AV345:AX345,\"=1\")*100+COUNTIF(AV345:AX345,\"=2\")*80+COUNTIF(AV345:AX345,\"=3\")*50+COUNTIF(AV345:AX345,\"=8\")*20+COUNTIF(AV345:AX345,\"=9\")*0)/COUNTA(AV345:AX345)/100,\"N/A\")","v":"N/A"},{"$f":"IF(AND(COUNTA(E345:AX345)<>0,B345<>\"\"),AVERAGE(BA345:BG345),\"N/A\")","v":"N/A"},1,1,1,1,1,1,1,1,1,1]
[null,null,null,null,null,null,null,null,null,null,null,null,null,null,null,null,null,null,null,null,null,null,null,null,null,null,null,null,null,null,null,null,null,null,null,null,null,null,null,null,null,null,null,null,null,null,null,null,null,null,{"$f":"IF(COUNTA(E346:J346)>0,(COUNTIF(E346:J346,\"=0\")*0+COUNTIF(E346:J346,\"=1\")*100+COUNTIF(E346:J346,\"=2\")*80+COUNTIF(E346:J346,\"=3\")*50+COUNTIF(E346:J346,\"=8\")*20+COUNTIF(E346:J346,\"=9\")*0)/COUNTA(E346:J346)/100,\"N/A\")","v":"N/A"},{"$f":"IF(COUNTA(K346:O346)>0,(COUNTIF(K346:O346,\"=0\")*0+COUNTIF(K346:O346,\"=1\")*100+COUNTIF(K346:O346,\"=2\")*80+COUNTIF(K346:O346,\"=3\")*50+COUNTIF(K346:O346,\"=8\")*20+COUNTIF(K346:O346,\"=9\")*0)/COUNTA(K346:O346)/100,\"N/A\")","v":"N/A"},{"$f":"IF(COUNTA(P346:U346)>0,(COUNTIF(P346:U346,\"=0\")*0+COUNTIF(P346:U346,\"=1\")*100+COUNTIF(P346:U346,\"=2\")*80+COUNTIF(P346:U346,\"=3\")*50+COUNTIF(P346:U346,\"=8\")*20+COUNTIF(P346:U346,\"=9\")*0)/COUNTA(P346:U346)/100,\"N/A\")","v":"N/A"},{"$f":"IF(COUNTA(V346)<>0,(COUNTIF(V346,\"=0\")*0+COUNTIF(V346,\"=1\")*100+COUNTIF(V346,\"=2\")*80+COUNTIF(V346,\"=3\")*50+COUNTIF(V346,\"=8\")*20+COUNTIF(V346,\"=9\")*0)/COUNTA(V346)/100,\"N/A\")","v":"N/A"},{"$f":"IF(COUNTA(W346:X346)>0,(COUNTIF(W346:X346,\"=0\")*0+COUNTIF(W346:X346,\"=1\")*100+COUNTIF(W346:X346,\"=2\")*80+COUNTIF(W346:X346,\"=3\")*50+COUNTIF(W346:X346,\"=8\")*20+COUNTIF(W346:X346,\"=9\")*0)/COUNTA(W346:X346)/100,\"N/A\")","v":"N/A"},{"$f":"IF(COUNTA(Y346:AJ346)>0,(COUNTIF(Y346:AJ346,\"=0\")*0+COUNTIF(Y346:AJ346,\"=1\")*100+COUNTIF(Y346:AJ346,\"=2\")*80+COUNTIF(Y346:AJ346,\"=3\")*50+COUNTIF(Y346:AJ346,\"=8\")*20+COUNTIF(Y346:AJ346,\"=9\")*0)/COUNTA(Y346:AJ346)/100,\"N/A\")","v":"N/A"},{"$f":"IF(COUNTA(AK346:AP346)>0,(COUNTIF(AK346:AP346,\"=0\")*0+COUNTIF(AK346:AP346,\"=1\")*100+COUNTIF(AK346:AP346,\"=2\")*80+COUNTIF(AK346:AP346,\"=3\")*50+COUNTIF(AK346:AP346,\"=8\")*20+COUNTIF(AK346:AP346,\"=9\")*0)/COUNTA(AK346:AP346)/100,\"N/A\")","v":"N/A"},{"$f":"IF(COUNTA(AQ346:AU346)>0,(COUNTIF(AQ346:AU346,\"=0\")*0+COUNTIF(AQ346:AU346,\"=1\")*100+COUNTIF(AQ346:AU346,\"=2\")*80+COUNTIF(AQ346:AU346,\"=3\")*50+COUNTIF(AQ346:AU346,\"=8\")*20+COUNTIF(AQ346:AU346,\"=9\")*0)/COUNTA(AQ346:AU346)/100,\"N/A\")","v":"N/A"},{"$f":"IF(COUNTA(AV346:AX346)>0,(COUNTIF(AV346:AX346,\"=0\")*0+COUNTIF(AV346:AX346,\"=1\")*100+COUNTIF(AV346:AX346,\"=2\")*80+COUNTIF(AV346:AX346,\"=3\")*50+COUNTIF(AV346:AX346,\"=8\")*20+COUNTIF(AV346:AX346,\"=9\")*0)/COUNTA(AV346:AX346)/100,\"N/A\")","v":"N/A"},{"$f":"IF(AND(COUNTA(E346:AX346)<>0,B346<>\"\"),AVERAGE(BA346:BG346),\"N/A\")","v":"N/A"},1,1,1,1,1,1,1,1,1,1]
[null,null,null,null,null,null,null,null,null,null,null,null,null,null,null,null,null,null,null,null,null,null,null,null,null,null,null,null,null,null,null,null,null,null,null,null,null,null,null,null,null,null,null,null,null,null,null,null,null,null,"N/A","N/A","N/A","N/A","N/A","N/A","N/A","N/A","N/A","N/A",1,1,1,1,1,1,1,1,1,1]
[null,null,null,null,null,null,null,null,null,null,null,null,null,null,null,null,null,null,null,null,null,null,null,null,null,null,null,null,null,null,null,null,null,null,null,null,null,null,null,null,null,null,null,null,null,null,null,null,null,null,"N/A","N/A","N/A","N/A","N/A","N/A","N/A","N/A","N/A","N/A",1,1,1,1,1,1,1,1,1,1]
[null,null,null,null,null,null,null,null,null,null,null,null,null,null,null,null,null,null,null,null,null,null,null,null,null,null,null,null,null,null,null,null,null,null,null,null,null,null,null,null,null,null,null,null,null,null,null,null,null,null,"N/A",{"$f":"IF(COUNTA(K349:O349)>0,(COUNTIF(K349:O349,\"=0\")*0+COUNTIF(K349:O349,\"=1\")*100+COUNTIF(K349:O349,\"=2\")*80+COUNTIF(K349:O349,\"=3\")*50+COUNTIF(K349:O349,\"=8\")*20+COUNTIF(K349:O349,\"=9\")*0)/COUNTA(K349:O349)/100,\"N/A\")","v":"N/A"},"N/A","N/A","N/A","N/A","N/A","N/A","N/A","N/A",1,1,1,1,1,1,1,1,1,1]
[null,null,null,null,null,null,null,null,null,null,null,null,null,null,null,null,null,null,null,null,null,null,null,null,null,null,null,null,null,null,null,null,null,null,null,null,null,null,null,null,null,null,null,null,null,null,null,null,null,null,"N/A",{"$f":"IF(COUNTA(K350:O350)>0,(COUNTIF(K350:O350,\"=0\")*0+COUNTIF(K350:O350,\"=1\")*100+COUNTIF(K350:O350,\"=2\")*80+COUNTIF(K350:O350,\"=3\")*50+COUNTIF(K350:O350,\"=8\")*20+COUNTIF(K350:O350,\"=9\")*0)/COUNTA(K350:O350)/100,\"N/A\")","v":"N/A"},"N/A","N/A","N/A","N/A","N/A","N/A","N/A","N/A",1,1,1,1,1,1,1,1,1,1]
[null,null,null,null,null,null,null,null,null,null,null,null,null,null,null,null,null,null,null,null,null,null,null,null,null,null,null,null,null,null,null,null,null,null,null,null,null,null,null,null,null,null,null,null,null,null,null,null,null,null,"N/A","N/A","N/A","N/A","N/A","N/A","N/A","N/A","N/A","N/A",1,1,1,1,1,1,1,1,1,1]
[null,null,null,null,null,null,null,null,null,null,null,null,null,null,null,null,null,null,null,null,null,null,null,null,null,null,null,null,null,null,null,null,null,null,null,null,null,null,null,null,null,null,null,null,null,null,null,null,null,null,"N/A","N/A","N/A","N/A","N/A","N/A","N/A","N/A","N/A","N/A",1,1,1,1,1,1,1,1,1,1]
[null,null,null,null,null,null,null,null,null,null,null,null,null,null,null,null,null,null,null,null,null,null,null,null,null,null,null,null,null,null,null,null,null,null,null,null,null,null,null,null,null,null,null,null,null,null,null,null,null,null,"N/A","N/A","N/A","N/A","N/A","N/A","N/A","N/A","N/A","N/A",1,1,1,1,1,1,1,1,1,1]
[null,null,null,null,null,null,null,null,null,null,null,null,null,null,null,null,null,null,null,null,null,null,null,null,null,null,null,null,null,null,null,null,null,null,null,null,null,null,null,null,null,null,null,null,null,null,null,null,null,null,"N/A","N/A","N/A","N/A","N/A","N/A","N/A","N/A","N/A","N/A",1,1,1,1,1,1,1,1,1,1]
[null,null,null,null,null,null,null,null,null,null,null,null,null,null,null,null,null,null,null,null,null,null,null,null,null,null,null,null,null,null,null,null,null,null,null,null,null,null,null,null,null,null,null,null,null,null,null,null,null,null,"N/A","N/A","N/A","N/A","N/A","N/A","N/A","N/A","N/A","N/A",1,1,1,1,1,1,1,1,1,1]
[null,null,null,null,null,null,null,null,null,null,null,null,null,null,null,null,null,null,null,null,null,null,null,null,null,null,null,null,null,null,null,null,null,null,null,null,null,null,null,null,null,null,null,null,null,null,null,null,null,null,"N/A","N/A","N/A","N/A","N/A","N/A","N/A","N/A","N/A","N/A",1,1,1,1,1,1,1,1,1,1]
[null,null,null,null,null,null,null,null,null,null,null,null,null,null,null,null,null,null,null,null,null,null,null,null,null,null,null,null,null,null,null,null,null,null,null,null,null,null,null,null,null,null,null,null,null,null,null,null,null,null,"N/A","N/A","N/A","N/A","N/A","N/A","N/A","N/A","N/A","N/A",1,1,1,1,1,1,1,1,1,1]
[null,null,null,null,null,null,null,null,null,null,null,null,null,null,null,null,null,null,null,null,null,null,null,null,null,null,null,null,null,null,null,null,null,null,null,null,null,null,null,null,null,null,null,null,null,null,null,null,null,null,"N/A","N/A","N/A","N/A","N/A","N/A","N/A","N/A","N/A","N/A",1,1,1,1,1,1,1,1,1,1]
[null,null,null,null,null,null,null,null,null,null,null,null,null,null,null,null,null,null,null,null,null,null,null,null,null,null,null,null,null,null,null,null,null,null,null,null,null,null,null,null,null,null,null,null,null,null,null,null,null,null,"N/A","N/A","N/A","N/A","N/A","N/A","N/A","N/A","N/A","N/A",1,1,1,1,1,1,1,1,1,1]
[null,null,null,null,null,null,null,null,null,null,null,null,null,null,null,null,null,null,null,null,null,null,null,null,null,null,null,null,null,null,null,null,null,null,null,null,null,null,null,null,null,null,null,null,null,null,null,null,null,null,"N/A","N/A","N/A","N/A","N/A","N/A","N/A","N/A","N/A","N/A",1,1,1,1,1,1,1,1,1,1]
[null,null,null,null,null,null,null,null,null,null,null,null,null,null,null,null,null,null,null,null,null,null,null,null,null,null,null,null,null,null,null,null,null,null,null,null,null,null,null,null,null,null,null,null,null,null,null,null,null,null,"N/A","N/A","N/A","N/A","N/A","N/A","N/A","N/A","N/A","N/A",1,1,1,1,1,1,1,1,1,1]
[null,null,null,null,null,null,null,null,null,null,null,null,null,null,null,null,null,null,null,null,null,null,null,null,null,null,null,null,null,null,null,null,null,null,null,null,null,null,null,null,null,null,null,null,null,null,null,null,null,null,"N/A","N/A","N/A","N/A","N/A","N/A","N/A","N/A","N/A","N/A",1,1,1,1,1,1,1,1,1,1]
[null,null,null,null,null,null,null,null,null,null,null,null,null,null,null,null,null,null,null,null,null,null,null,null,null,null,null,null,null,null,null,null,null,null,null,null,null,null,null,null,null,null,null,null,null,null,null,null,null,null,"N/A","N/A","N/A","N/A","N/A","N/A","N/A","N/A","N/A","N/A",1,1,1,1,1,1,1,1,1,1]
[null,null,null,null,null,null,null,null,null,null,null,null,null,null,null,null,null,null,null,null,null,null,null,null,null,null,null,null,null,null,null,null,null,null,null,null,null,null,null,null,null,null,null,null,null,null,null,null,null,null,"N/A","N/A","N/A","N/A","N/A","N/A","N/A","N/A","N/A","N/A",1,1,1,1,1,1,1,1,1,1]
[null,null,null,null,null,null,null,null,null,null,null,null,null,null,null,null,null,null,null,null,null,null,null,null,null,null,null,null,null,null,null,null,null,null,null,null,null,null,null,null,null,null,null,null,null,null,null,null,null,null,"N/A","N/A","N/A","N/A","N/A","N/A","N/A","N/A","N/A","N/A",1,1,1,1,1,1,1,1,1,1]
[null,null,null,null,null,null,null,null,null,null,null,null,null,null,null,null,null,null,null,null,null,null,null,null,null,null,null,null,null,null,null,null,null,null,null,null,null,null,null,null,null,null,null,null,null,null,null,null,null,null,"N/A","N/A","N/A","N/A","N/A","N/A","N/A","N/A","N/A","N/A",1,1,1,1,1,1,1,1,1,1]
[null,null,null,null,null,null,null,null,null,null,null,null,null,null,null,null,null,null,null,null,null,null,null,null,null,null,null,null,null,null,null,null,null,null,null,null,null,null,null,null,null,null,null,null,null,null,null,null,null,null,"N/A","N/A","N/A","N/A","N/A","N/A","N/A","N/A","N/A","N/A",1,1,1,1,1,1,1,1,1,1]
[null,null,null,null,null,null,null,null,null,null,null,null,null,null,null,null,null,null,null,null,null,null,null,null,null,null,null,null,null,null,null,null,null,null,null,null,null,null,null,null,null,null,null,null,null,null,null,null,null,null,"N/A","N/A","N/A","N/A","N/A","N/A","N/A","N/A","N/A","N/A",1,1,1,1,1,1,1,1,1,1]
[null,null,null,null,null,null,null,null,null,null,null,null,null,null,null,null,null,null,null,null,null,null,null,null,null,null,null,null,null,null,null,null,null,null,null,null,null,null,null,null,null,null,null,null,null,null,null,null,null,null,"N/A","N/A","N/A","N/A","N/A","N/A","N/A","N/A","N/A","N/A",1,1,1,1,1,1,1,1,1,1]
[null,null,null,null,null,null,null,null,null,null,null,null,null,null,null,null,null,null,null,null,null,null,null,null,null,null,null,null,null,null,null,null,null,null,null,null,null,null,null,null,null,null,null,null,null,null,null,null,null,null,"N/A","N/A","N/A","N/A","N/A","N/A","N/A","N/A","N/A","N/A",1,1,1,1,1,1,1,1,1,1]
[null,null,null,null,null,null,null,null,null,null,null,null,null,null,null,null,null,null,null,null,null,null,null,null,null,null,null,null,null,null,null,null,null,null,null,null,null,null,null,null,null,null,null,null,null,null,null,null,null,null,"N/A","N/A","N/A","N/A","N/A","N/A","N/A","N/A","N/A","N/A",1,1,1,1,1,1,1,1,1,1]
[null,null,null,null,null,null,null,null,null,null,null,null,null,null,null,null,null,null,null,null,null,null,null,null,null,null,null,null,null,null,null,null,null,null,null,null,null,null,null,null,null,null,null,null,null,null,null,null,null,null,"N/A","N/A","N/A","N/A","N/A","N/A","N/A","N/A","N/A","N/A",1,1,1,1,1,1,1,1,1,1]
[null,null,null,null,null,null,null,null,null,null,null,null,null,null,null,null,null,null,null,null,null,null,null,null,null,null,null,null,null,null,null,null,null,null,null,null,null,null,null,null,null,null,null,null,null,null,null,null,null,null,"N/A","N/A","N/A","N/A","N/A","N/A","N/A","N/A","N/A","N/A",1,1,1,1,1,1,1,1,1,1]
[null,null,null,null,null,null,null,null,null,null,null,null,null,null,null,null,null,null,null,null,null,null,null,null,null,null,null,null,null,null,null,null,null,null,null,null,null,null,null,null,null,null,null,null,null,null,null,null,null,null,"N/A","N/A","N/A","N/A","N/A","N/A","N/A","N/A","N/A","N/A",1,1,1,1,1,1,1,1,1,1]
[null,null,null,null,null,null,null,null,null,null,null,null,null,null,null,null,null,null,null,null,null,null,null,null,null,null,null,null,null,null,null,null,null,null,null,null,null,null,null,null,null,null,null,null,null,null,null,null,null,null,"N/A","N/A","N/A","N/A","N/A","N/A","N/A","N/A","N/A","N/A",1,1,1,1,1,1,1,1,1,1]
[null,null,null,null,null,null,null,null,null,null,null,null,null,null,null,null,null,null,null,null,null,null,null,null,null,null,null,null,null,null,null,null,null,null,null,null,null,null,null,null,null,null,null,null,null,null,null,null,null,null,"N/A","N/A","N/A","N/A","N/A","N/A","N/A","N/A","N/A","N/A",1,1,1,1,1,1,1,1,1,1]
[null,null,null,null,null,null,null,null,null,null,null,null,null,null,null,null,null,null,null,null,null,null,null,null,null,null,null,null,null,null,null,null,null,null,null,null,null,null,null,null,null,null,null,null,null,null,null,null,null,null,"N/A","N/A","N/A","N/A","N/A","N/A","N/A","N/A","N/A","N/A",1,1,1,1,1,1,1,1,1,{"$f":"IF(BH377=\"N/A\",1,\"\")","v":1}]
[null,null,null,null,null,null,null,null,null,null,null,null,null,null,null,null,null,null,null,null,null,null,null,null,null,null,null,null,null,null,null,null,null,null,null,null,null,null,null,null,null,null,null,null,null,null,null,null,null,null,"N/A","N/A","N/A","N/A","N/A","N/A","N/A","N/A","N/A","N/A",{"$f":"IF(AY378=\"N/A\",1,\"\")","v":1},{"$f":"IF(AZ378=\"N/A\",1,\"\")","v":1},{"$f":"IF(BA378=\"N/A\",1,\"\")","v":1},{"$f":"IF(BB378=\"N/A\",1,\"\")","v":1},{"$f":"IF(BC378=\"N/A\",1,\"\")","v":1},{"$f":"IF(BD378=\"N/A\",1,\"\")","v":1},{"$f":"IF(BE378=\"N/A\",1,\"\")","v":1},1,1,1]
[null,null,null,null,null,null,null,null,null,null,null,null,null,null,null,null,null,null,null,null,null,null,null,null,null,null,null,null,null,null,null,null,null,null,null,null,null,null,null,null,null,null,null,null,null,null,null,null,null,null,"N/A","N/A","N/A","N/A","N/A","N/A","N/A","N/A","N/A","N/A",1,1,1,1,1,1,1,1,1,1]
[null,null,null,null,null,null,null,null,null,null,null,null,null,null,null,null,null,null,null,null,null,null,null,null,null,null,null,null,null,null,null,null,null,null,null,null,null,null,null,null,null,null,null,null,null,null,null,null,null,null,"N/A","N/A","N/A","N/A","N/A","N/A","N/A","N/A","N/A","N/A",1,1,1,1,1,1,1,1,1,1]
[null,null,null,null,null,null,null,null,null,null,null,null,null,null,null,null,null,null,null,null,null,null,null,null,null,null,null,null,null,null,null,null,null,null,null,null,null,null,null,null,null,null,null,null,null,null,null,null,null,null,"N/A","N/A","N/A","N/A","N/A","N/A","N/A","N/A","N/A","N/A",1,1,1,1,1,1,1,1,1,1]
[null,null,null,null,null,null,null,null,null,null,null,null,null,null,null,null,null,null,null,null,null,null,null,null,null,null,null,null,null,null,null,null,null,null,null,null,null,null,null,null,null,null,null,null,null,null,null,null,null,null,"N/A","N/A","N/A","N/A","N/A","N/A","N/A","N/A","N/A","N/A",1,1,1,1,1,1,1,1,1,1]
[null,null,null,null,null,null,null,null,null,null,null,null,null,null,null,null,null,null,null,null,null,null,null,null,null,null,null,null,null,null,null,null,null,null,null,null,null,null,null,null,null,null,null,null,null,null,null,null,null,null,"N/A","N/A","N/A","N/A","N/A","N/A","N/A","N/A","N/A","N/A",1,1,1,1,1,1,1,1,1,1]
[null,null,null,null,null,null,null,null,null,null,null,null,null,null,null,null,null,null,null,null,null,null,null,null,null,null,null,null,null,null,null,null,null,null,null,null,null,null,null,null,null,null,null,null,null,null,null,null,null,null,"N/A","N/A","N/A","N/A","N/A","N/A","N/A","N/A","N/A","N/A",1,1,1,1,1,1,1,1,1,1]
[null,null,null,null,null,null,null,null,null,null,null,null,null,null,null,null,null,null,null,null,null,null,null,null,null,null,null,null,null,null,null,null,null,null,null,null,null,null,null,null,null,null,null,null,null,null,null,null,null,null,"N/A","N/A","N/A","N/A","N/A","N/A","N/A","N/A","N/A","N/A",1,1,1,1,1,1,1,1,1,1]
[null,null,null,null,null,null,null,null,null,null,null,null,null,null,null,null,null,null,null,null,null,null,null,null,null,null,null,null,null,null,null,null,null,null,null,null,null,null,null,null,null,null,null,null,null,null,null,null,null,null,"N/A","N/A","N/A","N/A","N/A","N/A","N/A","N/A","N/A","N/A",1,1,1,1,1,1,1,1,1,1]
[null,null,null,null,null,null,null,null,null,null,null,null,null,null,null,null,null,null,null,null,null,null,null,null,null,null,null,null,null,null,null,null,null,null,null,null,null,null,null,null,null,null,null,null,null,null,null,null,null,null,"N/A","N/A","N/A","N/A","N/A","N/A","N/A","N/A","N/A","N/A",1,1,1,1,1,1,1,1,1,1]
[null,null,null,null,null,null,null,null,null,null,null,null,null,null,null,null,null,null,null,null,null,null,null,null,null,null,null,null,null,null,null,null,null,null,null,null,null,null,null,null,null,null,null,null,null,null,null,null,null,null,"N/A","N/A","N/A","N/A","N/A","N/A","N/A","N/A","N/A","N/A",1,1,1,1,1,1,1,1,1,1]
[null,null,null,null,null,null,null,null,null,null,null,null,null,null,null,null,null,null,null,null,null,null,null,null,null,null,null,null,null,null,null,null,null,null,null,null,null,null,null,null,null,null,null,null,null,null,null,null,null,null,"N/A","N/A","N/A","N/A","N/A","N/A","N/A","N/A","N/A","N/A",1,1,1,1,1,1,1,1,1,1]
[null,null,null,null,null,null,null,null,null,null,null,null,null,null,null,null,null,null,null,null,null,null,null,null,null,null,null,null,null,null,null,null,null,null,null,null,null,null,null,null,null,null,null,null,null,null,null,null,null,null,"N/A","N/A","N/A","N/A","N/A","N/A","N/A","N/A","N/A","N/A",1,1,1,1,1,1,1,1,1,1]
[null,null,null,null,null,null,null,null,null,null,null,null,null,null,null,null,null,null,null,null,null,null,null,null,null,null,null,null,null,null,null,null,null,null,null,null,null,null,null,null,null,null,null,null,null,null,null,null,null,null,"N/A","N/A","N/A","N/A","N/A","N/A","N/A","N/A","N/A","N/A",1,1,1,1,1,1,1,1,1,1]
[null,null,null,null,null,null,null,null,null,null,null,null,null,null,null,null,null,null,null,null,null,null,null,null,null,null,null,null,null,null,null,null,null,null,null,null,null,null,null,null,null,null,null,null,null,null,null,null,null,null,"N/A","N/A","N/A","N/A","N/A","N/A","N/A","N/A","N/A","N/A",1,1,1,1,1,1,1,1,1,1]
[null,null,null,null,null,null,null,null,null,null,null,null,null,null,null,null,null,null,null,null,null,null,null,null,null,null,null,null,null,null,null,null,null,null,null,null,null,null,null,null,null,null,null,null,null,null,null,null,null,null,"N/A","N/A","N/A","N/A","N/A","N/A","N/A","N/A","N/A","N/A",1,1,1,1,1,1,1,1,1,1]
[null,null,null,null,null,null,null,null,null,null,null,null,null,null,null,null,null,null,null,null,null,null,null,null,null,null,null,null,null,null,null,null,null,null,null,null,null,null,null,null,null,null,null,null,null,null,null,null,null,null,"N/A","N/A","N/A","N/A","N/A","N/A","N/A","N/A","N/A","N/A",1,1,1,1,1,1,1,1,1,1]
[null,null,null,null,null,null,null,null,null,null,null,null,null,null,null,null,null,null,null,null,null,null,null,null,null,null,null,null,null,null,null,null,null,null,null,null,null,null,null,null,null,null,null,null,null,null,null,null,null,null,"N/A","N/A","N/A","N/A","N/A","N/A","N/A","N/A","N/A","N/A",1,1,1,1,1,1,1,1,1,1]
[null,null,null,null,null,null,null,null,null,null,null,null,null,null,null,null,null,null,null,null,null,null,null,null,null,null,null,null,null,null,null,null,null,null,null,null,null,null,null,null,null,null,null,null,null,null,null,null,null,null,"N/A","N/A","N/A","N/A","N/A","N/A","N/A","N/A","N/A","N/A",1,1,1,1,1,1,1,1,1,1]
[null,null,null,null,null,null,null,null,null,null,null,null,null,null,null,null,null,null,null,null,null,null,null,null,null,null,null,null,null,null,null,null,null,null,null,null,null,null,null,null,null,null,null,null,null,null,null,null,null,null,"N/A","N/A","N/A","N/A","N/A","N/A","N/A","N/A","N/A","N/A",1,1,1,1,1,1,1,1,1,1]
[null,null,null,null,null,null,null,null,null,null,null,null,null,null,null,null,null,null,null,null,null,null,null,null,null,null,null,null,null,null,null,null,null,null,null,null,null,null,null,null,null,null,null,null,null,null,null,null,null,null,"N/A","N/A","N/A","N/A","N/A","N/A","N/A","N/A","N/A","N/A",1,1,1,1,1,1,1,1,1,1]
[null,null,null,null,null,null,null,null,null,null,null,null,null,null,null,null,null,null,null,null,null,null,null,null,null,null,null,null,null,null,null,null,null,null,null,null,null,null,null,null,null,null,null,null,null,null,null,null,null,null,"N/A","N/A","N/A","N/A","N/A","N/A","N/A","N/A","N/A","N/A",1,1,1,1,1,1,1,1,1,1]
[null,null,null,null,null,null,null,null,null,null,null,null,null,null,null,null,null,null,null,null,null,null,null,null,null,null,null,null,null,null,null,null,null,null,null,null,null,null,null,null,null,null,null,null,null,null,null,null,null,null,"N/A","N/A","N/A","N/A","N/A","N/A","N/A","N/A","N/A","N/A",1,1,1,1,1,1,1,{"$f":"IF(BF400=\"N/A\",1,\"\")","v":1},{"$f":"IF(BG400=\"N/A\",1,\"\")","v":1},1]
[null,null,null,null,null,null,null,null,null,null,null,null,null,null,null,null,null,null,null,null,null,null,null,null,null,null,null,null,null,null,null,null,null,null,null,null,null,null,null,null,null,null,null,null,null,null,null,null,null,null,"N/A","N/A","N/A","N/A","N/A","N/A","N/A","N/A","N/A","N/A",1,1,1,1,1,1,1,1,1,1]
[null,null,null,null,null,null,null,null,null,null,null,null,null,null,null,null,null,null,null,null,null,null,null,null,null,null,null,null,null,null,null,null,null,null,null,null,null,null,null,null,null,null,null,null,null,null,null,null,null,null,"N/A","N/A","N/A","N/A","N/A","N/A","N/A","N/A","N/A","N/A",1,1,1,1,1,1,1,1,1,1]
[null,null,null,null,null,null,null,null,null,null,null,null,null,null,null,null,null,null,null,null,null,null,null,null,null,null,null,null,null,null,null,null,null,null,null,null,null,null,null,null,null,null,null,null,null,null,null,null,null,null,"N/A","N/A","N/A","N/A","N/A","N/A","N/A","N/A","N/A","N/A",1,1,1,1,1,1,1,1,1,1]
[null,null,null,null,null,null,null,null,null,null,null,null,null,null,null,null,null,null,null,null,null,null,null,null,null,null,null,null,null,null,null,null,null,null,null,null,null,null,null,null,null,null,null,null,null,null,null,null,null,null,"N/A","N/A","N/A","N/A","N/A","N/A","N/A","N/A","N/A","N/A",1,1,1,1,1,1,1,1,1,1]
[null,null,null,null,null,null,null,null,null,null,null,null,null,null,null,null,null,null,null,null,null,null,null,null,null,null,null,null,null,null,null,null,null,null,null,null,null,null,null,null,null,null,null,null,null,null,null,null,null,null,"N/A","N/A","N/A","N/A","N/A","N/A","N/A","N/A","N/A","N/A",1,1,1,1,1,1,1,1,1,1]
[null,null,null,null,null,null,null,null,null,null,null,null,null,null,null,null,null,null,null,null,null,null,null,null,null,null,null,null,null,null,null,null,null,null,null,null,null,null,null,null,null,null,null,null,null,null,null,null,null,null,"N/A","N/A","N/A","N/A","N/A","N/A","N/A","N/A","N/A","N/A",1,1,1,1,1,1,1,1,1,1]
[null,null,null,null,null,null,null,null,null,null,null,null,null,null,null,null,null,null,null,null,null,null,null,null,null,null,null,null,null,null,null,null,null,null,null,null,null,null,null,null,null,null,null,null,null,null,null,null,null,null,"N/A","N/A","N/A","N/A","N/A","N/A","N/A","N/A","N/A","N/A",1,1,1,1,1,1,1,1,1,1]
[null,null,null,null,null,null,null,null,null,null,null,null,null,null,null,null,null,null,null,null,null,null,null,null,null,null,null,null,null,null,null,null,null,null,null,null,null,null,null,null,null,null,null,null,null,null,null,null,null,null,"N/A","N/A","N/A","N/A","N/A","N/A","N/A","N/A","N/A","N/A",1,1,1,1,1,1,1,1,1,1]
[null,null,null,null,null,null,null,null,null,null,null,null,null,null,null,null,null,null,null,null,null,null,null,null,null,null,null,null,null,null,null,null,null,null,null,null,null,null,null,null,null,null,null,null,null,null,null,null,null,null,"N/A","N/A","N/A","N/A","N/A","N/A","N/A","N/A","N/A","N/A",1,1,1,1,1,1,1,1,1,1]
[null,null,null,null,null,null,null,null,null,null,null,null,null,null,null,null,null,null,null,null,null,null,null,null,null,null,null,null,null,null,null,null,null,null,null,null,null,null,null,null,null,null,null,null,null,null,null,null,null,null,{"$f":"IF(COUNTA(E410:J410)>0,(COUNTIF(E410:J410,\"=0\")*0+COUNTIF(E410:J410,\"=1\")*100+COUNTIF(E410:J410,\"=2\")*80+COUNTIF(E410:J410,\"=3\")*50+COUNTIF(E410:J410,\"=8\")*20+COUNTIF(E410:J410,\"=9\")*0)/COUNTA(E410:J410)/100,\"N/A\")","v":"N/A"},"N/A",{"$f":"IF(COUNTA(P410:U410)>0,(COUNTIF(P410:U410,\"=0\")*0+COUNTIF(P410:U410,\"=1\")*100+COUNTIF(P410:U410,\"=2\")*80+COUNTIF(P410:U410,\"=3\")*50+COUNTIF(P410:U410,\"=8\")*20+COUNTIF(P410:U410,\"=9\")*0)/COUNTA(P410:U410)/100,\"N/A\")","v":"N/A"},{"$f":"IF(COUNTA(V410)<>0,(COUNTIF(V410,\"=0\")*0+COUNTIF(V410,\"=1\")*100+COUNTIF(V410,\"=2\")*80+COUNTIF(V410,\"=3\")*50+COUNTIF(V410,\"=8\")*20+COUNTIF(V410,\"=9\")*0)/COUNTA(V410)/100,\"N/A\")","v":"N/A"},{"$f":"IF(COUNTA(W410:X410)>0,(COUNTIF(W410:X410,\"=0\")*0+COUNTIF(W410:X410,\"=1\")*100+COUNTIF(W410:X410,\"=2\")*80+COUNTIF(W410:X410,\"=3\")*50+COUNTIF(W410:X410,\"=8\")*20+COUNTIF(W410:X410,\"=9\")*0)/COUNTA(W410:X410)/100,\"N/A\")","v":"N/A"},{"$f":"IF(COUNTA(Y410:AJ410)>0,(COUNTIF(Y410:AJ410,\"=0\")*0+COUNTIF(Y410:AJ410,\"=1\")*100+COUNTIF(Y410:AJ410,\"=2\")*80+COUNTIF(Y410:AJ410,\"=3\")*50+COUNTIF(Y410:AJ410,\"=8\")*20+COUNTIF(Y410:AJ410,\"=9\")*0)/COUNTA(Y410:AJ410)/100,\"N/A\")","v":"N/A"},{"$f":"IF(COUNTA(AK410:AP410)>0,(COUNTIF(AK410:AP410,\"=0\")*0+COUNTIF(AK410:AP410,\"=1\")*100+COUNTIF(AK410:AP410,\"=2\")*80+COUNTIF(AK410:AP410,\"=3\")*50+COUNTIF(AK410:AP410,\"=8\")*20+COUNTIF(AK410:AP410,\"=9\")*0)/COUNTA(AK410:AP410)/100,\"N/A\")","v":"N/A"},{"$f":"IF(COUNTA(AQ410:AU410)>0,(COUNTIF(AQ410:AU410,\"=0\")*0+COUNTIF(AQ410:AU410,\"=1\")*100+COUNTIF(AQ410:AU410,\"=2\")*80+COUNTIF(AQ410:AU410,\"=3\")*50+COUNTIF(AQ410:AU410,\"=8\")*20+COUNTIF(AQ410:AU410,\"=9\")*0)/COUNTA(AQ410:AU410)/100,\"N/A\")","v":"N/A"},{"$f":"IF(COUNTA(AV410:AX410)>0,(COUNTIF(AV410:AX410,\"=0\")*0+COUNTIF(AV410:AX410,\"=1\")*100+COUNTIF(AV410:AX410,\"=2\")*80+COUNTIF(AV410:AX410,\"=3\")*50+COUNTIF(AV410:AX410,\"=8\")*20+COUNTIF(AV410:AX410,\"=9\")*0)/COUNTA(AV410:AX410)/100,\"N/A\")","v":"N/A"},{"$f":"IF(AND(COUNTA(E410:AX410)<>0,B410<>\"\"),AVERAGE(BA410:BG410),\"N/A\")","v":"N/A"},1,1,1,1,1,1,1,1,1,1]
[null,null,null,null,null,null,null,null,null,null,null,null,null,null,null,null,null,null,null,null,null,null,null,null,null,null,null,null,null,null,null,null,null,null,null,null,null,null,null,null,null,null,null,null,null,null,null,null,null,null,"N/A","N/A","N/A","N/A","N/A","N/A","N/A","N/A","N/A","N/A",1,1,1,1,1,1,1,1,1,1]
[null,null,null,null,null,null,null,null,null,null,null,null,null,null,null,null,null,null,null,null,null,null,null,null,null,null,null,null,null,null,null,null,null,null,null,null,null,null,null,null,null,null,null,null,null,null,null,null,null,null,"N/A","N/A","N/A","N/A","N/A","N/A","N/A","N/A","N/A","N/A",1,1,1,1,1,1,1,1,1,1]
[null,null,null,null,null,null,null,null,null,null,null,null,null,null,null,null,null,null,null,null,null,null,null,null,null,null,null,null,null,null,null,null,null,null,null,null,null,null,null,null,null,null,null,null,null,null,null,null,null,null,"N/A","N/A","N/A","N/A","N/A","N/A","N/A","N/A","N/A","N/A",1,1,1,1,1,1,1,1,1,1]
[null,null,null,null,null,null,null,null,null,null,null,null,null,null,null,null,null,null,null,null,null,null,null,null,null,null,null,null,null,null,null,null,null,null,null,null,null,null,null,null,null,null,null,null,null,null,null,null,null,null,"N/A",{"$f":"IF(COUNTA(K414:O414)>0,(COUNTIF(K414:O414,\"=0\")*0+COUNTIF(K414:O414,\"=1\")*100+COUNTIF(K414:O414,\"=2\")*80+COUNTIF(K414:O414,\"=3\")*50+COUNTIF(K414:O414,\"=8\")*20+COUNTIF(K414:O414,\"=9\")*0)/COUNTA(K414:O414)/100,\"N/A\")","v":"N/A"},"N/A","N/A","N/A","N/A","N/A","N/A","N/A","N/A",1,1,1,1,1,1,1,1,1,1]
[null,null,null,null,null,null,null,null,null,null,null,null,null,null,null,null,null,null,null,null,null,null,null,null,null,null,null,null,null,null,null,null,null,null,null,null,null,null,null,null,null,null,null,null,null,null,null,null,null,null,"N/A","N/A","N/A","N/A","N/A","N/A","N/A","N/A","N/A","N/A",1,1,1,1,1,1,1,1,1,1]
[null,null,null,null,null,null,null,null,null,null,null,null,null,null,null,null,null,null,null,null,null,null,null,null,null,null,null,null,null,null,null,null,null,null,null,null,null,null,null,null,null,null,null,null,null,null,null,null,null,null,"N/A","N/A","N/A","N/A","N/A","N/A","N/A","N/A","N/A","N/A",1,1,1,1,1,1,1,1,1,1]
[null,null,null,null,null,null,null,null,null,null,null,null,null,null,null,null,null,null,null,null,null,null,null,null,null,null,null,null,null,null,null,null,null,null,null,null,null,null,null,null,null,null,null,null,null,null,null,null,null,null,"N/A","N/A","N/A","N/A","N/A","N/A","N/A","N/A","N/A","N/A",1,1,1,1,1,1,1,1,1,1]
[null,null,null,null,null,null,null,null,null,null,null,null,null,null,null,null,null,null,null,null,null,null,null,null,null,null,null,null,null,null,null,null,null,null,null,null,null,null,null,null,null,null,null,null,null,null,null,null,null,null,"N/A","N/A","N/A","N/A","N/A","N/A","N/A","N/A","N/A","N/A",1,1,1,1,1,1,1,1,1,1]
[null,null,null,null,null,null,null,null,null,null,null,null,null,null,null,null,null,null,null,null,null,null,null,null,null,null,null,null,null,null,null,null,null,null,null,null,null,null,null,null,null,null,null,null,null,null,null,null,null,null,"N/A","N/A","N/A","N/A","N/A","N/A","N/A","N/A","N/A","N/A",1,1,1,1,1,1,1,1,1,1]
[null,null,null,null,null,null,null,null,null,null,null,null,null,null,null,null,null,null,null,null,null,null,null,null,null,null,null,null,null,null,null,null,null,null,null,null,null,null,null,null,null,null,null,null,null,null,null,null,null,null,"N/A","N/A","N/A","N/A","N/A","N/A","N/A","N/A","N/A","N/A",1,1,1,1,1,1,1,1,1,1]
[null,null,null,null,null,null,null,null,null,null,null,null,null,null,null,null,null,null,null,null,null,null,null,null,null,null,null,null,null,null,null,null,null,null,null,null,null,null,null,null,null,null,null,null,null,null,null,null,null,null,"N/A","N/A","N/A","N/A","N/A","N/A","N/A","N/A","N/A","N/A",1,1,1,1,1,1,1,1,1,1]
[null,null,null,null,null,null,null,null,null,null,null,null,null,null,null,null,null,null,null,null,null,null,null,null,null,null,null,null,null,null,null,null,null,null,null,null,null,null,null,null,null,null,null,null,null,null,null,null,null,null,"N/A","N/A","N/A","N/A","N/A","N/A","N/A","N/A","N/A","N/A",1,1,1,1,1,1,1,1,1,1]
[null,null,null,null,null,null,null,null,null,null,null,null,null,null,null,null,null,null,null,null,null,null,null,null,null,null,null,null,null,null,null,null,null,null,null,null,null,null,null,null,null,null,null,null,null,null,null,null,null,null,"N/A","N/A","N/A","N/A","N/A","N/A","N/A","N/A","N/A","N/A",1,1,1,1,1,1,1,1,1,1]
[null,null,null,null,null,null,null,null,null,null,null,null,null,null,null,null,null,null,null,null,null,null,null,null,null,null,null,null,null,null,null,null,null,null,null,null,null,null,null,null,null,null,null,null,null,null,null,null,null,null,"N/A","N/A","N/A","N/A","N/A","N/A","N/A","N/A","N/A","N/A",1,1,1,1,1,1,1,1,1,1]
[null,null,null,null,null,null,null,null,null,null,null,null,null,null,null,null,null,null,null,null,null,null,null,null,null,null,null,null,null,null,null,null,null,null,null,null,null,null,null,null,null,null,null,null,null,null,null,null,null,null,"N/A","N/A","N/A","N/A","N/A","N/A","N/A","N/A","N/A","N/A",1,1,1,1,1,1,1,1,1,1]
[null,null,null,null,null,null,null,null,null,null,null,null,null,null,null,null,null,null,null,null,null,null,null,null,null,null,null,null,null,null,null,null,null,null,null,null,null,null,null,null,null,null,null,null,null,null,null,null,null,null,"N/A","N/A","N/A","N/A","N/A","N/A","N/A","N/A","N/A","N/A",1,1,1,1,1,1,1,1,1,1]
[null,null,null,null,null,null,null,null,null,null,null,null,null,null,null,null,null,null,null,null,null,null,null,null,null,null,null,null,null,null,null,null,null,null,null,null,null,null,null,null,null,null,null,null,null,null,null,null,null,null,"N/A","N/A","N/A","N/A","N/A","N/A","N/A","N/A","N/A","N/A",1,1,1,1,1,1,1,1,1,1]
[null,null,null,null,null,null,null,null,null,null,null,null,null,null,null,null,null,null,null,null,null,null,null,null,null,null,null,null,null,null,null,null,null,null,null,null,null,null,null,null,null,null,null,null,null,null,null,null,null,null,"N/A","N/A","N/A","N/A","N/A","N/A","N/A","N/A","N/A","N/A",1,1,1,1,1,1,1,1,1,1]
[null,null,null,null,null,null,null,null,null,null,null,null,null,null,null,null,null,null,null,null,null,null,null,null,null,null,null,null,null,null,null,null,null,null,null,null,null,null,null,null,null,null,null,null,null,null,null,null,null,null,"N/A","N/A","N/A","N/A","N/A","N/A","N/A","N/A","N/A","N/A",1,1,1,1,1,1,1,1,1,1]
[null,null,null,null,null,null,null,null,null,null,null,null,null,null,null,null,null,null,null,null,null,null,null,null,null,null,null,null,null,null,null,null,null,null,null,null,null,null,null,null,null,null,null,null,null,null,null,null,null,null,"N/A","N/A","N/A","N/A","N/A","N/A","N/A","N/A","N/A","N/A",1,1,1,1,1,1,1,1,1,1]
[null,null,null,null,null,null,null,null,null,null,null,null,null,null,null,null,null,null,null,null,null,null,null,null,null,null,null,null,null,null,null,null,null,null,null,null,null,null,null,null,null,null,null,null,null,null,null,null,null,null,"N/A","N/A","N/A","N/A","N/A","N/A","N/A","N/A","N/A","N/A",1,1,1,1,1,1,1,1,1,1]
[null,null,null,null,null,null,null,null,null,null,null,null,null,null,null,null,null,null,null,null,null,null,null,null,null,null,null,null,null,null,null,null,null,null,null,null,null,null,null,null,null,null,null,null,null,null,null,null,null,null,"N/A","N/A","N/A","N/A","N/A","N/A","N/A","N/A","N/A","N/A",1,1,1,1,1,1,1,1,1,1]
[null,null,null,null,null,null,null,null,null,null,null,null,null,null,null,null,null,null,null,null,null,null,null,null,null,null,null,null,null,null,null,null,null,null,null,null,null,null,null,null,null,null,null,null,null,null,null,null,null,null,"N/A","N/A","N/A","N/A","N/A","N/A","N/A","N/A","N/A","N/A",1,1,1,1,1,1,1,1,1,1]
[null,null,null,null,null,null,null,null,null,null,null,null,null,null,null,null,null,null,null,null,null,null,null,null,null,null,null,null,null,null,null,null,null,null,null,null,null,null,null,null,null,null,null,null,null,null,null,null,null,null,"N/A","N/A","N/A","N/A","N/A","N/A","N/A","N/A","N/A","N/A",1,1,1,1,1,1,1,1,1,1]
[null,null,null,null,null,null,null,null,null,null,null,null,null,null,null,null,null,null,null,null,null,null,null,null,null,null,null,null,null,null,null,null,null,null,null,null,null,null,null,null,null,null,null,null,null,null,null,null,null,null,"N/A","N/A","N/A","N/A","N/A","N/A","N/A","N/A","N/A","N/A",1,1,1,1,1,1,1,1,1,1]
[null,null,null,null,null,null,null,null,null,null,null,null,null,null,null,null,null,null,null,null,null,null,null,null,null,null,null,null,null,null,null,null,null,null,null,null,null,null,null,null,null,null,null,null,null,null,null,null,null,null,"N/A","N/A","N/A","N/A","N/A","N/A","N/A","N/A","N/A","N/A",1,1,1,1,1,1,1,1,1,1]
[null,null,null,null,null,null,null,null,null,null,null,null,null,null,null,null,null,null,null,null,null,null,null,null,null,null,null,null,null,null,null,null,null,null,null,null,null,null,null,null,null,null,null,null,null,null,null,null,null,null,"N/A","N/A","N/A","N/A","N/A","N/A","N/A","N/A","N/A","N/A",1,1,1,1,1,1,1,1,1,1]
[null,null,null,null,null,null,null,null,null,null,null,null,null,null,null,null,null,null,null,null,null,null,null,null,null,null,null,null,null,null,null,null,null,null,null,null,null,null,null,null,null,null,null,null,null,null,null,null,null,null,"N/A","N/A","N/A","N/A","N/A","N/A","N/A","N/A","N/A","N/A",1,1,1,1,1,1,1,1,1,1]
[null,null,null,null,null,null,null,null,null,null,null,null,null,null,null,null,null,null,null,null,null,null,null,null,null,null,null,null,null,null,null,null,null,null,null,null,null,null,null,null,null,null,null,null,null,null,null,null,null,null,"N/A","N/A","N/A","N/A","N/A","N/A","N/A","N/A","N/A","N/A",1,1,1,1,1,1,1,1,1,1]
[null,null,null,null,null,null,null,null,null,null,null,null,null,null,null,null,null,null,null,null,null,null,null,null,null,null,null,null,null,null,null,null,null,null,null,null,null,null,null,null,null,null,null,null,null,null,null,null,null,null,"N/A","N/A","N/A","N/A","N/A","N/A","N/A","N/A","N/A","N/A",1,1,1,1,1,1,1,1,1,1]
[null,null,null,null,null,null,null,null,null,null,null,null,null,null,null,null,null,null,null,null,null,null,null,null,null,null,null,null,null,null,null,null,null,null,null,null,null,null,null,null,null,null,null,null,null,null,null,null,null,null,"N/A","N/A","N/A","N/A","N/A","N/A","N/A","N/A","N/A","N/A",1,1,1,1,1,1,1,1,1,{"$f":"IF(BH441=\"N/A\",1,\"\")","v":1}]
[null,null,null,null,null,null,null,null,null,null,null,null,null,null,null,null,null,null,null,null,null,null,null,null,null,null,null,null,null,null,null,null,null,null,null,null,null,null,null,null,null,null,null,null,null,null,null,null,null,null,"N/A","N/A","N/A","N/A","N/A","N/A","N/A","N/A","N/A","N/A",{"$f":"IF(AY442=\"N/A\",1,\"\")","v":1},{"$f":"IF(AZ442=\"N/A\",1,\"\")","v":1},{"$f":"IF(BA442=\"N/A\",1,\"\")","v":1},{"$f":"IF(BB442=\"N/A\",1,\"\")","v":1},{"$f":"IF(BC442=\"N/A\",1,\"\")","v":1},{"$f":"IF(BD442=\"N/A\",1,\"\")","v":1},{"$f":"IF(BE442=\"N/A\",1,\"\")","v":1},1,1,1]
[null,null,null,null,null,null,null,null,null,null,null,null,null,null,null,null,null,null,null,null,null,null,null,null,null,null,null,null,null,null,null,null,null,null,null,null,null,null,null,null,null,null,null,null,null,null,null,null,null,null,"N/A","N/A","N/A","N/A","N/A","N/A","N/A","N/A","N/A","N/A",1,1,1,1,1,1,1,1,1,1]
[null,null,null,null,null,null,null,null,null,null,null,null,null,null,null,null,null,null,null,null,null,null,null,null,null,null,null,null,null,null,null,null,null,null,null,null,null,null,null,null,null,null,null,null,null,null,null,null,null,null,"N/A","N/A","N/A","N/A","N/A","N/A","N/A","N/A","N/A","N/A",1,1,1,1,1,1,1,1,1,1]
[null,null,null,null,null,null,null,null,null,null,null,null,null,null,null,null,null,null,null,null,null,null,null,null,null,null,null,null,null,null,null,null,null,null,null,null,null,null,null,null,null,null,null,null,null,null,null,null,null,null,"N/A","N/A","N/A","N/A","N/A","N/A","N/A","N/A","N/A","N/A",1,1,1,1,1,1,1,1,1,1]
[null,null,null,null,null,null,null,null,null,null,null,null,null,null,null,null,null,null,null,null,null,null,null,null,null,null,null,null,null,null,null,null,null,null,null,null,null,null,null,null,null,null,null,null,null,null,null,null,null,null,"N/A","N/A","N/A","N/A","N/A","N/A","N/A","N/A","N/A","N/A",1,1,1,1,1,1,1,1,1,1]
[null,null,null,null,null,null,null,null,null,null,null,null,null,null,null,null,null,null,null,null,null,null,null,null,null,null,null,null,null,null,null,null,null,null,null,null,null,null,null,null,null,null,null,null,null,null,null,null,null,null,"N/A","N/A","N/A","N/A","N/A","N/A","N/A","N/A","N/A","N/A",1,1,1,1,1,1,1,1,1,1]
[null,null,null,null,null,null,null,null,null,null,null,null,null,null,null,null,null,null,null,null,null,null,null,null,null,null,null,null,null,null,null,null,null,null,null,null,null,null,null,null,null,null,null,null,null,null,null,null,null,null,"N/A","N/A","N/A","N/A","N/A","N/A","N/A","N/A","N/A","N/A",1,1,1,1,1,1,1,1,1,1]
[null,null,null,null,null,null,null,null,null,null,null,null,null,null,null,null,null,null,null,null,null,null,null,null,null,null,null,null,null,null,null,null,null,null,null,null,null,null,null,null,null,null,null,null,null,null,null,null,null,null,"N/A","N/A","N/A","N/A","N/A","N/A","N/A","N/A","N/A","N/A",1,1,1,1,1,1,1,1,1,1]
[null,null,null,null,null,null,null,null,null,null,null,null,null,null,null,null,null,null,null,null,null,null,null,null,null,null,null,null,null,null,null,null,null,null,null,null,null,null,null,null,null,null,null,null,null,null,null,null,null,null,"N/A","N/A","N/A","N/A","N/A","N/A","N/A","N/A","N/A","N/A",1,1,1,1,1,1,1,1,1,1]
[null,null,null,null,null,null,null,null,null,null,null,null,null,null,null,null,null,null,null,null,null,null,null,null,null,null,null,null,null,null,null,null,null,null,null,null,null,null,null,null,null,null,null,null,null,null,null,null,null,null,"N/A","N/A","N/A","N/A","N/A","N/A","N/A","N/A","N/A","N/A",1,1,1,1,1,1,1,1,1,1]
[null,null,null,null,null,null,null,null,null,null,null,null,null,null,null,null,null,null,null,null,null,null,null,null,null,null,null,null,null,null,null,null,null,null,null,null,null,null,null,null,null,null,null,null,null,null,null,null,null,null,"N/A","N/A","N/A","N/A","N/A","N/A","N/A","N/A","N/A","N/A",1,1,1,1,1,1,1,1,1,1]
[null,null,null,null,null,null,null,null,null,null,null,null,null,null,null,null,null,null,null,null,null,null,null,null,null,null,null,null,null,null,null,null,null,null,null,null,null,null,null,null,null,null,null,null,null,null,null,null,null,null,"N/A","N/A","N/A","N/A","N/A","N/A","N/A","N/A","N/A","N/A",1,1,1,1,1,1,1,1,1,1]
[null,null,null,null,null,null,null,null,null,null,null,null,null,null,null,null,null,null,null,null,null,null,null,null,null,null,null,null,null,null,null,null,null,null,null,null,null,null,null,null,null,null,null,null,null,null,null,null,null,null,"N/A","N/A","N/A","N/A","N/A","N/A","N/A","N/A","N/A","N/A",1,1,1,1,1,1,1,1,1,1]
[null,null,null,null,null,null,null,null,null,null,null,null,null,null,null,null,null,null,null,null,null,null,null,null,null,null,null,null,null,null,null,null,null,null,null,null,null,null,null,null,null,null,null,null,null,null,null,null,null,null,"N/A","N/A","N/A","N/A","N/A","N/A","N/A","N/A","N/A","N/A",1,1,1,1,1,1,1,1,1,1]
[null,null,null,null,null,null,null,null,null,null,null,null,null,null,null,null,null,null,null,null,null,null,null,null,null,null,null,null,null,null,null,null,null,null,null,null,null,null,null,null,null,null,null,null,null,null,null,null,null,null,"N/A","N/A","N/A","N/A","N/A","N/A","N/A","N/A","N/A","N/A",1,1,1,1,1,1,1,1,1,1]
[null,null,null,null,null,null,null,null,null,null,null,null,null,null,null,null,null,null,null,null,null,null,null,null,null,null,null,null,null,null,null,null,null,null,null,null,null,null,null,null,null,null,null,null,null,null,null,null,null,null,"N/A","N/A","N/A","N/A","N/A","N/A","N/A","N/A","N/A","N/A",1,1,1,1,1,1,1,1,1,1]
[null,null,null,null,null,null,null,null,null,null,null,null,null,null,null,null,null,null,null,null,null,null,null,null,null,null,null,null,null,null,null,null,null,null,null,null,null,null,null,null,null,null,null,null,null,null,null,null,null,null,"N/A","N/A","N/A","N/A","N/A","N/A","N/A","N/A","N/A","N/A",1,1,1,1,1,1,1,1,1,1]
[null,null,null,null,null,null,null,null,null,null,null,null,null,null,null,null,null,null,null,null,null,null,null,null,null,null,null,null,null,null,null,null,null,null,null,null,null,null,null,null,null,null,null,null,null,null,null,null,null,null,"N/A","N/A","N/A","N/A","N/A","N/A","N/A","N/A","N/A","N/A",1,1,1,1,1,1,1,1,1,1]
[null,null,null,null,null,null,null,null,null,null,null,null,null,null,null,null,null,null,null,null,null,null,null,null,null,null,null,null,null,null,null,null,null,null,null,null,null,null,null,null,null,null,null,null,null,null,null,null,null,null,"N/A","N/A","N/A","N/A","N/A","N/A","N/A","N/A","N/A","N/A",1,1,1,1,1,1,1,1,1,1]
[null,null,null,null,null,null,null,null,null,null,null,null,null,null,null,null,null,null,null,null,null,null,null,null,null,null,null,null,null,null,null,null,null,null,null,null,null,null,null,null,null,null,null,null,null,null,null,null,null,null,"N/A","N/A","N/A","N/A","N/A","N/A","N/A","N/A","N/A","N/A",1,1,1,1,1,1,1,1,1,1]
[null,null,null,null,null,null,null,null,null,null,null,null,null,null,null,null,null,null,null,null,null,null,null,null,null,null,null,null,null,null,null,null,null,null,null,null,null,null,null,null,null,null,null,null,null,null,null,null,null,null,"N/A","N/A","N/A","N/A","N/A","N/A","N/A","N/A","N/A","N/A",1,1,1,1,1,1,1,1,1,1]
[null,null,null,null,null,null,null,null,null,null,null,null,null,null,null,null,null,null,null,null,null,null,null,null,null,null,null,null,null,null,null,null,null,null,null,null,null,null,null,null,null,null,null,null,null,null,null,null,null,null,"N/A","N/A","N/A","N/A","N/A","N/A","N/A","N/A","N/A","N/A",1,1,1,1,1,1,1,1,1,1]
[null,null,null,null,null,null,null,null,null,null,null,null,null,null,null,null,null,null,null,null,null,null,null,null,null,null,null,null,null,null,null,null,null,null,null,null,null,null,null,null,null,null,null,null,null,null,null,null,null,null,"N/A","N/A","N/A","N/A","N/A","N/A","N/A","N/A","N/A","N/A",1,1,1,1,1,1,1,{"$f":"IF(BF464=\"N/A\",1,\"\")","v":1},{"$f":"IF(BG464=\"N/A\",1,\"\")","v":1},1]
[null,null,null,null,null,null,null,null,null,null,null,null,null,null,null,null,null,null,null,null,null,null,null,null,null,null,null,null,null,null,null,null,null,null,null,null,null,null,null,null,null,null,null,null,null,null,null,null,null,null,"N/A","N/A","N/A","N/A","N/A","N/A","N/A","N/A","N/A","N/A",1,1,1,1,1,1,1,1,1,1]
[null,null,null,null,null,null,null,null,null,null,null,null,null,null,null,null,null,null,null,null,null,null,null,null,null,null,null,null,null,null,null,null,null,null,null,null,null,null,null,null,null,null,null,null,null,null,null,null,null,null,"N/A","N/A","N/A","N/A","N/A","N/A","N/A","N/A","N/A","N/A",1,1,1,1,1,1,1,1,1,1]
[null,null,null,null,null,null,null,null,null,null,null,null,null,null,null,null,null,null,null,null,null,null,null,null,null,null,null,null,null,null,null,null,null,null,null,null,null,null,null,null,null,null,null,null,null,null,null,null,null,null,"N/A","N/A","N/A","N/A","N/A","N/A","N/A","N/A","N/A","N/A",1,1,1,1,1,1,1,1,1,1]
[null,null,null,null,null,null,null,null,null,null,null,null,null,null,null,null,null,null,null,null,null,null,null,null,null,null,null,null,null,null,null,null,null,null,null,null,null,null,null,null,null,null,null,null,null,null,null,null,null,null,"N/A","N/A","N/A","N/A","N/A","N/A","N/A","N/A","N/A","N/A",1,1,1,1,1,1,1,1,1,1]
[null,null,null,null,null,null,null,null,null,null,null,null,null,null,null,null,null,null,null,null,null,null,null,null,null,null,null,null,null,null,null,null,null,null,null,null,null,null,null,null,null,null,null,null,null,null,null,null,null,null,"N/A","N/A","N/A","N/A","N/A","N/A","N/A","N/A","N/A","N/A",1,1,1,1,1,1,1,1,1,1]
[null,null,null,null,null,null,null,null,null,null,null,null,null,null,null,null,null,null,null,null,null,null,null,null,null,null,null,null,null,null,null,null,null,null,null,null,null,null,null,null,null,null,null,null,null,null,null,null,null,null,"N/A","N/A","N/A","N/A","N/A","N/A","N/A","N/A","N/A","N/A",1,1,1,1,1,1,1,1,1,1]
[null,null,null,null,null,null,null,null,null,null,null,null,null,null,null,null,null,null,null,null,null,null,null,null,null,null,null,null,null,null,null,null,null,null,null,null,null,null,null,null,null,null,null,null,null,null,null,null,null,null,"N/A","N/A","N/A","N/A","N/A","N/A","N/A","N/A","N/A","N/A",1,1,1,1,1,1,1,1,1,1]
[null,null,null,null,null,null,null,null,null,null,null,null,null,null,null,null,null,null,null,null,null,null,null,null,null,null,null,null,null,null,null,null,null,null,null,null,null,null,null,null,null,null,null,null,null,null,null,null,null,null,"N/A","N/A","N/A","N/A","N/A","N/A","N/A","N/A","N/A","N/A",1,1,1,1,1,1,1,1,1,1]
[null,null,null,null,null,null,null,null,null,null,null,null,null,null,null,null,null,null,null,null,null,null,null,null,null,null,null,null,null,null,null,null,null,null,null,null,null,null,null,null,null,null,null,null,null,null,null,null,null,null,"N/A","N/A","N/A","N/A","N/A","N/A","N/A","N/A","N/A","N/A",1,1,1,1,1,1,1,1,1,1]
[null,null,null,null,null,null,null,null,null,null,null,null,null,null,null,null,null,null,null,null,null,null,null,null,null,null,null,null,null,null,null,null,null,null,null,null,null,null,null,null,null,null,null,null,null,null,null,null,null,null,{"$f":"IF(COUNTA(E474:J474)>0,(COUNTIF(E474:J474,\"=0\")*0+COUNTIF(E474:J474,\"=1\")*100+COUNTIF(E474:J474,\"=2\")*80+COUNTIF(E474:J474,\"=3\")*50+COUNTIF(E474:J474,\"=8\")*20+COUNTIF(E474:J474,\"=9\")*0)/COUNTA(E474:J474)/100,\"N/A\")","v":"N/A"},"N/A",{"$f":"IF(COUNTA(P474:U474)>0,(COUNTIF(P474:U474,\"=0\")*0+COUNTIF(P474:U474,\"=1\")*100+COUNTIF(P474:U474,\"=2\")*80+COUNTIF(P474:U474,\"=3\")*50+COUNTIF(P474:U474,\"=8\")*20+COUNTIF(P474:U474,\"=9\")*0)/COUNTA(P474:U474)/100,\"N/A\")","v":"N/A"},{"$f":"IF(COUNTA(V474)<>0,(COUNTIF(V474,\"=0\")*0+COUNTIF(V474,\"=1\")*100+COUNTIF(V474,\"=2\")*80+COUNTIF(V474,\"=3\")*50+COUNTIF(V474,\"=8\")*20+COUNTIF(V474,\"=9\")*0)/COUNTA(V474)/100,\"N/A\")","v":"N/A"},{"$f":"IF(COUNTA(W474:X474)>0,(COUNTIF(W474:X474,\"=0\")*0+COUNTIF(W474:X474,\"=1\")*100+COUNTIF(W474:X474,\"=2\")*80+COUNTIF(W474:X474,\"=3\")*50+COUNTIF(W474:X474,\"=8\")*20+COUNTIF(W474:X474,\"=9\")*0)/COUNTA(W474:X474)/100,\"N/A\")","v":"N/A"},{"$f":"IF(COUNTA(Y474:AJ474)>0,(COUNTIF(Y474:AJ474,\"=0\")*0+COUNTIF(Y474:AJ474,\"=1\")*100+COUNTIF(Y474:AJ474,\"=2\")*80+COUNTIF(Y474:AJ474,\"=3\")*50+COUNTIF(Y474:AJ474,\"=8\")*20+COUNTIF(Y474:AJ474,\"=9\")*0)/COUNTA(Y474:AJ474)/100,\"N/A\")","v":"N/A"},{"$f":"IF(COUNTA(AK474:AP474)>0,(COUNTIF(AK474:AP474,\"=0\")*0+COUNTIF(AK474:AP474,\"=1\")*100+COUNTIF(AK474:AP474,\"=2\")*80+COUNTIF(AK474:AP474,\"=3\")*50+COUNTIF(AK474:AP474,\"=8\")*20+COUNTIF(AK474:AP474,\"=9\")*0)/COUNTA(AK474:AP474)/100,\"N/A\")","v":"N/A"},{"$f":"IF(COUNTA(AQ474:AU474)>0,(COUNTIF(AQ474:AU474,\"=0\")*0+COUNTIF(AQ474:AU474,\"=1\")*100+COUNTIF(AQ474:AU474,\"=2\")*80+COUNTIF(AQ474:AU474,\"=3\")*50+COUNTIF(AQ474:AU474,\"=8\")*20+COUNTIF(AQ474:AU474,\"=9\")*0)/COUNTA(AQ474:AU474)/100,\"N/A\")","v":"N/A"},{"$f":"IF(COUNTA(AV474:AX474)>0,(COUNTIF(AV474:AX474,\"=0\")*0+COUNTIF(AV474:AX474,\"=1\")*100+COUNTIF(AV474:AX474,\"=2\")*80+COUNTIF(AV474:AX474,\"=3\")*50+COUNTIF(AV474:AX474,\"=8\")*20+COUNTIF(AV474:AX474,\"=9\")*0)/COUNTA(AV474:AX474)/100,\"N/A\")","v":"N/A"},{"$f":"IF(AND(COUNTA(E474:AX474)<>0,B474<>\"\"),AVERAGE(BA474:BG474),\"N/A\")","v":"N/A"},1,1,1,1,1,1,1,1,1,1]
[null,null,null,null,null,null,null,null,null,null,null,null,null,null,null,null,null,null,null,null,null,null,null,null,null,null,null,null,null,null,null,null,null,null,null,null,null,null,null,null,null,null,null,null,null,null,null,null,null,null,"N/A","N/A","N/A","N/A","N/A","N/A","N/A","N/A","N/A","N/A",1,1,1,1,1,1,1,1,1,1]
[null,null,null,null,null,null,null,null,null,null,null,null,null,null,null,null,null,null,null,null,null,null,null,null,null,null,null,null,null,null,null,null,null,null,null,null,null,null,null,null,null,null,null,null,null,null,null,null,null,null,"N/A","N/A","N/A","N/A","N/A","N/A","N/A","N/A","N/A","N/A",1,1,1,1,1,1,1,1,1,1]
[null,null,null,null,null,null,null,null,null,null,null,null,null,null,null,null,null,null,null,null,null,null,null,null,null,null,null,null,null,null,null,null,null,null,null,null,null,null,null,null,null,null,null,null,null,null,null,null,null,null,"N/A","N/A","N/A","N/A","N/A","N/A","N/A","N/A","N/A","N/A",1,1,1,1,1,1,1,1,1,1]
[null,null,null,null,null,null,null,null,null,null,null,null,null,null,null,null,null,null,null,null,null,null,null,null,null,null,null,null,null,null,null,null,null,null,null,null,null,null,null,null,null,null,null,null,null,null,null,null,null,null,"N/A",{"$f":"IF(COUNTA(K478:O478)>0,(COUNTIF(K478:O478,\"=0\")*0+COUNTIF(K478:O478,\"=1\")*100+COUNTIF(K478:O478,\"=2\")*80+COUNTIF(K478:O478,\"=3\")*50+COUNTIF(K478:O478,\"=8\")*20+COUNTIF(K478:O478,\"=9\")*0)/COUNTA(K478:O478)/100,\"N/A\")","v":"N/A"},"N/A","N/A","N/A","N/A","N/A","N/A","N/A","N/A",1,1,1,1,1,1,1,1,1,1]
[null,null,null,null,null,null,null,null,null,null,null,null,null,null,null,null,null,null,null,null,null,null,null,null,null,null,null,null,null,null,null,null,null,null,null,null,null,null,null,null,null,null,null,null,null,null,null,null,null,null,"N/A","N/A","N/A","N/A","N/A","N/A","N/A","N/A","N/A","N/A",1,1,1,1,1,1,1,1,1,1]
[null,null,null,null,null,null,null,null,null,null,null,null,null,null,null,null,null,null,null,null,null,null,null,null,null,null,null,null,null,null,null,null,null,null,null,null,null,null,null,null,null,null,null,null,null,null,null,null,null,null,"N/A","N/A","N/A","N/A","N/A","N/A","N/A","N/A","N/A","N/A",1,1,1,1,1,1,1,1,1,1]
[null,null,null,null,null,null,null,null,null,null,null,null,null,null,null,null,null,null,null,null,null,null,null,null,null,null,null,null,null,null,null,null,null,null,null,null,null,null,null,null,null,null,null,null,null,null,null,null,null,null,"N/A","N/A","N/A","N/A","N/A","N/A","N/A","N/A","N/A","N/A",1,1,1,1,1,1,1,1,1,1]
[null,null,null,null,null,null,null,null,null,null,null,null,null,null,null,null,null,null,null,null,null,null,null,null,null,null,null,null,null,null,null,null,null,null,null,null,null,null,null,null,null,null,null,null,null,null,null,null,null,null,"N/A","N/A","N/A","N/A","N/A","N/A","N/A","N/A","N/A","N/A",1,1,1,1,1,1,1,1,1,1]
[null,null,null,null,null,null,null,null,null,null,null,null,null,null,null,null,null,null,null,null,null,null,null,null,null,null,null,null,null,null,null,null,null,null,null,null,null,null,null,null,null,null,null,null,null,null,null,null,null,null,"N/A","N/A","N/A","N/A","N/A","N/A","N/A","N/A","N/A","N/A",1,1,1,1,1,1,1,1,1,1]
[null,null,null,null,null,null,null,null,null,null,null,null,null,null,null,null,null,null,null,null,null,null,null,null,null,null,null,null,null,null,null,null,null,null,null,null,null,null,null,null,null,null,null,null,null,null,null,null,null,null,"N/A","N/A","N/A","N/A","N/A","N/A","N/A","N/A","N/A","N/A",1,1,1,1,1,1,1,1,1,1]
[null,null,null,null,null,null,null,null,null,null,null,null,null,null,null,null,null,null,null,null,null,null,null,null,null,null,null,null,null,null,null,null,null,null,null,null,null,null,null,null,null,null,null,null,null,null,null,null,null,null,"N/A","N/A","N/A","N/A","N/A","N/A","N/A","N/A","N/A","N/A",1,1,1,1,1,1,1,1,1,1]
[null,null,null,null,null,null,null,null,null,null,null,null,null,null,null,null,null,null,null,null,null,null,null,null,null,null,null,null,null,null,null,null,null,null,null,null,null,null,null,null,null,null,null,null,null,null,null,null,null,null,"N/A","N/A","N/A","N/A","N/A","N/A","N/A","N/A","N/A","N/A",1,1,1,1,1,1,1,1,1,1]
[null,null,null,null,null,null,null,null,null,null,null,null,null,null,null,null,null,null,null,null,null,null,null,null,null,null,null,null,null,null,null,null,null,null,null,null,null,null,null,null,null,null,null,null,null,null,null,null,null,null,"N/A","N/A","N/A","N/A","N/A","N/A","N/A","N/A","N/A","N/A",1,1,1,1,1,1,1,1,1,1]
[null,null,null,null,null,null,null,null,null,null,null,null,null,null,null,null,null,null,null,null,null,null,null,null,null,null,null,null,null,null,null,null,null,null,null,null,null,null,null,null,null,null,null,null,null,null,null,null,null,null,"N/A","N/A","N/A","N/A","N/A","N/A","N/A","N/A","N/A","N/A",1,1,1,1,1,1,1,1,1,1]
[null,null,null,null,null,null,null,null,null,null,null,null,null,null,null,null,null,null,null,null,null,null,null,null,null,null,null,null,null,null,null,null,null,null,null,null,null,null,null,null,null,null,null,null,null,null,null,null,null,null,"N/A","N/A","N/A","N/A","N/A","N/A","N/A","N/A","N/A","N/A",1,1,1,1,1,1,1,1,1,1]
[null,null,null,null,null,null,null,null,null,null,null,null,null,null,null,null,null,null,null,null,null,null,null,null,null,null,null,null,null,null,null,null,null,null,null,null,null,null,null,null,null,null,null,null,null,null,null,null,null,null,"N/A","N/A","N/A","N/A","N/A","N/A","N/A","N/A","N/A","N/A",1,1,1,1,1,1,1,1,1,1]
[null,null,null,null,null,null,null,null,null,null,null,null,null,null,null,null,null,null,null,null,null,null,null,null,null,null,null,null,null,null,null,null,null,null,null,null,null,null,null,null,null,null,null,null,null,null,null,null,null,null,"N/A","N/A","N/A","N/A","N/A","N/A","N/A","N/A","N/A","N/A",1,1,1,1,1,1,1,1,1,1]
[null,null,null,null,null,null,null,null,null,null,null,null,null,null,null,null,null,null,null,null,null,null,null,null,null,null,null,null,null,null,null,null,null,null,null,null,null,null,null,null,null,null,null,null,null,null,null,null,null,null,"N/A","N/A","N/A","N/A","N/A","N/A","N/A","N/A","N/A","N/A",1,1,1,1,1,1,1,1,1,1]
[null,null,null,null,null,null,null,null,null,null,null,null,null,null,null,null,null,null,null,null,null,null,null,null,null,null,null,null,null,null,null,null,null,null,null,null,null,null,null,null,null,null,null,null,null,null,null,null,null,null,"N/A","N/A","N/A","N/A","N/A","N/A","N/A","N/A","N/A","N/A",1,1,1,1,1,1,1,1,1,1]
[null,null,null,null,null,null,null,null,null,null,null,null,null,null,null,null,null,null,null,null,null,null,null,null,null,null,null,null,null,null,null,null,null,null,null,null,null,null,null,null,null,null,null,null,null,null,null,null,null,null,"N/A","N/A","N/A","N/A","N/A","N/A","N/A","N/A","N/A","N/A",1,1,1,1,1,1,1,1,1,1]
[null,null,null,null,null,null,null,null,null,null,null,null,null,null,null,null,null,null,null,null,null,null,null,null,null,null,null,null,null,null,null,null,null,null,null,null,null,null,null,null,null,null,null,null,null,null,null,null,null,null,"N/A","N/A","N/A","N/A","N/A","N/A","N/A","N/A","N/A","N/A",1,1,1,1,1,1,1,1,1,1]
[null,null,null,null,null,null,null,null,null,null,null,null,null,null,null,null,null,null,null,null,null,null,null,null,null,null,null,null,null,null,null,null,null,null,null,null,null,null,null,null,null,null,null,null,null,null,null,null,null,null,"N/A","N/A","N/A","N/A","N/A","N/A","N/A","N/A","N/A","N/A",1,1,1,1,1,1,1,1,1,1]
[null,null,null,null,null,null,null,null,null,null,null,null,null,null,null,null,null,null,null,null,null,null,null,null,null,null,null,null,null,null,null,null,null,null,null,null,null,null,null,null,null,null,null,null,null,null,null,null,null,null,"N/A","N/A","N/A","N/A","N/A","N/A","N/A","N/A","N/A","N/A",1,1,1,1,1,1,1,1,1,1]
[null,null,null,null,null,null,null,null,null,null,null,null,null,null,null,null,null,null,null,null,null,null,null,null,null,null,null,null,null,null,null,null,null,null,null,null,null,null,null,null,null,null,null,null,null,null,null,null,null,null,"N/A","N/A","N/A","N/A","N/A","N/A","N/A","N/A","N/A","N/A",1,1,1,1,1,1,1,1,1,1]
[null,null,null,null,null,null,null,null,null,null,null,null,null,null,null,null,null,null,null,null,null,null,null,null,null,null,null,null,null,null,null,null,null,null,null,null,null,null,null,null,null,null,null,null,null,null,null,null,null,null,"N/A","N/A","N/A","N/A","N/A","N/A","N/A","N/A","N/A","N/A",1,1,1,1,1,1,1,1,1,1]
[null,null,null,null,null,null,null,null,null,null,null,null,null,null,null,null,null,null,null,null,null,null,null,null,null,null,null,null,null,null,null,null,null,null,null,null,null,null,null,null,null,null,null,null,null,null,null,null,null,null,"N/A","N/A","N/A","N/A","N/A","N/A","N/A","N/A","N/A","N/A",1,1,1,1,1,1,1,1,1,1]
[null,null,null,null,null,null,null,null,null,null,null,null,null,null,null,null,null,null,null,null,null,null,null,null,null,null,null,null,null,null,null,null,null,null,null,null,null,null,null,null,null,null,null,null,null,null,null,null,null,null,"N/A","N/A","N/A","N/A","N/A","N/A","N/A","N/A","N/A","N/A",1,1,1,1,1,1,1,1,1,1]
[null,null,null,null,null,null,null,null,null,null,null,null,null,null,null,null,null,null,null,null,null,null,null,null,null,null,null,null,null,null,null,null,null,null,null,null,null,null,null,null,null,null,null,null,null,null,null,null,null,null,"N/A","N/A","N/A","N/A","N/A","N/A","N/A","N/A","N/A","N/A",1,1,1,1,1,1,1,1,1,1]
[null,null,null,null,null,null,null,null,null,null,null,null,null,null,null,null,null,null,null,null,null,null,null,null,null,null,null,null,null,null,null,null,null,null,null,null,null,null,null,null,null,null,null,null,null,null,null,null,null,null,"N/A","N/A","N/A","N/A","N/A","N/A","N/A","N/A","N/A","N/A",1,1,1,1,1,1,1,1,1,1]
[null,null,null,null,null,null,null,null,null,null,null,null,null,null,null,null,null,null,null,null,null,null,null,null,null,null,null,null,null,null,null,null,null,null,null,null,null,null,null,null,null,null,null,null,null,null,null,null,null,null,"N/A","N/A","N/A","N/A","N/A","N/A","N/A","N/A","N/A","N/A",1,1,1,1,1,1,1,1,1,1]
[null,null,null,null,null,null,null,null,null,null,null,null,null,null,null,null,null,null,null,null,null,null,null,null,null,null,null,null,null,null,null,null,null,null,null,null,null,null,null,null,null,null,null,null,null,null,null,null,null,null,"N/A","N/A","N/A","N/A","N/A","N/A","N/A","N/A","N/A","N/A",1,1,1,1,1,1,1,1,1,{"$f":"IF(BH505=\"N/A\",1,\"\")","v":1}]
[null,null,null,null,null,null,null,null,null,null,null,null,null,null,null,null,null,null,null,null,null,null,null,null,null,null,null,null,null,null,null,null,null,null,null,null,null,null,null,null,null,null,null,null,null,null,null,null,null,null,"N/A","N/A","N/A","N/A","N/A","N/A","N/A","N/A","N/A","N/A",{"$f":"IF(AY506=\"N/A\",1,\"\")","v":1},{"$f":"IF(AZ506=\"N/A\",1,\"\")","v":1},{"$f":"IF(BA506=\"N/A\",1,\"\")","v":1},{"$f":"IF(BB506=\"N/A\",1,\"\")","v":1},{"$f":"IF(BC506=\"N/A\",1,\"\")","v":1},{"$f":"IF(BD506=\"N/A\",1,\"\")","v":1},{"$f":"IF(BE506=\"N/A\",1,\"\")","v":1},1,1,1]
[null,null,null,null,null,null,null,null,null,null,null,null,null,null,null,null,null,null,null,null,null,null,null,null,null,null,null,null,null,null,null,null,null,null,null,null,null,null,null,null,null,null,null,null,null,null,null,null,null,null,"N/A","N/A","N/A","N/A","N/A","N/A","N/A","N/A","N/A","N/A",1,1,1,1,1,1,1,1,1,1]
[null,null,null,null,null,null,null,null,null,null,null,null,null,null,null,null,null,null,null,null,null,null,null,null,null,null,null,null,null,null,null,null,null,null,null,null,null,null,null,null,null,null,null,null,null,null,null,null,null,null,"N/A","N/A","N/A","N/A","N/A","N/A","N/A","N/A","N/A","N/A",1,1,1,1,1,1,1,1,1,1]
[null,null,null,null,null,null,null,null,null,null,null,null,null,null,null,null,null,null,null,null,null,null,null,null,null,null,null,null,null,null,null,null,null,null,null,null,null,null,null,null,null,null,null,null,null,null,null,null,null,null,"N/A","N/A","N/A","N/A","N/A","N/A","N/A","N/A","N/A","N/A",1,1,1,1,1,1,1,1,1,1]
[null,null,null,null,null,null,null,null,null,null,null,null,null,null,null,null,null,null,null,null,null,null,null,null,null,null,null,null,null,null,null,null,null,null,null,null,null,null,null,null,null,null,null,null,null,null,null,null,null,null,"N/A","N/A","N/A","N/A","N/A","N/A","N/A","N/A","N/A","N/A",1,1,1,1,1,1,1,1,1,1]
[null,null,null,null,null,null,null,null,null,null,null,null,null,null,null,null,null,null,null,null,null,null,null,null,null,null,null,null,null,null,null,null,null,null,null,null,null,null,null,null,null,null,null,null,null,null,null,null,null,null,"N/A","N/A","N/A","N/A","N/A","N/A","N/A","N/A","N/A","N/A",1,1,1,1,1,1,1,1,1,1]
[null,null,null,null,null,null,null,null,null,null,null,null,null,null,null,null,null,null,null,null,null,null,null,null,null,null,null,null,null,null,null,null,null,null,null,null,null,null,null,null,null,null,null,null,null,null,null,null,null,null,"N/A","N/A","N/A","N/A","N/A","N/A","N/A","N/A","N/A","N/A",1,1,1,1,1,1,1,1,1,1]
[null,null,null,null,null,null,null,null,null,null,null,null,null,null,null,null,null,null,null,null,null,null,null,null,null,null,null,null,null,null,null,null,null,null,null,null,null,null,null,null,null,null,null,null,null,null,null,null,null,null,"N/A","N/A","N/A","N/A","N/A","N/A","N/A","N/A","N/A","N/A",1,1,1,1,1,1,1,1,1,1]
[null,null,null,null,null,null,null,null,null,null,null,null,null,null,null,null,null,null,null,null,null,null,null,null,null,null,null,null,null,null,null,null,null,null,null,null,null,null,null,null,null,null,null,null,null,null,null,null,null,null,"N/A","N/A","N/A","N/A","N/A","N/A","N/A","N/A","N/A","N/A",1,1,1,1,1,1,1,1,1,1]
[null,null,null,null,null,null,null,null,null,null,null,null,null,null,null,null,null,null,null,null,null,null,null,null,null,null,null,null,null,null,null,null,null,null,null,null,null,null,null,null,null,null,null,null,null,null,null,null,null,null,"N/A","N/A","N/A","N/A","N/A","N/A","N/A","N/A","N/A","N/A",1,1,1,1,1,1,1,1,1,1]
[null,null,null,null,null,null,null,null,null,null,null,null,null,null,null,null,null,null,null,null,null,null,null,null,null,null,null,null,null,null,null,null,null,null,null,null,null,null,null,null,null,null,null,null,null,null,null,null,null,null,"N/A","N/A","N/A","N/A","N/A","N/A","N/A","N/A","N/A","N/A",1,1,1,1,1,1,1,1,1,1]
[null,null,null,null,null,null,null,null,null,null,null,null,null,null,null,null,null,null,null,null,null,null,null,null,null,null,null,null,null,null,null,null,null,null,null,null,null,null,null,null,null,null,null,null,null,null,null,null,null,null,"N/A","N/A","N/A","N/A","N/A","N/A","N/A","N/A","N/A","N/A",1,1,1,1,1,1,1,1,1,1]
[null,null,null,null,null,null,null,null,null,null,null,null,null,null,null,null,null,null,null,null,null,null,null,null,null,null,null,null,null,null,null,null,null,null,null,null,null,null,null,null,null,null,null,null,null,null,null,null,null,null,"N/A","N/A","N/A","N/A","N/A","N/A","N/A","N/A","N/A","N/A",1,1,1,1,1,1,1,1,1,1]
[null,null,null,null,null,null,null,null,null,null,null,null,null,null,null,null,null,null,null,null,null,null,null,null,null,null,null,null,null,null,null,null,null,null,null,null,null,null,null,null,null,null,null,null,null,null,null,null,null,null,"N/A","N/A","N/A","N/A","N/A","N/A","N/A","N/A","N/A","N/A",1,1,1,1,1,1,1,1,1,1]
[null,null,null,null,null,null,null,null,null,null,null,null,null,null,null,null,null,null,null,null,null,null,null,null,null,null,null,null,null,null,null,null,null,null,null,null,null,null,null,null,null,null,null,null,null,null,null,null,null,null,"N/A","N/A","N/A","N/A","N/A","N/A","N/A","N/A","N/A","N/A",1,1,1,1,1,1,1,1,1,1]
[null,null,null,null,null,null,null,null,null,null,null,null,null,null,null,null,null,null,null,null,null,null,null,null,null,null,null,null,null,null,null,null,null,null,null,null,null,null,null,null,null,null,null,null,null,null,null,null,null,null,"N/A","N/A","N/A","N/A","N/A","N/A","N/A","N/A","N/A","N/A",1,1,1,1,1,1,1,1,1,1]
[null,null,null,null,null,null,null,null,null,null,null,null,null,null,null,null,null,null,null,null,null,null,null,null,null,null,null,null,null,null,null,null,null,null,null,null,null,null,null,null,null,null,null,null,null,null,null,null,null,null,"N/A","N/A","N/A","N/A","N/A","N/A","N/A","N/A","N/A","N/A",1,1,1,1,1,1,1,1,1,1]
[null,null,null,null,null,null,null,null,null,null,null,null,null,null,null,null,null,null,null,null,null,null,null,null,null,null,null,null,null,null,null,null,null,null,null,null,null,null,null,null,null,null,null,null,null,null,null,null,null,null,"N/A","N/A","N/A","N/A","N/A","N/A","N/A","N/A","N/A","N/A",1,1,1,1,1,1,1,1,1,1]
[null,null,null,null,null,null,null,null,null,null,null,null,null,null,null,null,null,null,null,null,null,null,null,null,null,null,null,null,null,null,null,null,null,null,null,null,null,null,null,null,null,null,null,null,null,null,null,null,null,null,"N/A","N/A","N/A","N/A","N/A","N/A","N/A","N/A","N/A","N/A",1,1,1,1,1,1,1,1,1,1]
[null,null,null,null,null,null,null,null,null,null,null,null,null,null,null,null,null,null,null,null,null,null,null,null,null,null,null,null,null,null,null,null,null,null,null,null,null,null,null,null,null,null,null,null,null,null,null,null,null,null,"N/A","N/A","N/A","N/A","N/A","N/A","N/A","N/A","N/A","N/A",1,1,1,1,1,1,1,1,1,1]
[null,null,null,null,null,null,null,null,null,null,null,null,null,null,null,null,null,null,null,null,null,null,null,null,null,null,null,null,null,null,null,null,null,null,null,null,null,null,null,null,null,null,null,null,null,null,null,null,null,null,"N/A","N/A","N/A","N/A","N/A","N/A","N/A","N/A","N/A","N/A",1,1,1,1,1,1,1,1,1,1]
[null,null,null,null,null,null,null,null,null,null,null,null,null,null,null,null,null,null,null,null,null,null,null,null,null,null,null,null,null,null,null,null,null,null,null,null,null,null,null,null,null,null,null,null,null,null,null,null,null,null,"N/A","N/A","N/A","N/A","N/A","N/A","N/A","N/A","N/A","N/A",1,1,1,1,1,1,1,1,1,1]
[null,null,null,null,null,null,null,null,null,null,null,null,null,null,null,null,null,null,null,null,null,null,null,null,null,null,null,null,null,null,null,null,null,null,null,null,null,null,null,null,null,null,null,null,null,null,null,null,null,null,"N/A","N/A","N/A","N/A","N/A","N/A","N/A","N/A","N/A","N/A",1,1,1,1,1,1,1,{"$f":"IF(BF528=\"N/A\",1,\"\")","v":1},{"$f":"IF(BG528=\"N/A\",1,\"\")","v":1},1]
[null,null,null,null,null,null,null,null,null,null,null,null,null,null,null,null,null,null,null,null,null,null,null,null,null,null,null,null,null,null,null,null,null,null,null,null,null,null,null,null,null,null,null,null,null,null,null,null,null,null,"N/A","N/A","N/A","N/A","N/A","N/A","N/A","N/A","N/A","N/A",1,1,1,1,1,1,1,1,1,1]
[null,null,null,null,null,null,null,null,null,null,null,null,null,null,null,null,null,null,null,null,null,null,null,null,null,null,null,null,null,null,null,null,null,null,null,null,null,null,null,null,null,null,null,null,null,null,null,null,null,null,"N/A","N/A","N/A","N/A","N/A","N/A","N/A","N/A","N/A","N/A",1,1,1,1,1,1,1,1,1,1]
[null,null,null,null,null,null,null,null,null,null,null,null,null,null,null,null,null,null,null,null,null,null,null,null,null,null,null,null,null,null,null,null,null,null,null,null,null,null,null,null,null,null,null,null,null,null,null,null,null,null,"N/A","N/A","N/A","N/A","N/A","N/A","N/A","N/A","N/A","N/A",1,1,1,1,1,1,1,1,1,1]
[null,null,null,null,null,null,null,null,null,null,null,null,null,null,null,null,null,null,null,null,null,null,null,null,null,null,null,null,null,null,null,null,null,null,null,null,null,null,null,null,null,null,null,null,null,null,null,null,null,null,"N/A","N/A","N/A","N/A","N/A","N/A","N/A","N/A","N/A","N/A",1,1,1,1,1,1,1,1,1,1]
[null,null,null,null,null,null,null,null,null,null,null,null,null,null,null,null,null,null,null,null,null,null,null,null,null,null,null,null,null,null,null,null,null,null,null,null,null,null,null,null,null,null,null,null,null,null,null,null,null,null,"N/A","N/A","N/A","N/A","N/A","N/A","N/A","N/A","N/A","N/A",1,1,1,1,1,1,1,1,1,1]
[null,null,null,null,null,null,null,null,null,null,null,null,null,null,null,null,null,null,null,null,null,null,null,null,null,null,null,null,null,null,null,null,null,null,null,null,null,null,null,null,null,null,null,null,null,null,null,null,null,null,"N/A","N/A","N/A","N/A","N/A","N/A","N/A","N/A","N/A","N/A",1,1,1,1,1,1,1,1,1,1]
[null,null,null,null,null,null,null,null,null,null,null,null,null,null,null,null,null,null,null,null,null,null,null,null,null,null,null,null,null,null,null,null,null,null,null,null,null,null,null,null,null,null,null,null,null,null,null,null,null,null,"N/A","N/A","N/A","N/A","N/A","N/A","N/A","N/A","N/A","N/A",1,1,1,1,1,1,1,1,1,1]
[null,null,null,null,null,null,null,null,null,null,null,null,null,null,null,null,null,null,null,null,null,null,null,null,null,null,null,null,null,null,null,null,null,null,null,null,null,null,null,null,null,null,null,null,null,null,null,null,null,null,"N/A","N/A","N/A","N/A","N/A","N/A","N/A","N/A","N/A","N/A",1,1,1,1,1,1,1,1,1,1]
[null,null,null,null,null,null,null,null,null,null,null,null,null,null,null,null,null,null,null,null,null,null,null,null,null,null,null,null,null,null,null,null,null,null,null,null,null,null,null,null,null,null,null,null,null,null,null,null,null,null,"N/A","N/A","N/A","N/A","N/A","N/A","N/A","N/A","N/A","N/A",1,1,1,1,1,1,1,1,1,1]
[null,null,null,null,null,null,null,null,null,null,null,null,null,null,null,null,null,null,null,null,null,null,null,null,null,null,null,null,null,null,null,null,null,null,null,null,null,null,null,null,null,null,null,null,null,null,null,null,null,null,{"$f":"IF(COUNTA(E538:J538)>0,(COUNTIF(E538:J538,\"=0\")*0+COUNTIF(E538:J538,\"=1\")*100+COUNTIF(E538:J538,\"=2\")*80+COUNTIF(E538:J538,\"=3\")*50+COUNTIF(E538:J538,\"=8\")*20+COUNTIF(E538:J538,\"=9\")*0)/COUNTA(E538:J538)/100,\"N/A\")","v":"N/A"},"N/A",{"$f":"IF(COUNTA(P538:U538)>0,(COUNTIF(P538:U538,\"=0\")*0+COUNTIF(P538:U538,\"=1\")*100+COUNTIF(P538:U538,\"=2\")*80+COUNTIF(P538:U538,\"=3\")*50+COUNTIF(P538:U538,\"=8\")*20+COUNTIF(P538:U538,\"=9\")*0)/COUNTA(P538:U538)/100,\"N/A\")","v":"N/A"},{"$f":"IF(COUNTA(V538)<>0,(COUNTIF(V538,\"=0\")*0+COUNTIF(V538,\"=1\")*100+COUNTIF(V538,\"=2\")*80+COUNTIF(V538,\"=3\")*50+COUNTIF(V538,\"=8\")*20+COUNTIF(V538,\"=9\")*0)/COUNTA(V538)/100,\"N/A\")","v":"N/A"},{"$f":"IF(COUNTA(W538:X538)>0,(COUNTIF(W538:X538,\"=0\")*0+COUNTIF(W538:X538,\"=1\")*100+COUNTIF(W538:X538,\"=2\")*80+COUNTIF(W538:X538,\"=3\")*50+COUNTIF(W538:X538,\"=8\")*20+COUNTIF(W538:X538,\"=9\")*0)/COUNTA(W538:X538)/100,\"N/A\")","v":"N/A"},{"$f":"IF(COUNTA(Y538:AJ538)>0,(COUNTIF(Y538:AJ538,\"=0\")*0+COUNTIF(Y538:AJ538,\"=1\")*100+COUNTIF(Y538:AJ538,\"=2\")*80+COUNTIF(Y538:AJ538,\"=3\")*50+COUNTIF(Y538:AJ538,\"=8\")*20+COUNTIF(Y538:AJ538,\"=9\")*0)/COUNTA(Y538:AJ538)/100,\"N/A\")","v":"N/A"},{"$f":"IF(COUNTA(AK538:AP538)>0,(COUNTIF(AK538:AP538,\"=0\")*0+COUNTIF(AK538:AP538,\"=1\")*100+COUNTIF(AK538:AP538,\"=2\")*80+COUNTIF(AK538:AP538,\"=3\")*50+COUNTIF(AK538:AP538,\"=8\")*20+COUNTIF(AK538:AP538,\"=9\")*0)/COUNTA(AK538:AP538)/100,\"N/A\")","v":"N/A"},{"$f":"IF(COUNTA(AQ538:AU538)>0,(COUNTIF(AQ538:AU538,\"=0\")*0+COUNTIF(AQ538:AU538,\"=1\")*100+COUNTIF(AQ538:AU538,\"=2\")*80+COUNTIF(AQ538:AU538,\"=3\")*50+COUNTIF(AQ538:AU538,\"=8\")*20+COUNTIF(AQ538:AU538,\"=9\")*0)/COUNTA(AQ538:AU538)/100,\"N/A\")","v":"N/A"},{"$f":"IF(COUNTA(AV538:AX538)>0,(COUNTIF(AV538:AX538,\"=0\")*0+COUNTIF(AV538:AX538,\"=1\")*100+COUNTIF(AV538:AX538,\"=2\")*80+COUNTIF(AV538:AX538,\"=3\")*50+COUNTIF(AV538:AX538,\"=8\")*20+COUNTIF(AV538:AX538,\"=9\")*0)/COUNTA(AV538:AX538)/100,\"N/A\")","v":"N/A"},{"$f":"IF(AND(COUNTA(E538:AX538)<>0,B538<>\"\"),AVERAGE(BA538:BG538),\"N/A\")","v":"N/A"},1,1,1,1,1,1,1,1,1,1]
[null,null,null,null,null,null,null,null,null,null,null,null,null,null,null,null,null,null,null,null,null,null,null,null,null,null,null,null,null,null,null,null,null,null,null,null,null,null,null,null,null,null,null,null,null,null,null,null,null,null,"N/A","N/A","N/A","N/A","N/A","N/A","N/A","N/A","N/A","N/A",1,1,1,1,1,1,1,1,1,1]
[null,null,null,null,null,null,null,null,null,null,null,null,null,null,null,null,null,null,null,null,null,null,null,null,null,null,null,null,null,null,null,null,null,null,null,null,null,null,null,null,null,null,null,null,null,null,null,null,null,null,"N/A","N/A","N/A","N/A","N/A","N/A","N/A","N/A","N/A","N/A",1,1,1,1,1,1,1,1,1,1]
[null,null,null,null,null,null,null,null,null,null,null,null,null,null,null,null,null,null,null,null,null,null,null,null,null,null,null,null,null,null,null,null,null,null,null,null,null,null,null,null,null,null,null,null,null,null,null,null,null,null,"N/A","N/A","N/A","N/A","N/A","N/A","N/A","N/A","N/A","N/A",1,1,1,1,1,1,1,1,1,1]
[null,null,null,null,null,null,null,null,null,null,null,null,null,null,null,null,null,null,null,null,null,null,null,null,null,null,null,null,null,null,null,null,null,null,null,null,null,null,null,null,null,null,null,null,null,null,null,null,null,null,"N/A",{"$f":"IF(COUNTA(K542:O542)>0,(COUNTIF(K542:O542,\"=0\")*0+COUNTIF(K542:O542,\"=1\")*100+COUNTIF(K542:O542,\"=2\")*80+COUNTIF(K542:O542,\"=3\")*50+COUNTIF(K542:O542,\"=8\")*20+COUNTIF(K542:O542,\"=9\")*0)/COUNTA(K542:O542)/100,\"N/A\")","v":"N/A"},"N/A","N/A","N/A","N/A","N/A","N/A","N/A","N/A",1,1,1,1,1,1,1,1,1,1]
[null,null,null,null,null,null,null,null,null,null,null,null,null,null,null,null,null,null,null,null,null,null,null,null,null,null,null,null,null,null,null,null,null,null,null,null,null,null,null,null,null,null,null,null,null,null,null,null,null,null,"N/A","N/A","N/A","N/A","N/A","N/A","N/A","N/A","N/A","N/A",1,1,1,1,1,1,1,1,1,1]
[null,null,null,null,null,null,null,null,null,null,null,null,null,null,null,null,null,null,null,null,null,null,null,null,null,null,null,null,null,null,null,null,null,null,null,null,null,null,null,null,null,null,null,null,null,null,null,null,null,null,"N/A","N/A","N/A","N/A","N/A","N/A","N/A","N/A","N/A","N/A",1,1,1,1,1,1,1,1,1,1]
[null,null,null,null,null,null,null,null,null,null,null,null,null,null,null,null,null,null,null,null,null,null,null,null,null,null,null,null,null,null,null,null,null,null,null,null,null,null,null,null,null,null,null,null,null,null,null,null,null,null,"N/A","N/A","N/A","N/A","N/A","N/A","N/A","N/A","N/A","N/A",1,1,1,1,1,1,1,1,1,1]
[null,null,null,null,null,null,null,null,null,null,null,null,null,null,null,null,null,null,null,null,null,null,null,null,null,null,null,null,null,null,null,null,null,null,null,null,null,null,null,null,null,null,null,null,null,null,null,null,null,null,"N/A","N/A","N/A","N/A","N/A","N/A","N/A","N/A","N/A","N/A",1,1,1,1,1,1,1,1,1,1]
[null,null,null,null,null,null,null,null,null,null,null,null,null,null,null,null,null,null,null,null,null,null,null,null,null,null,null,null,null,null,null,null,null,null,null,null,null,null,null,null,null,null,null,null,null,null,null,null,null,null,"N/A","N/A","N/A","N/A","N/A","N/A","N/A","N/A","N/A","N/A",1,1,1,1,1,1,1,1,1,1]
[null,null,null,null,null,null,null,null,null,null,null,null,null,null,null,null,null,null,null,null,null,null,null,null,null,null,null,null,null,null,null,null,null,null,null,null,null,null,null,null,null,null,null,null,null,null,null,null,null,null,"N/A","N/A","N/A","N/A","N/A","N/A","N/A","N/A","N/A","N/A",1,1,1,1,1,1,1,1,1,1]
[null,null,null,null,null,null,null,null,null,null,null,null,null,null,null,null,null,null,null,null,null,null,null,null,null,null,null,null,null,null,null,null,null,null,null,null,null,null,null,null,null,null,null,null,null,null,null,null,null,null,"N/A","N/A","N/A","N/A","N/A","N/A","N/A","N/A","N/A","N/A",1,1,1,1,1,1,1,1,1,1]
[null,null,null,null,null,null,null,null,null,null,null,null,null,null,null,null,null,null,null,null,null,null,null,null,null,null,null,null,null,null,null,null,null,null,null,null,null,null,null,null,null,null,null,null,null,null,null,null,null,null,"N/A","N/A","N/A","N/A","N/A","N/A","N/A","N/A","N/A","N/A",1,1,1,1,1,1,1,1,1,1]
[null,null,null,null,null,null,null,null,null,null,null,null,null,null,null,null,null,null,null,null,null,null,null,null,null,null,null,null,null,null,null,null,null,null,null,null,null,null,null,null,null,null,null,null,null,null,null,null,null,null,"N/A","N/A","N/A","N/A","N/A","N/A","N/A","N/A","N/A","N/A",1,1,1,1,1,1,1,1,1,1]
[null,null,null,null,null,null,null,null,null,null,null,null,null,null,null,null,null,null,null,null,null,null,null,null,null,null,null,null,null,null,null,null,null,null,null,null,null,null,null,null,null,null,null,null,null,null,null,null,null,null,"N/A","N/A","N/A","N/A","N/A","N/A","N/A","N/A","N/A","N/A",1,1,1,1,1,1,1,1,1,1]
[null,null,null,null,null,null,null,null,null,null,null,null,null,null,null,null,null,null,null,null,null,null,null,null,null,null,null,null,null,null,null,null,null,null,null,null,null,null,null,null,null,null,null,null,null,null,null,null,null,null,"N/A","N/A","N/A","N/A","N/A","N/A","N/A","N/A","N/A","N/A",1,1,1,1,1,1,1,1,1,1]
[null,null,null,null,null,null,null,null,null,null,null,null,null,null,null,null,null,null,null,null,null,null,null,null,null,null,null,null,null,null,null,null,null,null,null,null,null,null,null,null,null,null,null,null,null,null,null,null,null,null,"N/A","N/A","N/A","N/A","N/A","N/A","N/A","N/A","N/A","N/A",1,1,1,1,1,1,1,1,1,1]
[null,null,null,null,null,null,null,null,null,null,null,null,null,null,null,null,null,null,null,null,null,null,null,null,null,null,null,null,null,null,null,null,null,null,null,null,null,null,null,null,null,null,null,null,null,null,null,null,null,null,"N/A","N/A","N/A","N/A","N/A","N/A","N/A","N/A","N/A","N/A",1,1,1,1,1,1,1,1,1,1]
[null,null,null,null,null,null,null,null,null,null,null,null,null,null,null,null,null,null,null,null,null,null,null,null,null,null,null,null,null,null,null,null,null,null,null,null,null,null,null,null,null,null,null,null,null,null,null,null,null,null,"N/A","N/A","N/A","N/A","N/A","N/A","N/A","N/A","N/A","N/A",1,1,1,1,1,1,1,1,1,1]
[null,null,null,null,null,null,null,null,null,null,null,null,null,null,null,null,null,null,null,null,null,null,null,null,null,null,null,null,null,null,null,null,null,null,null,null,null,null,null,null,null,null,null,null,null,null,null,null,null,null,"N/A","N/A","N/A","N/A","N/A","N/A","N/A","N/A","N/A","N/A",1,1,1,1,1,1,1,1,1,1]
[null,null,null,null,null,null,null,null,null,null,null,null,null,null,null,null,null,null,null,null,null,null,null,null,null,null,null,null,null,null,null,null,null,null,null,null,null,null,null,null,null,null,null,null,null,null,null,null,null,null,"N/A","N/A","N/A","N/A","N/A","N/A","N/A","N/A","N/A","N/A",1,1,1,1,1,1,1,1,1,1]
[null,null,null,null,null,null,null,null,null,null,null,null,null,null,null,null,null,null,null,null,null,null,null,null,null,null,null,null,null,null,null,null,null,null,null,null,null,null,null,null,null,null,null,null,null,null,null,null,null,null,"N/A","N/A","N/A","N/A","N/A","N/A","N/A","N/A","N/A","N/A",1,1,1,1,1,1,1,1,1,1]
[null,null,null,null,null,null,null,null,null,null,null,null,null,null,null,null,null,null,null,null,null,null,null,null,null,null,null,null,null,null,null,null,null,null,null,null,null,null,null,null,null,null,null,null,null,null,null,null,null,null,"N/A","N/A","N/A","N/A","N/A","N/A","N/A","N/A","N/A","N/A",1,1,1,1,1,1,1,1,1,1]
[null,null,null,null,null,null,null,null,null,null,null,null,null,null,null,null,null,null,null,null,null,null,null,null,null,null,null,null,null,null,null,null,null,null,null,null,null,null,null,null,null,null,null,null,null,null,null,null,null,null,"N/A","N/A","N/A","N/A","N/A","N/A","N/A","N/A","N/A","N/A",1,1,1,1,1,1,1,1,1,1]
[null,null,null,null,null,null,null,null,null,null,null,null,null,null,null,null,null,null,null,null,null,null,null,null,null,null,null,null,null,null,null,null,null,null,null,null,null,null,null,null,null,null,null,null,null,null,null,null,null,null,"N/A","N/A","N/A","N/A","N/A","N/A","N/A","N/A","N/A","N/A",1,1,1,1,1,1,1,1,1,1]
[null,null,null,null,null,null,null,null,null,null,null,null,null,null,null,null,null,null,null,null,null,null,null,null,null,null,null,null,null,null,null,null,null,null,null,null,null,null,null,null,null,null,null,null,null,null,null,null,null,null,"N/A","N/A","N/A","N/A","N/A","N/A","N/A","N/A","N/A","N/A",1,1,1,1,1,1,1,1,1,1]
[null,null,null,null,null,null,null,null,null,null,null,null,null,null,null,null,null,null,null,null,null,null,null,null,null,null,null,null,null,null,null,null,null,null,null,null,null,null,null,null,null,null,null,null,null,null,null,null,null,null,"N/A","N/A","N/A","N/A","N/A","N/A","N/A","N/A","N/A","N/A",1,1,1,1,1,1,1,1,1,1]
[null,null,null,null,null,null,null,null,null,null,null,null,null,null,null,null,null,null,null,null,null,null,null,null,null,null,null,null,null,null,null,null,null,null,null,null,null,null,null,null,null,null,null,null,null,null,null,null,null,null,"N/A","N/A","N/A","N/A","N/A","N/A","N/A","N/A","N/A","N/A",1,1,1,1,1,1,1,1,1,1]
[null,null,null,null,null,null,null,null,null,null,null,null,null,null,null,null,null,null,null,null,null,null,null,null,null,null,null,null,null,null,null,null,null,null,null,null,null,null,null,null,null,null,null,null,null,null,null,null,null,null,"N/A","N/A","N/A","N/A","N/A","N/A","N/A","N/A","N/A","N/A",1,1,1,1,1,1,1,1,1,1]
[null,null,null,null,null,null,null,null,null,null,null,null,null,null,null,null,null,null,null,null,null,null,null,null,null,null,null,null,null,null,null,null,null,null,null,null,null,null,null,null,null,null,null,null,null,null,null,null,null,null,"N/A","N/A","N/A","N/A","N/A","N/A","N/A","N/A","N/A","N/A",1,1,1,1,1,1,1,1,1,1]
[null,null,null,null,null,null,null,null,null,null,null,null,null,null,null,null,null,null,null,null,null,null,null,null,null,null,null,null,null,null,null,null,null,null,null,null,null,null,null,null,null,null,null,null,null,null,null,null,null,null,"N/A","N/A","N/A","N/A","N/A","N/A","N/A","N/A","N/A","N/A",1,1,1,1,1,1,1,1,1,1]
[null,null,null,null,null,null,null,null,null,null,null,null,null,null,null,null,null,null,null,null,null,null,null,null,null,null,null,null,null,null,null,null,null,null,null,null,null,null,null,null,null,null,null,null,null,null,null,null,null,null,"N/A","N/A","N/A","N/A","N/A","N/A","N/A","N/A","N/A","N/A",1,1,1,1,1,1,1,1,1,{"$f":"IF(BH569=\"N/A\",1,\"\")","v":1}]
[null,null,null,null,null,null,null,null,null,null,null,null,null,null,null,null,null,null,null,null,null,null,null,null,null,null,null,null,null,null,null,null,null,null,null,null,null,null,null,null,null,null,null,null,null,null,null,null,null,null,"N/A","N/A","N/A","N/A","N/A","N/A","N/A","N/A","N/A","N/A",{"$f":"IF(AY570=\"N/A\",1,\"\")","v":1},{"$f":"IF(AZ570=\"N/A\",1,\"\")","v":1},{"$f":"IF(BA570=\"N/A\",1,\"\")","v":1},{"$f":"IF(BB570=\"N/A\",1,\"\")","v":1},{"$f":"IF(BC570=\"N/A\",1,\"\")","v":1},{"$f":"IF(BD570=\"N/A\",1,\"\")","v":1},{"$f":"IF(BE570=\"N/A\",1,\"\")","v":1},1,1,1]
[null,null,null,null,null,null,null,null,null,null,null,null,null,null,null,null,null,null,null,null,null,null,null,null,null,null,null,null,null,null,null,null,null,null,null,null,null,null,null,null,null,null,null,null,null,null,null,null,null,null,"N/A","N/A","N/A","N/A","N/A","N/A","N/A","N/A","N/A","N/A",1,1,1,1,1,1,1,1,1,1]
[null,null,null,null,null,null,null,null,null,null,null,null,null,null,null,null,null,null,null,null,null,null,null,null,null,null,null,null,null,null,null,null,null,null,null,null,null,null,null,null,null,null,null,null,null,null,null,null,null,null,"N/A","N/A","N/A","N/A","N/A","N/A","N/A","N/A","N/A","N/A",1,1,1,1,1,1,1,1,1,1]
[null,null,null,null,null,null,null,null,null,null,null,null,null,null,null,null,null,null,null,null,null,null,null,null,null,null,null,null,null,null,null,null,null,null,null,null,null,null,null,null,null,null,null,null,null,null,null,null,null,null,"N/A","N/A","N/A","N/A","N/A","N/A","N/A","N/A","N/A","N/A",1,1,1,1,1,1,1,1,1,1]
[null,null,null,null,null,null,null,null,null,null,null,null,null,null,null,null,null,null,null,null,null,null,null,null,null,null,null,null,null,null,null,null,null,null,null,null,null,null,null,null,null,null,null,null,null,null,null,null,null,null,"N/A","N/A","N/A","N/A","N/A","N/A","N/A","N/A","N/A","N/A",1,1,1,1,1,1,1,1,1,1]
[null,null,null,null,null,null,null,null,null,null,null,null,null,null,null,null,null,null,null,null,null,null,null,null,null,null,null,null,null,null,null,null,null,null,null,null,null,null,null,null,null,null,null,null,null,null,null,null,null,null,"N/A","N/A","N/A","N/A","N/A","N/A","N/A","N/A","N/A","N/A",1,1,1,1,1,1,1,1,1,1]
[null,null,null,null,null,null,null,null,null,null,null,null,null,null,null,null,null,null,null,null,null,null,null,null,null,null,null,null,null,null,null,null,null,null,null,null,null,null,null,null,null,null,null,null,null,null,null,null,null,null,"N/A","N/A","N/A","N/A","N/A","N/A","N/A","N/A","N/A","N/A",1,1,1,1,1,1,1,1,1,1]
[null,null,null,null,null,null,null,null,null,null,null,null,null,null,null,null,null,null,null,null,null,null,null,null,null,null,null,null,null,null,null,null,null,null,null,null,null,null,null,null,null,null,null,null,null,null,null,null,null,null,"N/A","N/A","N/A","N/A","N/A","N/A","N/A","N/A","N/A","N/A",1,1,1,1,1,1,1,1,1,1]
[null,null,null,null,null,null,null,null,null,null,null,null,null,null,null,null,null,null,null,null,null,null,null,null,null,null,null,null,null,null,null,null,null,null,null,null,null,null,null,null,null,null,null,null,null,null,null,null,null,null,"N/A","N/A","N/A","N/A","N/A","N/A","N/A","N/A","N/A","N/A",1,1,1,1,1,1,1,1,1,1]
[null,null,null,null,null,null,null,null,null,null,null,null,null,null,null,null,null,null,null,null,null,null,null,null,null,null,null,null,null,null,null,null,null,null,null,null,null,null,null,null,null,null,null,null,null,null,null,null,null,null,"N/A","N/A","N/A","N/A","N/A","N/A","N/A","N/A","N/A","N/A",1,1,1,1,1,1,1,1,1,1]
[null,null,null,null,null,null,null,null,null,null,null,null,null,null,null,null,null,null,null,null,null,null,null,null,null,null,null,null,null,null,null,null,null,null,null,null,null,null,null,null,null,null,null,null,null,null,null,null,null,null,"N/A","N/A","N/A","N/A","N/A","N/A","N/A","N/A","N/A","N/A",1,1,1,1,1,1,1,1,1,1]
[null,null,null,null,null,null,null,null,null,null,null,null,null,null,null,null,null,null,null,null,null,null,null,null,null,null,null,null,null,null,null,null,null,null,null,null,null,null,null,null,null,null,null,null,null,null,null,null,null,null,"N/A","N/A","N/A","N/A","N/A","N/A","N/A","N/A","N/A","N/A",1,1,1,1,1,1,1,1,1,1]
[null,null,null,null,null,null,null,null,null,null,null,null,null,null,null,null,null,null,null,null,null,null,null,null,null,null,null,null,null,null,null,null,null,null,null,null,null,null,null,null,null,null,null,null,null,null,null,null,null,null,"N/A","N/A","N/A","N/A","N/A","N/A","N/A","N/A","N/A","N/A",1,1,1,1,1,1,1,1,1,1]
[null,null,null,null,null,null,null,null,null,null,null,null,null,null,null,null,null,null,null,null,null,null,null,null,null,null,null,null,null,null,null,null,null,null,null,null,null,null,null,null,null,null,null,null,null,null,null,null,null,null,"N/A","N/A","N/A","N/A","N/A","N/A","N/A","N/A","N/A","N/A",1,1,1,1,1,1,1,1,1,1]
[null,null,null,null,null,null,null,null,null,null,null,null,null,null,null,null,null,null,null,null,null,null,null,null,null,null,null,null,null,null,null,null,null,null,null,null,null,null,null,null,null,null,null,null,null,null,null,null,null,null,"N/A","N/A","N/A","N/A","N/A","N/A","N/A","N/A","N/A","N/A",1,1,1,1,1,1,1,1,1,1]
[null,null,null,null,null,null,null,null,null,null,null,null,null,null,null,null,null,null,null,null,null,null,null,null,null,null,null,null,null,null,null,null,null,null,null,null,null,null,null,null,null,null,null,null,null,null,null,null,null,null,"N/A","N/A","N/A","N/A","N/A","N/A","N/A","N/A","N/A","N/A",1,1,1,1,1,1,1,1,1,1]
[null,null,null,null,null,null,null,null,null,null,null,null,null,null,null,null,null,null,null,null,null,null,null,null,null,null,null,null,null,null,null,null,null,null,null,null,null,null,null,null,null,null,null,null,null,null,null,null,null,null,"N/A","N/A","N/A","N/A","N/A","N/A","N/A","N/A","N/A","N/A",1,1,1,1,1,1,1,1,1,1]
[null,null,null,null,null,null,null,null,null,null,null,null,null,null,null,null,null,null,null,null,null,null,null,null,null,null,null,null,null,null,null,null,null,null,null,null,null,null,null,null,null,null,null,null,null,null,null,null,null,null,"N/A","N/A","N/A","N/A","N/A","N/A","N/A","N/A","N/A","N/A",1,1,1,1,1,1,1,1,1,1]
[null,null,null,null,null,null,null,null,null,null,null,null,null,null,null,null,null,null,null,null,null,null,null,null,null,null,null,null,null,null,null,null,null,null,null,null,null,null,null,null,null,null,null,null,null,null,null,null,null,null,"N/A","N/A","N/A","N/A","N/A","N/A","N/A","N/A","N/A","N/A",1,1,1,1,1,1,1,1,1,1]
[null,null,null,null,null,null,null,null,null,null,null,null,null,null,null,null,null,null,null,null,null,null,null,null,null,null,null,null,null,null,null,null,null,null,null,null,null,null,null,null,null,null,null,null,null,null,null,null,null,null,"N/A","N/A","N/A","N/A","N/A","N/A","N/A","N/A","N/A","N/A",1,1,1,1,1,1,1,1,1,1]
[null,null,null,null,null,null,null,null,null,null,null,null,null,null,null,null,null,null,null,null,null,null,null,null,null,null,null,null,null,null,null,null,null,null,null,null,null,null,null,null,null,null,null,null,null,null,null,null,null,null,"N/A","N/A","N/A","N/A","N/A","N/A","N/A","N/A","N/A","N/A",1,1,1,1,1,1,1,1,1,1]
[null,null,null,null,null,null,null,null,null,null,null,null,null,null,null,null,null,null,null,null,null,null,null,null,null,null,null,null,null,null,null,null,null,null,null,null,null,null,null,null,null,null,null,null,null,null,null,null,null,null,"N/A","N/A","N/A","N/A","N/A","N/A","N/A","N/A","N/A","N/A",1,1,1,1,1,1,1,1,1,1]
[null,null,null,null,null,null,null,null,null,null,null,null,null,null,null,null,null,null,null,null,null,null,null,null,null,null,null,null,null,null,null,null,null,null,null,null,null,null,null,null,null,null,null,null,null,null,null,null,null,null,"N/A","N/A","N/A","N/A","N/A","N/A","N/A","N/A","N/A","N/A",1,1,1,1,1,1,1,{"$f":"IF(BF592=\"N/A\",1,\"\")","v":1},{"$f":"IF(BG592=\"N/A\",1,\"\")","v":1},1]
[null,null,null,null,null,null,null,null,null,null,null,null,null,null,null,null,null,null,null,null,null,null,null,null,null,null,null,null,null,null,null,null,null,null,null,null,null,null,null,null,null,null,null,null,null,null,null,null,null,null,"N/A","N/A","N/A","N/A","N/A","N/A","N/A","N/A","N/A","N/A",1,1,1,1,1,1,1,1,1,1]
[null,null,null,null,null,null,null,null,null,null,null,null,null,null,null,null,null,null,null,null,null,null,null,null,null,null,null,null,null,null,null,null,null,null,null,null,null,null,null,null,null,null,null,null,null,null,null,null,null,null,"N/A","N/A","N/A","N/A","N/A","N/A","N/A","N/A","N/A","N/A",1,1,1,1,1,1,1,1,1,1]
[null,null,null,null,null,null,null,null,null,null,null,null,null,null,null,null,null,null,null,null,null,null,null,null,null,null,null,null,null,null,null,null,null,null,null,null,null,null,null,null,null,null,null,null,null,null,null,null,null,null,"N/A","N/A","N/A","N/A","N/A","N/A","N/A","N/A","N/A","N/A",1,1,1,1,1,1,1,1,1,1]
[null,null,null,null,null,null,null,null,null,null,null,null,null,null,null,null,null,null,null,null,null,null,null,null,null,null,null,null,null,null,null,null,null,null,null,null,null,null,null,null,null,null,null,null,null,null,null,null,null,null,"N/A","N/A","N/A","N/A","N/A","N/A","N/A","N/A","N/A","N/A",1,1,1,1,1,1,1,1,1,1]
[null,null,null,null,null,null,null,null,null,null,null,null,null,null,null,null,null,null,null,null,null,null,null,null,null,null,null,null,null,null,null,null,null,null,null,null,null,null,null,null,null,null,null,null,null,null,null,null,null,null,"N/A","N/A","N/A","N/A","N/A","N/A","N/A","N/A","N/A","N/A",1,1,1,1,1,1,1,1,1,1]
[null,null,null,null,null,null,null,null,null,null,null,null,null,null,null,null,null,null,null,null,null,null,null,null,null,null,null,null,null,null,null,null,null,null,null,null,null,null,null,null,null,null,null,null,null,null,null,null,null,null,"N/A","N/A","N/A","N/A","N/A","N/A","N/A","N/A","N/A","N/A",1,1,1,1,1,1,1,1,1,1]
[null,null,null,null,null,null,null,null,null,null,null,null,null,null,null,null,null,null,null,null,null,null,null,null,null,null,null,null,null,null,null,null,null,null,null,null,null,null,null,null,null,null,null,null,null,null,null,null,null,null,"N/A","N/A","N/A","N/A","N/A","N/A","N/A","N/A","N/A","N/A",1,1,1,1,1,1,1,1,1,1]
[null,null,null,null,null,null,null,null,null,null,null,null,null,null,null,null,null,null,null,null,null,null,null,null,null,null,null,null,null,null,null,null,null,null,null,null,null,null,null,null,null,null,null,null,null,null,null,null,null,null,"N/A","N/A","N/A","N/A","N/A","N/A","N/A","N/A","N/A","N/A",1,1,1,1,1,1,1,1,1,1]
[null,null,null,null,null,null,null,null,null,null,null,null,null,null,null,null,null,null,null,null,null,null,null,null,null,null,null,null,null,null,null,null,null,null,null,null,null,null,null,null,null,null,null,null,null,null,null,null,null,null,"N/A","N/A","N/A","N/A","N/A","N/A","N/A","N/A","N/A","N/A",1,1,1,1,1,1,1,1,1,1]
[null,null,null,null,null,null,null,null,null,null,null,null,null,null,null,null,null,null,null,null,null,null,null,null,null,null,null,null,null,null,null,null,null,null,null,null,null,null,null,null,null,null,null,null,null,null,null,null,null,null,{"$f":"IF(COUNTA(E602:J602)>0,(COUNTIF(E602:J602,\"=0\")*0+COUNTIF(E602:J602,\"=1\")*100+COUNTIF(E602:J602,\"=2\")*80+COUNTIF(E602:J602,\"=3\")*50+COUNTIF(E602:J602,\"=8\")*20+COUNTIF(E602:J602,\"=9\")*0)/COUNTA(E602:J602)/100,\"N/A\")","v":"N/A"},"N/A",{"$f":"IF(COUNTA(P602:U602)>0,(COUNTIF(P602:U602,\"=0\")*0+COUNTIF(P602:U602,\"=1\")*100+COUNTIF(P602:U602,\"=2\")*80+COUNTIF(P602:U602,\"=3\")*50+COUNTIF(P602:U602,\"=8\")*20+COUNTIF(P602:U602,\"=9\")*0)/COUNTA(P602:U602)/100,\"N/A\")","v":"N/A"},{"$f":"IF(COUNTA(V602)<>0,(COUNTIF(V602,\"=0\")*0+COUNTIF(V602,\"=1\")*100+COUNTIF(V602,\"=2\")*80+COUNTIF(V602,\"=3\")*50+COUNTIF(V602,\"=8\")*20+COUNTIF(V602,\"=9\")*0)/COUNTA(V602)/100,\"N/A\")","v":"N/A"},{"$f":"IF(COUNTA(W602:X602)>0,(COUNTIF(W602:X602,\"=0\")*0+COUNTIF(W602:X602,\"=1\")*100+COUNTIF(W602:X602,\"=2\")*80+COUNTIF(W602:X602,\"=3\")*50+COUNTIF(W602:X602,\"=8\")*20+COUNTIF(W602:X602,\"=9\")*0)/COUNTA(W602:X602)/100,\"N/A\")","v":"N/A"},{"$f":"IF(COUNTA(Y602:AJ602)>0,(COUNTIF(Y602:AJ602,\"=0\")*0+COUNTIF(Y602:AJ602,\"=1\")*100+COUNTIF(Y602:AJ602,\"=2\")*80+COUNTIF(Y602:AJ602,\"=3\")*50+COUNTIF(Y602:AJ602,\"=8\")*20+COUNTIF(Y602:AJ602,\"=9\")*0)/COUNTA(Y602:AJ602)/100,\"N/A\")","v":"N/A"},{"$f":"IF(COUNTA(AK602:AP602)>0,(COUNTIF(AK602:AP602,\"=0\")*0+COUNTIF(AK602:AP602,\"=1\")*100+COUNTIF(AK602:AP602,\"=2\")*80+COUNTIF(AK602:AP602,\"=3\")*50+COUNTIF(AK602:AP602,\"=8\")*20+COUNTIF(AK602:AP602,\"=9\")*0)/COUNTA(AK602:AP602)/100,\"N/A\")","v":"N/A"},{"$f":"IF(COUNTA(AQ602:AU602)>0,(COUNTIF(AQ602:AU602,\"=0\")*0+COUNTIF(AQ602:AU602,\"=1\")*100+COUNTIF(AQ602:AU602,\"=2\")*80+COUNTIF(AQ602:AU602,\"=3\")*50+COUNTIF(AQ602:AU602,\"=8\")*20+COUNTIF(AQ602:AU602,\"=9\")*0)/COUNTA(AQ602:AU602)/100,\"N/A\")","v":"N/A"},{"$f":"IF(COUNTA(AV602:AX602)>0,(COUNTIF(AV602:AX602,\"=0\")*0+COUNTIF(AV602:AX602,\"=1\")*100+COUNTIF(AV602:AX602,\"=2\")*80+COUNTIF(AV602:AX602,\"=3\")*50+COUNTIF(AV602:AX602,\"=8\")*20+COUNTIF(AV602:AX602,\"=9\")*0)/COUNTA(AV602:AX602)/100,\"N/A\")","v":"N/A"},{"$f":"IF(AND(COUNTA(E602:AX602)<>0,B602<>\"\"),AVERAGE(BA602:BG602),\"N/A\")","v":"N/A"},1,1,1,1,1,1,1,1,1,1]
[null,null,null,null,null,null,null,null,null,null,null,null,null,null,null,null,null,null,null,null,null,null,null,null,null,null,null,null,null,null,null,null,null,null,null,null,null,null,null,null,null,null,null,null,null,null,null,null,null,null,"N/A","N/A","N/A","N/A","N/A","N/A","N/A","N/A","N/A","N/A",1,1,1,1,1,1,1,1,1,1]
[null,null,null,null,null,null,null,null,null,null,null,null,null,null,null,null,null,null,null,null,null,null,null,null,null,null,null,null,null,null,null,null,null,null,null,null,null,null,null,null,null,null,null,null,null,null,null,null,null,null,"N/A","N/A","N/A","N/A","N/A","N/A","N/A","N/A","N/A","N/A",1,1,1,1,1,1,1,1,1,1]
[null,null,null,null,null,null,null,null,null,null,null,null,null,null,null,null,null,null,null,null,null,null,null,null,null,null,null,null,null,null,null,null,null,null,null,null,null,null,null,null,null,null,null,null,null,null,null,null,null,null,"N/A","N/A","N/A","N/A","N/A","N/A","N/A","N/A","N/A","N/A",1,1,1,1,1,1,1,1,1,1]
[null,null,null,null,null,null,null,null,null,null,null,null,null,null,null,null,null,null,null,null,null,null,null,null,null,null,null,null,null,null,null,null,null,null,null,null,null,null,null,null,null,null,null,null,null,null,null,null,null,null,"N/A",{"$f":"IF(COUNTA(K606:O606)>0,(COUNTIF(K606:O606,\"=0\")*0+COUNTIF(K606:O606,\"=1\")*100+COUNTIF(K606:O606,\"=2\")*80+COUNTIF(K606:O606,\"=3\")*50+COUNTIF(K606:O606,\"=8\")*20+COUNTIF(K606:O606,\"=9\")*0)/COUNTA(K606:O606)/100,\"N/A\")","v":"N/A"},"N/A","N/A","N/A","N/A","N/A","N/A","N/A","N/A",1,1,1,1,1,1,1,1,1,1]
[null,null,null,null,null,null,null,null,null,null,null,null,null,null,null,null,null,null,null,null,null,null,null,null,null,null,null,null,null,null,null,null,null,null,null,null,null,null,null,null,null,null,null,null,null,null,null,null,null,null,"N/A","N/A","N/A","N/A","N/A","N/A","N/A","N/A","N/A","N/A",1,1,1,1,1,1,1,1,1,1]
[null,null,null,null,null,null,null,null,null,null,null,null,null,null,null,null,null,null,null,null,null,null,null,null,null,null,null,null,null,null,null,null,null,null,null,null,null,null,null,null,null,null,null,null,null,null,null,null,null,null,"N/A","N/A","N/A","N/A","N/A","N/A","N/A","N/A","N/A","N/A",1,1,1,1,1,1,1,1,1,1]
[null,null,null,null,null,null,null,null,null,null,null,null,null,null,null,null,null,null,null,null,null,null,null,null,null,null,null,null,null,null,null,null,null,null,null,null,null,null,null,null,null,null,null,null,null,null,null,null,null,null,"N/A","N/A","N/A","N/A","N/A","N/A","N/A","N/A","N/A","N/A",1,1,1,1,1,1,1,1,1,1]
[null,null,null,null,null,null,null,null,null,null,null,null,null,null,null,null,null,null,null,null,null,null,null,null,null,null,null,null,null,null,null,null,null,null,null,null,null,null,null,null,null,null,null,null,null,null,null,null,null,null,"N/A","N/A","N/A","N/A","N/A","N/A","N/A","N/A","N/A","N/A",1,1,1,1,1,1,1,1,1,1]
[null,null,null,null,null,null,null,null,null,null,null,null,null,null,null,null,null,null,null,null,null,null,null,null,null,null,null,null,null,null,null,null,null,null,null,null,null,null,null,null,null,null,null,null,null,null,null,null,null,null,"N/A","N/A","N/A","N/A","N/A","N/A","N/A","N/A","N/A","N/A",1,1,1,1,1,1,1,1,1,1]
[null,null,null,null,null,null,null,null,null,null,null,null,null,null,null,null,null,null,null,null,null,null,null,null,null,null,null,null,null,null,null,null,null,null,null,null,null,null,null,null,null,null,null,null,null,null,null,null,null,null,"N/A","N/A","N/A","N/A","N/A","N/A","N/A","N/A","N/A","N/A",1,1,1,1,1,1,1,1,1,1]
[null,null,null,null,null,null,null,null,null,null,null,null,null,null,null,null,null,null,null,null,null,null,null,null,null,null,null,null,null,null,null,null,null,null,null,null,null,null,null,null,null,null,null,null,null,null,null,null,null,null,"N/A","N/A","N/A","N/A","N/A","N/A","N/A","N/A","N/A","N/A",1,1,1,1,1,1,1,1,1,1]
[null,null,null,null,null,null,null,null,null,null,null,null,null,null,null,null,null,null,null,null,null,null,null,null,null,null,null,null,null,null,null,null,null,null,null,null,null,null,null,null,null,null,null,null,null,null,null,null,null,null,"N/A","N/A","N/A","N/A","N/A","N/A","N/A","N/A","N/A","N/A",1,1,1,1,1,1,1,1,1,1]
[null,null,null,null,null,null,null,null,null,null,null,null,null,null,null,null,null,null,null,null,null,null,null,null,null,null,null,null,null,null,null,null,null,null,null,null,null,null,null,null,null,null,null,null,null,null,null,null,null,null,"N/A","N/A","N/A","N/A","N/A","N/A","N/A","N/A","N/A","N/A",1,1,1,1,1,1,1,1,1,1]
[null,null,null,null,null,null,null,null,null,null,null,null,null,null,null,null,null,null,null,null,null,null,null,null,null,null,null,null,null,null,null,null,null,null,null,null,null,null,null,null,null,null,null,null,null,null,null,null,null,null,"N/A","N/A","N/A","N/A","N/A","N/A","N/A","N/A","N/A","N/A",1,1,1,1,1,1,1,1,1,1]
[null,null,null,null,null,null,null,null,null,null,null,null,null,null,null,null,null,null,null,null,null,null,null,null,null,null,null,null,null,null,null,null,null,null,null,null,null,null,null,null,null,null,null,null,null,null,null,null,null,null,"N/A","N/A","N/A","N/A","N/A","N/A","N/A","N/A","N/A","N/A",1,1,1,1,1,1,1,1,1,1]
[null,null,null,null,null,null,null,null,null,null,null,null,null,null,null,null,null,null,null,null,null,null,null,null,null,null,null,null,null,null,null,null,null,null,null,null,null,null,null,null,null,null,null,null,null,null,null,null,null,null,"N/A","N/A","N/A","N/A","N/A","N/A","N/A","N/A","N/A","N/A",1,1,1,1,1,1,1,1,1,1]
[null,null,null,null,null,null,null,null,null,null,null,null,null,null,null,null,null,null,null,null,null,null,null,null,null,null,null,null,null,null,null,null,null,null,null,null,null,null,null,null,null,null,null,null,null,null,null,null,null,null,"N/A","N/A","N/A","N/A","N/A","N/A","N/A","N/A","N/A","N/A",1,1,1,1,1,1,1,1,1,1]
[null,null,null,null,null,null,null,null,null,null,null,null,null,null,null,null,null,null,null,null,null,null,null,null,null,null,null,null,null,null,null,null,null,null,null,null,null,null,null,null,null,null,null,null,null,null,null,null,null,null,"N/A","N/A","N/A","N/A","N/A","N/A","N/A","N/A","N/A","N/A",1,1,1,1,1,1,1,1,1,1]
[null,null,null,null,null,null,null,null,null,null,null,null,null,null,null,null,null,null,null,null,null,null,null,null,null,null,null,null,null,null,null,null,null,null,null,null,null,null,null,null,null,null,null,null,null,null,null,null,null,null,"N/A","N/A","N/A","N/A","N/A","N/A","N/A","N/A","N/A","N/A",1,1,1,1,1,1,1,1,1,1]
[null,null,null,null,null,null,null,null,null,null,null,null,null,null,null,null,null,null,null,null,null,null,null,null,null,null,null,null,null,null,null,null,null,null,null,null,null,null,null,null,null,null,null,null,null,null,null,null,null,null,"N/A","N/A","N/A","N/A","N/A","N/A","N/A","N/A","N/A","N/A",1,1,1,1,1,1,1,1,1,1]
[null,null,null,null,null,null,null,null,null,null,null,null,null,null,null,null,null,null,null,null,null,null,null,null,null,null,null,null,null,null,null,null,null,null,null,null,null,null,null,null,null,null,null,null,null,null,null,null,null,null,"N/A","N/A","N/A","N/A","N/A","N/A","N/A","N/A","N/A","N/A",1,1,1,1,1,1,1,1,1,1]
[null,null,null,null,null,null,null,null,null,null,null,null,null,null,null,null,null,null,null,null,null,null,null,null,null,null,null,null,null,null,null,null,null,null,null,null,null,null,null,null,null,null,null,null,null,null,null,null,null,null,"N/A","N/A","N/A","N/A","N/A","N/A","N/A","N/A","N/A","N/A",1,1,1,1,1,1,1,1,1,1]
[null,null,null,null,null,null,null,null,null,null,null,null,null,null,null,null,null,null,null,null,null,null,null,null,null,null,null,null,null,null,null,null,null,null,null,null,null,null,null,null,null,null,null,null,null,null,null,null,null,null,"N/A","N/A","N/A","N/A","N/A","N/A","N/A","N/A","N/A","N/A",1,1,1,1,1,1,1,1,1,1]
[null,null,null,null,null,null,null,null,null,null,null,null,null,null,null,null,null,null,null,null,null,null,null,null,null,null,null,null,null,null,null,null,null,null,null,null,null,null,null,null,null,null,null,null,null,null,null,null,null,null,"N/A","N/A","N/A","N/A","N/A","N/A","N/A","N/A","N/A","N/A",1,1,1,1,1,1,1,1,1,1]
[null,null,null,null,null,null,null,null,null,null,null,null,null,null,null,null,null,null,null,null,null,null,null,null,null,null,null,null,null,null,null,null,null,null,null,null,null,null,null,null,null,null,null,null,null,null,null,null,null,null,"N/A","N/A","N/A","N/A","N/A","N/A","N/A","N/A","N/A","N/A",1,1,1,1,1,1,1,1,1,1]
[null,null,null,null,null,null,null,null,null,null,null,null,null,null,null,null,null,null,null,null,null,null,null,null,null,null,null,null,null,null,null,null,null,null,null,null,null,null,null,null,null,null,null,null,null,null,null,null,null,null,"N/A","N/A","N/A","N/A","N/A","N/A","N/A","N/A","N/A","N/A",1,1,1,1,1,1,1,1,1,1]
[null,null,null,null,null,null,null,null,null,null,null,null,null,null,null,null,null,null,null,null,null,null,null,null,null,null,null,null,null,null,null,null,null,null,null,null,null,null,null,null,null,null,null,null,null,null,null,null,null,null,"N/A","N/A","N/A","N/A","N/A","N/A","N/A","N/A","N/A","N/A",1,1,1,1,1,1,1,1,1,1]
[null,null,null,null,null,null,null,null,null,null,null,null,null,null,null,null,null,null,null,null,null,null,null,null,null,null,null,null,null,null,null,null,null,null,null,null,null,null,null,null,null,null,null,null,null,null,null,null,null,null,"N/A","N/A","N/A","N/A","N/A","N/A","N/A","N/A","N/A","N/A",1,1,1,1,1,1,1,1,1,1]
[null,null,null,null,null,null,null,null,null,null,null,null,null,null,null,null,null,null,null,null,null,null,null,null,null,null,null,null,null,null,null,null,null,null,null,null,null,null,null,null,null,null,null,null,null,null,null,null,null,null,"N/A","N/A","N/A","N/A","N/A","N/A","N/A","N/A","N/A","N/A",1,1,1,1,1,1,1,1,1,1]
[null,null,null,null,null,null,null,null,null,null,null,null,null,null,null,null,null,null,null,null,null,null,null,null,null,null,null,null,null,null,null,null,null,null,null,null,null,null,null,null,null,null,null,null,null,null,null,null,null,null,"N/A","N/A","N/A","N/A","N/A","N/A","N/A","N/A","N/A","N/A",1,1,1,1,1,1,1,1,1,1]
[null,null,null,null,null,null,null,null,null,null,null,null,null,null,null,null,null,null,null,null,null,null,null,null,null,null,null,null,null,null,null,null,null,null,null,null,null,null,null,null,null,null,null,null,null,null,null,null,null,null,"N/A","N/A","N/A","N/A","N/A","N/A","N/A","N/A","N/A","N/A",1,1,1,1,1,1,1,1,1,{"$f":"IF(BH633=\"N/A\",1,\"\")","v":1}]
[null,null,null,null,null,null,null,null,null,null,null,null,null,null,null,null,null,null,null,null,null,null,null,null,null,null,null,null,null,null,null,null,null,null,null,null,null,null,null,null,null,null,null,null,null,null,null,null,null,null,"N/A","N/A","N/A","N/A","N/A","N/A","N/A","N/A","N/A","N/A",{"$f":"IF(AY634=\"N/A\",1,\"\")","v":1},{"$f":"IF(AZ634=\"N/A\",1,\"\")","v":1},{"$f":"IF(BA634=\"N/A\",1,\"\")","v":1},{"$f":"IF(BB634=\"N/A\",1,\"\")","v":1},{"$f":"IF(BC634=\"N/A\",1,\"\")","v":1},{"$f":"IF(BD634=\"N/A\",1,\"\")","v":1},{"$f":"IF(BE634=\"N/A\",1,\"\")","v":1},1,1,1]
[null,null,null,null,null,null,null,null,null,null,null,null,null,null,null,null,null,null,null,null,null,null,null,null,null,null,null,null,null,null,null,null,null,null,null,null,null,null,null,null,null,null,null,null,null,null,null,null,null,null,"N/A","N/A","N/A","N/A","N/A","N/A","N/A","N/A","N/A","N/A",1,1,1,1,1,1,1,1,1,1]
[null,null,null,null,null,null,null,null,null,null,null,null,null,null,null,null,null,null,null,null,null,null,null,null,null,null,null,null,null,null,null,null,null,null,null,null,null,null,null,null,null,null,null,null,null,null,null,null,null,null,"N/A","N/A","N/A","N/A","N/A","N/A","N/A","N/A","N/A","N/A",1,1,1,1,1,1,1,1,1,1]
[null,null,null,null,null,null,null,null,null,null,null,null,null,null,null,null,null,null,null,null,null,null,null,null,null,null,null,null,null,null,null,null,null,null,null,null,null,null,null,null,null,null,null,null,null,null,null,null,null,null,"N/A","N/A","N/A","N/A","N/A","N/A","N/A","N/A","N/A","N/A",1,1,1,1,1,1,1,1,1,1]
[null,null,null,null,null,null,null,null,null,null,null,null,null,null,null,null,null,null,null,null,null,null,null,null,null,null,null,null,null,null,null,null,null,null,null,null,null,null,null,null,null,null,null,null,null,null,null,null,null,null,"N/A","N/A","N/A","N/A","N/A","N/A","N/A","N/A","N/A","N/A",1,1,1,1,1,1,1,1,1,1]
[null,null,null,null,null,null,null,null,null,null,null,null,null,null,null,null,null,null,null,null,null,null,null,null,null,null,null,null,null,null,null,null,null,null,null,null,null,null,null,null,null,null,null,null,null,null,null,null,null,null,"N/A","N/A","N/A","N/A","N/A","N/A","N/A","N/A","N/A","N/A",1,1,1,1,1,1,1,1,1,1]
[null,null,null,null,null,null,null,null,null,null,null,null,null,null,null,null,null,null,null,null,null,null,null,null,null,null,null,null,null,null,null,null,null,null,null,null,null,null,null,null,null,null,null,null,null,null,null,null,null,null,"N/A","N/A","N/A","N/A","N/A","N/A","N/A","N/A","N/A","N/A",1,1,1,1,1,1,1,1,1,1]
[null,null,null,null,null,null,null,null,null,null,null,null,null,null,null,null,null,null,null,null,null,null,null,null,null,null,null,null,null,null,null,null,null,null,null,null,null,null,null,null,null,null,null,null,null,null,null,null,null,null,"N/A","N/A","N/A","N/A","N/A","N/A","N/A","N/A","N/A","N/A",1,1,1,1,1,1,1,1,1,1]
[null,null,null,null,null,null,null,null,null,null,null,null,null,null,null,null,null,null,null,null,null,null,null,null,null,null,null,null,null,null,null,null,null,null,null,null,null,null,null,null,null,null,null,null,null,null,null,null,null,null,"N/A","N/A","N/A","N/A","N/A","N/A","N/A","N/A","N/A","N/A",1,1,1,1,1,1,1,1,1,1]
[null,null,null,null,null,null,null,null,null,null,null,null,null,null,null,null,null,null,null,null,null,null,null,null,null,null,null,null,null,null,null,null,null,null,null,null,null,null,null,null,null,null,null,null,null,null,null,null,null,null,"N/A","N/A","N/A","N/A","N/A","N/A","N/A","N/A","N/A","N/A",1,1,1,1,1,1,1,1,1,1]
[null,null,null,null,null,null,null,null,null,null,null,null,null,null,null,null,null,null,null,null,null,null,null,null,null,null,null,null,null,null,null,null,null,null,null,null,null,null,null,null,null,null,null,null,null,null,null,null,null,null,"N/A","N/A","N/A","N/A","N/A","N/A","N/A","N/A","N/A","N/A",1,1,1,1,1,1,1,1,1,1]
[null,null,null,null,null,null,null,null,null,null,null,null,null,null,null,null,null,null,null,null,null,null,null,null,null,null,null,null,null,null,null,null,null,null,null,null,null,null,null,null,null,null,null,null,null,null,null,null,null,null,"N/A","N/A","N/A","N/A","N/A","N/A","N/A","N/A","N/A","N/A",1,1,1,1,1,1,1,1,1,1]
[null,null,null,null,null,null,null,null,null,null,null,null,null,null,null,null,null,null,null,null,null,null,null,null,null,null,null,null,null,null,null,null,null,null,null,null,null,null,null,null,null,null,null,null,null,null,null,null,null,null,"N/A","N/A","N/A","N/A","N/A","N/A","N/A","N/A","N/A","N/A",1,1,1,1,1,1,1,1,1,1]
[null,null,null,null,null,null,null,null,null,null,null,null,null,null,null,null,null,null,null,null,null,null,null,null,null,null,null,null,null,null,null,null,null,null,null,null,null,null,null,null,null,null,null,null,null,null,null,null,null,null,"N/A","N/A","N/A","N/A","N/A","N/A","N/A","N/A","N/A","N/A",1,1,1,1,1,1,1,1,1,1]
[null,null,null,null,null,null,null,null,null,null,null,null,null,null,null,null,null,null,null,null,null,null,null,null,null,null,null,null,null,null,null,null,null,null,null,null,null,null,null,null,null,null,null,null,null,null,null,null,null,null,"N/A","N/A","N/A","N/A","N/A","N/A","N/A","N/A","N/A","N/A",1,1,1,1,1,1,1,1,1,1]
[null,null,null,null,null,null,null,null,null,null,null,null,null,null,null,null,null,null,null,null,null,null,null,null,null,null,null,null,null,null,null,null,null,null,null,null,null,null,null,null,null,null,null,null,null,null,null,null,null,null,"N/A","N/A","N/A","N/A","N/A","N/A","N/A","N/A","N/A","N/A",1,1,1,1,1,1,1,1,1,1]
[null,null,null,null,null,null,null,null,null,null,null,null,null,null,null,null,null,null,null,null,null,null,null,null,null,null,null,null,null,null,null,null,null,null,null,null,null,null,null,null,null,null,null,null,null,null,null,null,null,null,"N/A","N/A","N/A","N/A","N/A","N/A","N/A","N/A","N/A","N/A",1,1,1,1,1,1,1,1,1,1]
[null,null,null,null,null,null,null,null,null,null,null,null,null,null,null,null,null,null,null,null,null,null,null,null,null,null,null,null,null,null,null,null,null,null,null,null,null,null,null,null,null,null,null,null,null,null,null,null,null,null,"N/A","N/A","N/A","N/A","N/A","N/A","N/A","N/A","N/A","N/A",1,1,1,1,1,1,1,1,1,1]
[null,null,null,null,null,null,null,null,null,null,null,null,null,null,null,null,null,null,null,null,null,null,null,null,null,null,null,null,null,null,null,null,null,null,null,null,null,null,null,null,null,null,null,null,null,null,null,null,null,null,"N/A","N/A","N/A","N/A","N/A","N/A","N/A","N/A","N/A","N/A",1,1,1,1,1,1,1,1,1,1]
[null,null,null,null,null,null,null,null,null,null,null,null,null,null,null,null,null,null,null,null,null,null,null,null,null,null,null,null,null,null,null,null,null,null,null,null,null,null,null,null,null,null,null,null,null,null,null,null,null,null,"N/A","N/A","N/A","N/A","N/A","N/A","N/A","N/A","N/A","N/A",1,1,1,1,1,1,1,1,1,1]
[null,null,null,null,null,null,null,null,null,null,null,null,null,null,null,null,null,null,null,null,null,null,null,null,null,null,null,null,null,null,null,null,null,null,null,null,null,null,null,null,null,null,null,null,null,null,null,null,null,null,"N/A","N/A","N/A","N/A","N/A","N/A","N/A","N/A","N/A","N/A",1,1,1,1,1,1,1,1,1,1]
[null,null,null,null,null,null,null,null,null,null,null,null,null,null,null,null,null,null,null,null,null,null,null,null,null,null,null,null,null,null,null,null,null,null,null,null,null,null,null,null,null,null,null,null,null,null,null,null,null,null,"N/A","N/A","N/A","N/A","N/A","N/A","N/A","N/A","N/A","N/A",1,1,1,1,1,1,1,1,1,1]
[null,null,null,null,null,null,null,null,null,null,null,null,null,null,null,null,null,null,null,null,null,null,null,null,null,null,null,null,null,null,null,null,null,null,null,null,null,null,null,null,null,null,null,null,null,null,null,null,null,null,"N/A","N/A","N/A","N/A","N/A","N/A","N/A","N/A","N/A","N/A",1,1,1,1,1,1,1,{"$f":"IF(BF656=\"N/A\",1,\"\")","v":1},{"$f":"IF(BG656=\"N/A\",1,\"\")","v":1},1]
[null,null,null,null,null,null,null,null,null,null,null,null,null,null,null,null,null,null,null,null,null,null,null,null,null,null,null,null,null,null,null,null,null,null,null,null,null,null,null,null,null,null,null,null,null,null,null,null,null,null,"N/A","N/A","N/A","N/A","N/A","N/A","N/A","N/A","N/A","N/A",1,1,1,1,1,1,1,1,1,1]
[null,null,null,null,null,null,null,null,null,null,null,null,null,null,null,null,null,null,null,null,null,null,null,null,null,null,null,null,null,null,null,null,null,null,null,null,null,null,null,null,null,null,null,null,null,null,null,null,null,null,"N/A","N/A","N/A","N/A","N/A","N/A","N/A","N/A","N/A","N/A",1,1,1,1,1,1,1,1,1,1]
[null,null,null,null,null,null,null,null,null,null,null,null,null,null,null,null,null,null,null,null,null,null,null,null,null,null,null,null,null,null,null,null,null,null,null,null,null,null,null,null,null,null,null,null,null,null,null,null,null,null,"N/A","N/A","N/A","N/A","N/A","N/A","N/A","N/A","N/A","N/A",1,1,1,1,1,1,1,1,1,1]
[null,null,null,null,null,null,null,null,null,null,null,null,null,null,null,null,null,null,null,null,null,null,null,null,null,null,null,null,null,null,null,null,null,null,null,null,null,null,null,null,null,null,null,null,null,null,null,null,null,null,"N/A","N/A","N/A","N/A","N/A","N/A","N/A","N/A","N/A","N/A",1,1,1,1,1,1,1,1,1,1]
[null,null,null,null,null,null,null,null,null,null,null,null,null,null,null,null,null,null,null,null,null,null,null,null,null,null,null,null,null,null,null,null,null,null,null,null,null,null,null,null,null,null,null,null,null,null,null,null,null,null,"N/A","N/A","N/A","N/A","N/A","N/A","N/A","N/A","N/A","N/A",1,1,1,1,1,1,1,1,1,1]
[null,null,null,null,null,null,null,null,null,null,null,null,null,null,null,null,null,null,null,null,null,null,null,null,null,null,null,null,null,null,null,null,null,null,null,null,null,null,null,null,null,null,null,null,null,null,null,null,null,null,"N/A","N/A","N/A","N/A","N/A","N/A","N/A","N/A","N/A","N/A",1,1,1,1,1,1,1,1,1,1]
[null,null,null,null,null,null,null,null,null,null,null,null,null,null,null,null,null,null,null,null,null,null,null,null,null,null,null,null,null,null,null,null,null,null,null,null,null,null,null,null,null,null,null,null,null,null,null,null,null,null,"N/A","N/A","N/A","N/A","N/A","N/A","N/A","N/A","N/A","N/A",1,1,1,1,1,1,1,1,1,1]
[null,null,null,null,null,null,null,null,null,null,null,null,null,null,null,null,null,null,null,null,null,null,null,null,null,null,null,null,null,null,null,null,null,null,null,null,null,null,null,null,null,null,null,null,null,null,null,null,null,null,"N/A","N/A","N/A","N/A","N/A","N/A","N/A","N/A","N/A","N/A",1,1,1,1,1,1,1,1,1,1]
[null,null,null,null,null,null,null,null,null,null,null,null,null,null,null,null,null,null,null,null,null,null,null,null,null,null,null,null,null,null,null,null,null,null,null,null,null,null,null,null,null,null,null,null,null,null,null,null,null,null,"N/A","N/A","N/A","N/A","N/A","N/A","N/A","N/A","N/A","N/A",1,1,1,1,1,1,1,1,1,1]
[null,null,null,null,null,null,null,null,null,null,null,null,null,null,null,null,null,null,null,null,null,null,null,null,null,null,null,null,null,null,null,null,null,null,null,null,null,null,null,null,null,null,null,null,null,null,null,null,null,null,{"$f":"IF(COUNTA(E666:J666)>0,(COUNTIF(E666:J666,\"=0\")*0+COUNTIF(E666:J666,\"=1\")*100+COUNTIF(E666:J666,\"=2\")*80+COUNTIF(E666:J666,\"=3\")*50+COUNTIF(E666:J666,\"=8\")*20+COUNTIF(E666:J666,\"=9\")*0)/COUNTA(E666:J666)/100,\"N/A\")","v":"N/A"},"N/A",{"$f":"IF(COUNTA(P666:U666)>0,(COUNTIF(P666:U666,\"=0\")*0+COUNTIF(P666:U666,\"=1\")*100+COUNTIF(P666:U666,\"=2\")*80+COUNTIF(P666:U666,\"=3\")*50+COUNTIF(P666:U666,\"=8\")*20+COUNTIF(P666:U666,\"=9\")*0)/COUNTA(P666:U666)/100,\"N/A\")","v":"N/A"},{"$f":"IF(COUNTA(V666)<>0,(COUNTIF(V666,\"=0\")*0+COUNTIF(V666,\"=1\")*100+COUNTIF(V666,\"=2\")*80+COUNTIF(V666,\"=3\")*50+COUNTIF(V666,\"=8\")*20+COUNTIF(V666,\"=9\")*0)/COUNTA(V666)/100,\"N/A\")","v":"N/A"},{"$f":"IF(COUNTA(W666:X666)>0,(COUNTIF(W666:X666,\"=0\")*0+COUNTIF(W666:X666,\"=1\")*100+COUNTIF(W666:X666,\"=2\")*80+COUNTIF(W666:X666,\"=3\")*50+COUNTIF(W666:X666,\"=8\")*20+COUNTIF(W666:X666,\"=9\")*0)/COUNTA(W666:X666)/100,\"N/A\")","v":"N/A"},{"$f":"IF(COUNTA(Y666:AJ666)>0,(COUNTIF(Y666:AJ666,\"=0\")*0+COUNTIF(Y666:AJ666,\"=1\")*100+COUNTIF(Y666:AJ666,\"=2\")*80+COUNTIF(Y666:AJ666,\"=3\")*50+COUNTIF(Y666:AJ666,\"=8\")*20+COUNTIF(Y666:AJ666,\"=9\")*0)/COUNTA(Y666:AJ666)/100,\"N/A\")","v":"N/A"},{"$f":"IF(COUNTA(AK666:AP666)>0,(COUNTIF(AK666:AP666,\"=0\")*0+COUNTIF(AK666:AP666,\"=1\")*100+COUNTIF(AK666:AP666,\"=2\")*80+COUNTIF(AK666:AP666,\"=3\")*50+COUNTIF(AK666:AP666,\"=8\")*20+COUNTIF(AK666:AP666,\"=9\")*0)/COUNTA(AK666:AP666)/100,\"N/A\")","v":"N/A"},{"$f":"IF(COUNTA(AQ666:AU666)>0,(COUNTIF(AQ666:AU666,\"=0\")*0+COUNTIF(AQ666:AU666,\"=1\")*100+COUNTIF(AQ666:AU666,\"=2\")*80+COUNTIF(AQ666:AU666,\"=3\")*50+COUNTIF(AQ666:AU666,\"=8\")*20+COUNTIF(AQ666:AU666,\"=9\")*0)/COUNTA(AQ666:AU666)/100,\"N/A\")","v":"N/A"},{"$f":"IF(COUNTA(AV666:AX666)>0,(COUNTIF(AV666:AX666,\"=0\")*0+COUNTIF(AV666:AX666,\"=1\")*100+COUNTIF(AV666:AX666,\"=2\")*80+COUNTIF(AV666:AX666,\"=3\")*50+COUNTIF(AV666:AX666,\"=8\")*20+COUNTIF(AV666:AX666,\"=9\")*0)/COUNTA(AV666:AX666)/100,\"N/A\")","v":"N/A"},{"$f":"IF(AND(COUNTA(E666:AX666)<>0,B666<>\"\"),AVERAGE(BA666:BG666),\"N/A\")","v":"N/A"},1,1,1,1,1,1,1,1,1,1]
[null,null,null,null,null,null,null,null,null,null,null,null,null,null,null,null,null,null,null,null,null,null,null,null,null,null,null,null,null,null,null,null,null,null,null,null,null,null,null,null,null,null,null,null,null,null,null,null,null,null,"N/A","N/A","N/A","N/A","N/A","N/A","N/A","N/A","N/A","N/A",1,1,1,1,1,1,1,1,1,1]
[null,null,null,null,null,null,null,null,null,null,null,null,null,null,null,null,null,null,null,null,null,null,null,null,null,null,null,null,null,null,null,null,null,null,null,null,null,null,null,null,null,null,null,null,null,null,null,null,null,null,"N/A","N/A","N/A","N/A","N/A","N/A","N/A","N/A","N/A","N/A",1,1,1,1,1,1,1,1,1,1]
[null,null,null,null,null,null,null,null,null,null,null,null,null,null,null,null,null,null,null,null,null,null,null,null,null,null,null,null,null,null,null,null,null,null,null,null,null,null,null,null,null,null,null,null,null,null,null,null,null,null,"N/A","N/A","N/A","N/A","N/A","N/A","N/A","N/A","N/A","N/A",1,1,1,1,1,1,1,1,1,1]
[null,null,null,null,null,null,null,null,null,null,null,null,null,null,null,null,null,null,null,null,null,null,null,null,null,null,null,null,null,null,null,null,null,null,null,null,null,null,null,null,null,null,null,null,null,null,null,null,null,null,"N/A",{"$f":"IF(COUNTA(K670:O670)>0,(COUNTIF(K670:O670,\"=0\")*0+COUNTIF(K670:O670,\"=1\")*100+COUNTIF(K670:O670,\"=2\")*80+COUNTIF(K670:O670,\"=3\")*50+COUNTIF(K670:O670,\"=8\")*20+COUNTIF(K670:O670,\"=9\")*0)/COUNTA(K670:O670)/100,\"N/A\")","v":"N/A"},"N/A","N/A","N/A","N/A","N/A","N/A","N/A","N/A",1,1,1,1,1,1,1,1,1,1]
[null,null,null,null,null,null,null,null,null,null,null,null,null,null,null,null,null,null,null,null,null,null,null,null,null,null,null,null,null,null,null,null,null,null,null,null,null,null,null,null,null,null,null,null,null,null,null,null,null,null,"N/A","N/A","N/A","N/A","N/A","N/A","N/A","N/A","N/A","N/A",1,1,1,1,1,1,1,1,1,1]
[null,null,null,null,null,null,null,null,null,null,null,null,null,null,null,null,null,null,null,null,null,null,null,null,null,null,null,null,null,null,null,null,null,null,null,null,null,null,null,null,null,null,null,null,null,null,null,null,null,null,"N/A","N/A","N/A","N/A","N/A","N/A","N/A","N/A","N/A","N/A",1,1,1,1,1,1,1,1,1,1]
[null,null,null,null,null,null,null,null,null,null,null,null,null,null,null,null,null,null,null,null,null,null,null,null,null,null,null,null,null,null,null,null,null,null,null,null,null,null,null,null,null,null,null,null,null,null,null,null,null,null,"N/A","N/A","N/A","N/A","N/A","N/A","N/A","N/A","N/A","N/A",1,1,1,1,1,1,1,1,1,1]
[null,null,null,null,null,null,null,null,null,null,null,null,null,null,null,null,null,null,null,null,null,null,null,null,null,null,null,null,null,null,null,null,null,null,null,null,null,null,null,null,null,null,null,null,null,null,null,null,null,null,"N/A","N/A","N/A","N/A","N/A","N/A","N/A","N/A","N/A","N/A",1,1,1,1,1,1,1,1,1,1]
[null,null,null,null,null,null,null,null,null,null,null,null,null,null,null,null,null,null,null,null,null,null,null,null,null,null,null,null,null,null,null,null,null,null,null,null,null,null,null,null,null,null,null,null,null,null,null,null,null,null,{"$f":"IF(COUNTA(E675:J675)>0,(COUNTIF(E675:J675,\"=0\")*0+COUNTIF(E675:J675,\"=1\")*100+COUNTIF(E675:J675,\"=2\")*80+COUNTIF(E675:J675,\"=3\")*50+COUNTIF(E675:J675,\"=8\")*20+COUNTIF(E675:J675,\"=9\")*0)/COUNTA(E675:J675)/100,\"N/A\")","v":"N/A"},{"$f":"IF(COUNTA(K675:O675)>0,(COUNTIF(K675:O675,\"=0\")*0+COUNTIF(K675:O675,\"=1\")*100+COUNTIF(K675:O675,\"=2\")*80+COUNTIF(K675:O675,\"=3\")*50+COUNTIF(K675:O675,\"=8\")*20+COUNTIF(K675:O675,\"=9\")*0)/COUNTA(K675:O675)/100,\"N/A\")","v":"N/A"},{"$f":"IF(COUNTA(P675:U675)>0,(COUNTIF(P675:U675,\"=0\")*0+COUNTIF(P675:U675,\"=1\")*100+COUNTIF(P675:U675,\"=2\")*80+COUNTIF(P675:U675,\"=3\")*50+COUNTIF(P675:U675,\"=8\")*20+COUNTIF(P675:U675,\"=9\")*0)/COUNTA(P675:U675)/100,\"N/A\")","v":"N/A"},{"$f":"IF(COUNTA(V675)<>0,(COUNTIF(V675,\"=0\")*0+COUNTIF(V675,\"=1\")*100+COUNTIF(V675,\"=2\")*80+COUNTIF(V675,\"=3\")*50+COUNTIF(V675,\"=8\")*20+COUNTIF(V675,\"=9\")*0)/COUNTA(V675)/100,\"N/A\")","v":"N/A"},{"$f":"IF(COUNTA(W675:X675)>0,(COUNTIF(W675:X675,\"=0\")*0+COUNTIF(W675:X675,\"=1\")*100+COUNTIF(W675:X675,\"=2\")*80+COUNTIF(W675:X675,\"=3\")*50+COUNTIF(W675:X675,\"=8\")*20+COUNTIF(W675:X675,\"=9\")*0)/COUNTA(W675:X675)/100,\"N/A\")","v":"N/A"},{"$f":"IF(COUNTA(Y675:AJ675)>0,(COUNTIF(Y675:AJ675,\"=0\")*0+COUNTIF(Y675:AJ675,\"=1\")*100+COUNTIF(Y675:AJ675,\"=2\")*80+COUNTIF(Y675:AJ675,\"=3\")*50+COUNTIF(Y675:AJ675,\"=8\")*20+COUNTIF(Y675:AJ675,\"=9\")*0)/COUNTA(Y675:AJ675)/100,\"N/A\")","v":"N/A"},{"$f":"IF(COUNTA(AK675:AP675)>0,(COUNTIF(AK675:AP675,\"=0\")*0+COUNTIF(AK675:AP675,\"=1\")*100+COUNTIF(AK675:AP675,\"=2\")*80+COUNTIF(AK675:AP675,\"=3\")*50+COUNTIF(AK675:AP675,\"=8\")*20+COUNTIF(AK675:AP675,\"=9\")*0)/COUNTA(AK675:AP675)/100,\"N/A\")","v":"N/A"},{"$f":"IF(COUNTA(AQ675:AU675)>0,(COUNTIF(AQ675:AU675,\"=0\")*0+COUNTIF(AQ675:AU675,\"=1\")*100+COUNTIF(AQ675:AU675,\"=2\")*80+COUNTIF(AQ675:AU675,\"=3\")*50+COUNTIF(AQ675:AU675,\"=8\")*20+COUNTIF(AQ675:AU675,\"=9\")*0)/COUNTA(AQ675:AU675)/100,\"N/A\")","v":"N/A"},{"$f":"IF(COUNTA(AV675:AX675)>0,(COUNTIF(AV675:AX675,\"=0\")*0+COUNTIF(AV675:AX675,\"=1\")*100+COUNTIF(AV675:AX675,\"=2\")*80+COUNTIF(AV675:AX675,\"=3\")*50+COUNTIF(AV675:AX675,\"=8\")*20+COUNTIF(AV675:AX675,\"=9\")*0)/COUNTA(AV675:AX675)/100,\"N/A\")","v":"N/A"},{"$f":"IF(AND(COUNTA(E675:AX675)<>0,B675<>\"\"),AVERAGE(BA675:BG675),\"N/A\")","v":"N/A"},1,1,1,1,1,1,1,1,1,1]
[null,null,null,null,null,null,null,null,null,null,null,null,null,null,null,null,null,null,null,null,null,null,null,null,null,null,null,null,null,null,null,null,null,null,null,null,null,null,null,null,null,null,null,null,null,null,null,null,null,null,{"$f":"IF(COUNTA(E676:J676)>0,(COUNTIF(E676:J676,\"=0\")*0+COUNTIF(E676:J676,\"=1\")*100+COUNTIF(E676:J676,\"=2\")*80+COUNTIF(E676:J676,\"=3\")*50+COUNTIF(E676:J676,\"=8\")*20+COUNTIF(E676:J676,\"=9\")*0)/COUNTA(E676:J676)/100,\"N/A\")","v":"N/A"},{"$f":"IF(COUNTA(K676:O676)>0,(COUNTIF(K676:O676,\"=0\")*0+COUNTIF(K676:O676,\"=1\")*100+COUNTIF(K676:O676,\"=2\")*80+COUNTIF(K676:O676,\"=3\")*50+COUNTIF(K676:O676,\"=8\")*20+COUNTIF(K676:O676,\"=9\")*0)/COUNTA(K676:O676)/100,\"N/A\")","v":"N/A"},{"$f":"IF(COUNTA(P676:U676)>0,(COUNTIF(P676:U676,\"=0\")*0+COUNTIF(P676:U676,\"=1\")*100+COUNTIF(P676:U676,\"=2\")*80+COUNTIF(P676:U676,\"=3\")*50+COUNTIF(P676:U676,\"=8\")*20+COUNTIF(P676:U676,\"=9\")*0)/COUNTA(P676:U676)/100,\"N/A\")","v":"N/A"},{"$f":"IF(COUNTA(V676)<>0,(COUNTIF(V676,\"=0\")*0+COUNTIF(V676,\"=1\")*100+COUNTIF(V676,\"=2\")*80+COUNTIF(V676,\"=3\")*50+COUNTIF(V676,\"=8\")*20+COUNTIF(V676,\"=9\")*0)/COUNTA(V676)/100,\"N/A\")","v":"N/A"},{"$f":"IF(COUNTA(W676:X676)>0,(COUNTIF(W676:X676,\"=0\")*0+COUNTIF(W676:X676,\"=1\")*100+COUNTIF(W676:X676,\"=2\")*80+COUNTIF(W676:X676,\"=3\")*50+COUNTIF(W676:X676,\"=8\")*20+COUNTIF(W676:X676,\"=9\")*0)/COUNTA(W676:X676)/100,\"N/A\")","v":"N/A"},{"$f":"IF(COUNTA(Y676:AJ676)>0,(COUNTIF(Y676:AJ676,\"=0\")*0+COUNTIF(Y676:AJ676,\"=1\")*100+COUNTIF(Y676:AJ676,\"=2\")*80+COUNTIF(Y676:AJ676,\"=3\")*50+COUNTIF(Y676:AJ676,\"=8\")*20+COUNTIF(Y676:AJ676,\"=9\")*0)/COUNTA(Y676:AJ676)/100,\"N/A\")","v":"N/A"},{"$f":"IF(COUNTA(AK676:AP676)>0,(COUNTIF(AK676:AP676,\"=0\")*0+COUNTIF(AK676:AP676,\"=1\")*100+COUNTIF(AK676:AP676,\"=2\")*80+COUNTIF(AK676:AP676,\"=3\")*50+COUNTIF(AK676:AP676,\"=8\")*20+COUNTIF(AK676:AP676,\"=9\")*0)/COUNTA(AK676:AP676)/100,\"N/A\")","v":"N/A"},{"$f":"IF(COUNTA(AQ676:AU676)>0,(COUNTIF(AQ676:AU676,\"=0\")*0+COUNTIF(AQ676:AU676,\"=1\")*100+COUNTIF(AQ676:AU676,\"=2\")*80+COUNTIF(AQ676:AU676,\"=3\")*50+COUNTIF(AQ676:AU676,\"=8\")*20+COUNTIF(AQ676:AU676,\"=9\")*0)/COUNTA(AQ676:AU676)/100,\"N/A\")","v":"N/A"},{"$f":"IF(COUNTA(AV676:AX676)>0,(COUNTIF(AV676:AX676,\"=0\")*0+COUNTIF(AV676:AX676,\"=1\")*100+COUNTIF(AV676:AX676,\"=2\")*80+COUNTIF(AV676:AX676,\"=3\")*50+COUNTIF(AV676:AX676,\"=8\")*20+COUNTIF(AV676:AX676,\"=9\")*0)/COUNTA(AV676:AX676)/100,\"N/A\")","v":"N/A"},{"$f":"IF(AND(COUNTA(E676:AX676)<>0,B676<>\"\"),AVERAGE(BA676:BG676),\"N/A\")","v":"N/A"},1,1,1,1,1,1,1,1,1,1]
[null,null,null,null,null,null,null,null,null,null,null,null,null,null,null,null,null,null,null,null,null,null,null,null,null,null,null,null,null,null,null,null,null,null,null,null,null,null,null,null,null,null,null,null,null,null,null,null,null,null,"N/A","N/A","N/A","N/A","N/A","N/A","N/A","N/A","N/A","N/A",1,1,1,1,1,1,1,1,1,1]
[null,null,null,null,null,null,null,null,null,null,null,null,null,null,null,null,null,null,null,null,null,null,null,null,null,null,null,null,null,null,null,null,null,null,null,null,null,null,null,null,null,null,null,null,null,null,null,null,null,null,"N/A","N/A","N/A","N/A","N/A","N/A","N/A","N/A","N/A","N/A",1,1,1,1,1,1,1,1,1,1]
[null,null,null,null,null,null,null,null,null,null,null,null,null,null,null,null,null,null,null,null,null,null,null,null,null,null,null,null,null,null,null,null,null,null,null,null,null,null,null,null,null,null,null,null,null,null,null,null,null,null,"N/A",{"$f":"IF(COUNTA(K679:O679)>0,(COUNTIF(K679:O679,\"=0\")*0+COUNTIF(K679:O679,\"=1\")*100+COUNTIF(K679:O679,\"=2\")*80+COUNTIF(K679:O679,\"=3\")*50+COUNTIF(K679:O679,\"=8\")*20+COUNTIF(K679:O679,\"=9\")*0)/COUNTA(K679:O679)/100,\"N/A\")","v":"N/A"},"N/A","N/A","N/A","N/A","N/A","N/A","N/A","N/A",1,1,1,1,1,1,1,1,1,1]
[null,null,null,null,null,null,null,null,null,null,null,null,null,null,null,null,null,null,null,null,null,null,null,null,null,null,null,null,null,null,null,null,null,null,null,null,null,null,null,null,null,null,null,null,null,null,null,null,null,null,"N/A",{"$f":"IF(COUNTA(K680:O680)>0,(COUNTIF(K680:O680,\"=0\")*0+COUNTIF(K680:O680,\"=1\")*100+COUNTIF(K680:O680,\"=2\")*80+COUNTIF(K680:O680,\"=3\")*50+COUNTIF(K680:O680,\"=8\")*20+COUNTIF(K680:O680,\"=9\")*0)/COUNTA(K680:O680)/100,\"N/A\")","v":"N/A"},"N/A","N/A","N/A","N/A","N/A","N/A","N/A","N/A",1,1,1,1,1,1,1,1,1,1]
[null,null,null,null,null,null,null,null,null,null,null,null,null,null,null,null,null,null,null,null,null,null,null,null,null,null,null,null,null,null,null,null,null,null,null,null,null,null,null,null,null,null,null,null,null,null,null,null,null,null,"N/A","N/A","N/A","N/A","N/A","N/A","N/A","N/A","N/A","N/A",1,1,1,1,1,1,1,1,1,1]
[null,null,null,null,null,null,null,null,null,null,null,null,null,null,null,null,null,null,null,null,null,null,null,null,null,null,null,null,null,null,null,null,null,null,null,null,null,null,null,null,null,null,null,null,null,null,null,null,null,null,"N/A","N/A","N/A","N/A","N/A","N/A","N/A","N/A","N/A","N/A",1,1,1,1,1,1,1,1,1,1]
[null,null,null,null,null,null,null,null,null,null,null,null,null,null,null,null,null,null,null,null,null,null,null,null,null,null,null,null,null,null,null,null,null,null,null,null,null,null,null,null,null,null,null,null,null,null,null,null,null,null,"N/A","N/A","N/A","N/A","N/A","N/A","N/A","N/A","N/A","N/A",1,1,1,1,1,1,1,1,1,1]
[null,null,null,null,null,null,null,null,null,null,null,null,null,null,null,null,null,null,null,null,null,null,null,null,null,null,null,null,null,null,null,null,null,null,null,null,null,null,null,null,null,null,null,null,null,null,null,null,null,null,"N/A","N/A","N/A","N/A","N/A","N/A","N/A","N/A","N/A","N/A",1,1,1,1,1,1,1,1,1,1]
[null,null,null,null,null,null,null,null,null,null,null,null,null,null,null,null,null,null,null,null,null,null,null,null,null,null,null,null,null,null,null,null,null,null,null,null,null,null,null,null,null,null,null,null,null,null,null,null,null,null,"N/A","N/A","N/A","N/A","N/A","N/A","N/A","N/A","N/A","N/A",1,1,1,1,1,1,1,1,1,1]
[null,null,null,null,null,null,null,null,null,null,null,null,null,null,null,null,null,null,null,null,null,null,null,null,null,null,null,null,null,null,null,null,null,null,null,null,null,null,null,null,null,null,null,null,null,null,null,null,null,null,"N/A","N/A","N/A","N/A","N/A","N/A","N/A","N/A","N/A","N/A",1,1,1,1,1,1,1,1,1,1]
[null,null,null,null,null,null,null,null,null,null,null,null,null,null,null,null,null,null,null,null,null,null,null,null,null,null,null,null,null,null,null,null,null,null,null,null,null,null,null,null,null,null,null,null,null,null,null,null,null,null,"N/A","N/A","N/A","N/A","N/A","N/A","N/A","N/A","N/A","N/A",1,1,1,1,1,1,1,1,1,1]
[null,null,null,null,null,null,null,null,null,null,null,null,null,null,null,null,null,null,null,null,null,null,null,null,null,null,null,null,null,null,null,null,null,null,null,null,null,null,null,null,null,null,null,null,null,null,null,null,null,null,"N/A","N/A","N/A","N/A","N/A","N/A","N/A","N/A","N/A","N/A",1,1,1,1,1,1,1,1,1,1]
[null,null,null,null,null,null,null,null,null,null,null,null,null,null,null,null,null,null,null,null,null,null,null,null,null,null,null,null,null,null,null,null,null,null,null,null,null,null,null,null,null,null,null,null,null,null,null,null,null,null,"N/A","N/A","N/A","N/A","N/A","N/A","N/A","N/A","N/A","N/A",1,1,1,1,1,1,1,1,1,1]
[null,null,null,null,null,null,null,null,null,null,null,null,null,null,null,null,null,null,null,null,null,null,null,null,null,null,null,null,null,null,null,null,null,null,null,null,null,null,null,null,null,null,null,null,null,null,null,null,null,null,"N/A","N/A","N/A","N/A","N/A","N/A","N/A","N/A","N/A","N/A",1,1,1,1,1,1,1,1,1,1]
[null,null,null,null,null,null,null,null,null,null,null,null,null,null,null,null,null,null,null,null,null,null,null,null,null,null,null,null,null,null,null,null,null,null,null,null,null,null,null,null,null,null,null,null,null,null,null,null,null,null,"N/A","N/A","N/A","N/A","N/A","N/A","N/A","N/A","N/A","N/A",1,1,1,1,1,1,1,1,1,1]
[null,null,null,null,null,null,null,null,null,null,null,null,null,null,null,null,null,null,null,null,null,null,null,null,null,null,null,null,null,null,null,null,null,null,null,null,null,null,null,null,null,null,null,null,null,null,null,null,null,null,"N/A","N/A","N/A","N/A","N/A","N/A","N/A","N/A","N/A","N/A",1,1,1,1,1,1,1,1,1,1]
[null,null,null,null,null,null,null,null,null,null,null,null,null,null,null,null,null,null,null,null,null,null,null,null,null,null,null,null,null,null,null,null,null,null,null,null,null,null,null,null,null,null,null,null,null,null,null,null,null,null,"N/A","N/A","N/A","N/A","N/A","N/A","N/A","N/A","N/A","N/A",1,1,1,1,1,1,1,1,1,1]
[null,null,null,null,null,null,null,null,null,null,null,null,null,null,null,null,null,null,null,null,null,null,null,null,null,null,null,null,null,null,null,null,null,null,null,null,null,null,null,null,null,null,null,null,null,null,null,null,null,null,"N/A","N/A","N/A","N/A","N/A","N/A","N/A","N/A","N/A","N/A",1,1,1,1,1,1,1,1,1,1]
[null,null,null,null,null,null,null,null,null,null,null,null,null,null,null,null,null,null,null,null,null,null,null,null,null,null,null,null,null,null,null,null,null,null,null,null,null,null,null,null,null,null,null,null,null,null,null,null,null,null,"N/A","N/A","N/A","N/A","N/A","N/A","N/A","N/A","N/A","N/A",1,1,1,1,1,1,1,1,1,1]
[null,null,null,null,null,null,null,null,null,null,null,null,null,null,null,null,null,null,null,null,null,null,null,null,null,null,null,null,null,null,null,null,null,null,null,null,null,null,null,null,null,null,null,null,null,null,null,null,null,null,"N/A","N/A","N/A","N/A","N/A","N/A","N/A","N/A","N/A","N/A",1,1,1,1,1,1,1,1,1,1]
[null,null,null,null,null,null,null,null,null,null,null,null,null,null,null,null,null,null,null,null,null,null,null,null,null,null,null,null,null,null,null,null,null,null,null,null,null,null,null,null,null,null,null,null,null,null,null,null,null,null,"N/A","N/A","N/A","N/A","N/A","N/A","N/A","N/A","N/A","N/A",1,1,1,1,1,1,1,1,1,{"$f":"IF(BH697=\"N/A\",1,\"\")","v":1}]
[null,null,null,null,null,null,null,null,null,null,null,null,null,null,null,null,null,null,null,null,null,null,null,null,null,null,null,null,null,null,null,null,null,null,null,null,null,null,null,null,null,null,null,null,null,null,null,null,null,null,"N/A","N/A","N/A","N/A","N/A","N/A","N/A","N/A","N/A","N/A",{"$f":"IF(AY698=\"N/A\",1,\"\")","v":1},{"$f":"IF(AZ698=\"N/A\",1,\"\")","v":1},{"$f":"IF(BA698=\"N/A\",1,\"\")","v":1},{"$f":"IF(BB698=\"N/A\",1,\"\")","v":1},{"$f":"IF(BC698=\"N/A\",1,\"\")","v":1},{"$f":"IF(BD698=\"N/A\",1,\"\")","v":1},{"$f":"IF(BE698=\"N/A\",1,\"\")","v":1},1,1,1]
[null,null,null,null,null,null,null,null,null,null,null,null,null,null,null,null,null,null,null,null,null,null,null,null,null,null,null,null,null,null,null,null,null,null,null,null,null,null,null,null,null,null,null,null,null,null,null,null,null,null,"N/A","N/A","N/A","N/A","N/A","N/A","N/A","N/A","N/A","N/A",1,1,1,1,1,1,1,1,1,1]
[null,null,null,null,null,null,null,null,null,null,null,null,null,null,null,null,null,null,null,null,null,null,null,null,null,null,null,null,null,null,null,null,null,null,null,null,null,null,null,null,null,null,null,null,null,null,null,null,null,null,"N/A","N/A","N/A","N/A","N/A","N/A","N/A","N/A","N/A","N/A",1,1,1,1,1,1,1,1,1,1]
[null,null,null,null,null,null,null,null,null,null,null,null,null,null,null,null,null,null,null,null,null,null,null,null,null,null,null,null,null,null,null,null,null,null,null,null,null,null,null,null,null,null,null,null,null,null,null,null,null,null,"N/A","N/A","N/A","N/A","N/A","N/A","N/A","N/A","N/A","N/A",1,1,1,1,1,1,1,1,1,1]
[null,null,null,null,null,null,null,null,null,null,null,null,null,null,null,null,null,null,null,null,null,null,null,null,null,null,null,null,null,null,null,null,null,null,null,null,null,null,null,null,null,null,null,null,null,null,null,null,null,null,"N/A","N/A","N/A","N/A","N/A","N/A","N/A","N/A","N/A","N/A",1,1,1,1,1,1,1,1,1,1]
[null,null,null,null,null,null,null,null,null,null,null,null,null,null,null,null,null,null,null,null,null,null,null,null,null,null,null,null,null,null,null,null,null,null,null,null,null,null,null,null,null,null,null,null,null,null,null,null,null,null,"N/A","N/A","N/A","N/A","N/A","N/A","N/A","N/A","N/A","N/A",1,1,1,1,1,1,1,1,1,1]
[null,null,null,null,null,null,null,null,null,null,null,null,null,null,null,null,null,null,null,null,null,null,null,null,null,null,null,null,null,null,null,null,null,null,null,null,null,null,null,null,null,null,null,null,null,null,null,null,null,null,"N/A","N/A","N/A","N/A","N/A","N/A","N/A","N/A","N/A","N/A",1,1,1,1,1,1,1,1,1,1]
[null,null,null,null,null,null,null,null,null,null,null,null,null,null,null,null,null,null,null,null,null,null,null,null,null,null,null,null,null,null,null,null,null,null,null,null,null,null,null,null,null,null,null,null,null,null,null,null,null,null,"N/A","N/A","N/A","N/A","N/A","N/A","N/A","N/A","N/A","N/A",1,1,1,1,1,1,1,1,1,1]
[null,null,null,null,null,null,null,null,null,null,null,null,null,null,null,null,null,null,null,null,null,null,null,null,null,null,null,null,null,null,null,null,null,null,null,null,null,null,null,null,null,null,null,null,null,null,null,null,null,null,"N/A","N/A","N/A","N/A","N/A","N/A","N/A","N/A","N/A","N/A",1,1,1,1,1,1,1,1,1,1]
[null,null,null,null,null,null,null,null,null,null,null,null,null,null,null,null,null,null,null,null,null,null,null,null,null,null,null,null,null,null,null,null,null,null,null,null,null,null,null,null,null,null,null,null,null,null,null,null,null,null,"N/A","N/A","N/A","N/A","N/A","N/A","N/A","N/A","N/A","N/A",1,1,1,1,1,1,1,1,1,1]
[null,null,null,null,null,null,null,null,null,null,null,null,null,null,null,null,null,null,null,null,null,null,null,null,null,null,null,null,null,null,null,null,null,null,null,null,null,null,null,null,null,null,null,null,null,null,null,null,null,null,"N/A","N/A","N/A","N/A","N/A","N/A","N/A","N/A","N/A","N/A",1,1,1,1,1,1,1,1,1,1]
[null,null,null,null,null,null,null,null,null,null,null,null,null,null,null,null,null,null,null,null,null,null,null,null,null,null,null,null,null,null,null,null,null,null,null,null,null,null,null,null,null,null,null,null,null,null,null,null,null,null,"N/A","N/A","N/A","N/A","N/A","N/A","N/A","N/A","N/A","N/A",1,1,1,1,1,1,1,1,1,1]
[null,null,null,null,null,null,null,null,null,null,null,null,null,null,null,null,null,null,null,null,null,null,null,null,null,null,null,null,null,null,null,null,null,null,null,null,null,null,null,null,null,null,null,null,null,null,null,null,null,null,"N/A","N/A","N/A","N/A","N/A","N/A","N/A","N/A","N/A","N/A",1,1,1,1,1,1,1,1,1,1]
[null,null,null,null,null,null,null,null,null,null,null,null,null,null,null,null,null,null,null,null,null,null,null,null,null,null,null,null,null,null,null,null,null,null,null,null,null,null,null,null,null,null,null,null,null,null,null,null,null,null,"N/A","N/A","N/A","N/A","N/A","N/A","N/A","N/A","N/A","N/A",1,1,1,1,1,1,1,1,1,1]
[null,null,null,null,null,null,null,null,null,null,null,null,null,null,null,null,null,null,null,null,null,null,null,null,null,null,null,null,null,null,null,null,null,null,null,null,null,null,null,null,null,null,null,null,null,null,null,null,null,null,"N/A","N/A","N/A","N/A","N/A","N/A","N/A","N/A","N/A","N/A",1,1,1,1,1,1,1,1,1,1]
[null,null,null,null,null,null,null,null,null,null,null,null,null,null,null,null,null,null,null,null,null,null,null,null,null,null,null,null,null,null,null,null,null,null,null,null,null,null,null,null,null,null,null,null,null,null,null,null,null,null,"N/A","N/A","N/A","N/A","N/A","N/A","N/A","N/A","N/A","N/A",1,1,1,1,1,1,1,1,1,1]
[null,null,null,null,null,null,null,null,null,null,null,null,null,null,null,null,null,null,null,null,null,null,null,null,null,null,null,null,null,null,null,null,null,null,null,null,null,null,null,null,null,null,null,null,null,null,null,null,null,null,"N/A","N/A","N/A","N/A","N/A","N/A","N/A","N/A","N/A","N/A",1,1,1,1,1,1,1,1,1,1]
[null,null,null,null,null,null,null,null,null,null,null,null,null,null,null,null,null,null,null,null,null,null,null,null,null,null,null,null,null,null,null,null,null,null,null,null,null,null,null,null,null,null,null,null,null,null,null,null,null,null,"N/A","N/A","N/A","N/A","N/A","N/A","N/A","N/A","N/A","N/A",1,1,1,1,1,1,1,1,1,1]
[null,null,null,null,null,null,null,null,null,null,null,null,null,null,null,null,null,null,null,null,null,null,null,null,null,null,null,null,null,null,null,null,null,null,null,null,null,null,null,null,null,null,null,null,null,null,null,null,null,null,"N/A","N/A","N/A","N/A","N/A","N/A","N/A","N/A","N/A","N/A",1,1,1,1,1,1,1,1,1,1]
[null,null,null,null,null,null,null,null,null,null,null,null,null,null,null,null,null,null,null,null,null,null,null,null,null,null,null,null,null,null,null,null,null,null,null,null,null,null,null,null,null,null,null,null,null,null,null,null,null,null,"N/A","N/A","N/A","N/A","N/A","N/A","N/A","N/A","N/A","N/A",1,1,1,1,1,1,1,1,1,1]
[null,null,null,null,null,null,null,null,null,null,null,null,null,null,null,null,null,null,null,null,null,null,null,null,null,null,null,null,null,null,null,null,null,null,null,null,null,null,null,null,null,null,null,null,null,null,null,null,null,null,"N/A","N/A","N/A","N/A","N/A","N/A","N/A","N/A","N/A","N/A",1,1,1,1,1,1,1,1,1,1]
[null,null,null,null,null,null,null,null,null,null,null,null,null,null,null,null,null,null,null,null,null,null,null,null,null,null,null,null,null,null,null,null,null,null,null,null,null,null,null,null,null,null,null,null,null,null,null,null,null,null,"N/A","N/A","N/A","N/A","N/A","N/A","N/A","N/A","N/A","N/A",1,1,1,1,1,1,1,1,1,1]
[null,null,null,null,null,null,null,null,null,null,null,null,null,null,null,null,null,null,null,null,null,null,null,null,null,null,null,null,null,null,null,null,null,null,null,null,null,null,null,null,null,null,null,null,null,null,null,null,null,null,"N/A","N/A","N/A","N/A","N/A","N/A","N/A","N/A","N/A","N/A",1,1,1,1,1,1,1,{"$f":"IF(BF720=\"N/A\",1,\"\")","v":1},{"$f":"IF(BG720=\"N/A\",1,\"\")","v":1},1]
[null,null,null,null,null,null,null,null,null,null,null,null,null,null,null,null,null,null,null,null,null,null,null,null,null,null,null,null,null,null,null,null,null,null,null,null,null,null,null,null,null,null,null,null,null,null,null,null,null,null,"N/A","N/A","N/A","N/A","N/A","N/A","N/A","N/A","N/A","N/A",1,1,1,1,1,1,1,1,1,1]
[null,null,null,null,null,null,null,null,null,null,null,null,null,null,null,null,null,null,null,null,null,null,null,null,null,null,null,null,null,null,null,null,null,null,null,null,null,null,null,null,null,null,null,null,null,null,null,null,null,null,"N/A","N/A","N/A","N/A","N/A","N/A","N/A","N/A","N/A","N/A",1,1,1,1,1,1,1,1,1,1]
[null,null,null,null,null,null,null,null,null,null,null,null,null,null,null,null,null,null,null,null,null,null,null,null,null,null,null,null,null,null,null,null,null,null,null,null,null,null,null,null,null,null,null,null,null,null,null,null,null,null,"N/A","N/A","N/A","N/A","N/A","N/A","N/A","N/A","N/A","N/A",1,1,1,1,1,1,1,1,1,1]
[null,null,null,null,null,null,null,null,null,null,null,null,null,null,null,null,null,null,null,null,null,null,null,null,null,null,null,null,null,null,null,null,null,null,null,null,null,null,null,null,null,null,null,null,null,null,null,null,null,null,"N/A","N/A","N/A","N/A","N/A","N/A","N/A","N/A","N/A","N/A",1,1,1,1,1,1,1,1,1,1]
[null,null,null,null,null,null,null,null,null,null,null,null,null,null,null,null,null,null,null,null,null,null,null,null,null,null,null,null,null,null,null,null,null,null,null,null,null,null,null,null,null,null,null,null,null,null,null,null,null,null,"N/A","N/A","N/A","N/A","N/A","N/A","N/A","N/A","N/A","N/A",1,1,1,1,1,1,1,1,1,1]
[null,null,null,null,null,null,null,null,null,null,null,null,null,null,null,null,null,null,null,null,null,null,null,null,null,null,null,null,null,null,null,null,null,null,null,null,null,null,null,null,null,null,null,null,null,null,null,null,null,null,"N/A","N/A","N/A","N/A","N/A","N/A","N/A","N/A","N/A","N/A",1,1,1,1,1,1,1,1,1,1]
[null,null,null,null,null,null,null,null,null,null,null,null,null,null,null,null,null,null,null,null,null,null,null,null,null,null,null,null,null,null,null,null,null,null,null,null,null,null,null,null,null,null,null,null,null,null,null,null,null,null,"N/A","N/A","N/A","N/A","N/A","N/A","N/A","N/A","N/A","N/A",1,1,1,1,1,1,1,1,1,1]
[null,null,null,null,null,null,null,null,null,null,null,null,null,null,null,null,null,null,null,null,null,null,null,null,null,null,null,null,null,null,null,null,null,null,null,null,null,null,null,null,null,null,null,null,null,null,null,null,null,null,"N/A","N/A","N/A","N/A","N/A","N/A","N/A","N/A","N/A","N/A",1,1,1,1,1,1,1,1,1,1]
[null,null,null,null,null,null,null,null,null,null,null,null,null,null,null,null,null,null,null,null,null,null,null,null,null,null,null,null,null,null,null,null,null,null,null,null,null,null,null,null,null,null,null,null,null,null,null,null,null,null,"N/A","N/A","N/A","N/A","N/A","N/A","N/A","N/A","N/A","N/A",1,1,1,1,1,1,1,1,1,1]
[null,null,null,null,null,null,null,null,null,null,null,null,null,null,null,null,null,null,null,null,null,null,null,null,null,null,null,null,null,null,null,null,null,null,null,null,null,null,null,null,null,null,null,null,null,null,null,null,null,null,"N/A","N/A","N/A","N/A","N/A","N/A","N/A","N/A","N/A","N/A",1,1,1,1,1,1,1,1,1,1]
[null,null,null,null,null,null,null,null,null,null,null,null,null,null,null,null,null,null,null,null,null,null,null,null,null,null,null,null,null,null,null,null,null,null,null,null,null,null,null,null,null,null,null,null,null,null,null,null,null,null,"N/A","N/A","N/A","N/A","N/A","N/A","N/A","N/A","N/A","N/A",1,1,1,1,1,1,1,1,1,1]
[null,null,null,null,null,null,null,null,null,null,null,null,null,null,null,null,null,null,null,null,null,null,null,null,null,null,null,null,null,null,null,null,null,null,null,null,null,null,null,null,null,null,null,null,null,null,null,null,null,null,"N/A","N/A","N/A","N/A","N/A","N/A","N/A","N/A","N/A","N/A",1,1,1,1,1,1,1,1,1,1]
[null,null,null,null,null,null,null,null,null,null,null,null,null,null,null,null,null,null,null,null,null,null,null,null,null,null,null,null,null,null,null,null,null,null,null,null,null,null,null,null,null,null,null,null,null,null,null,null,null,null,"N/A","N/A","N/A","N/A","N/A","N/A","N/A","N/A","N/A","N/A",1,1,1,1,1,1,1,1,1,1]
[null,null,null,null,null,null,null,null,null,null,null,null,null,null,null,null,null,null,null,null,null,null,null,null,null,null,null,null,null,null,null,null,null,null,null,null,null,null,null,null,null,null,null,null,null,null,null,null,null,null,"N/A","N/A","N/A","N/A","N/A","N/A","N/A","N/A","N/A","N/A",1,1,1,1,1,1,1,1,1,1]
[null,null,null,null,null,null,null,null,null,null,null,null,null,null,null,null,null,null,null,null,null,null,null,null,null,null,null,null,null,null,null,null,null,null,null,null,null,null,null,null,null,null,null,null,null,null,null,null,null,null,"N/A","N/A","N/A","N/A","N/A","N/A","N/A","N/A","N/A","N/A",1,1,1,1,1,1,1,1,1,1]
[null,null,null,null,null,null,null,null,null,null,null,null,null,null,null,null,null,null,null,null,null,null,null,null,null,null,null,null,null,null,null,null,null,null,null,null,null,null,null,null,null,null,null,null,null,null,null,null,null,null,"N/A","N/A","N/A","N/A","N/A","N/A","N/A","N/A","N/A","N/A",1,1,1,1,1,1,1,1,1,1]
[null,null,null,null,null,null,null,null,null,null,null,null,null,null,null,null,null,null,null,null,null,null,null,null,null,null,null,null,null,null,null,null,null,null,null,null,null,null,null,null,null,null,null,null,null,null,null,null,null,null,"N/A","N/A","N/A","N/A","N/A","N/A","N/A","N/A","N/A","N/A",1,1,1,1,1,1,1,1,1,1]
[null,null,null,null,null,null,null,null,null,null,null,null,null,null,null,null,null,null,null,null,null,null,null,null,null,null,null,null,null,null,null,null,null,null,null,null,null,null,null,null,null,null,null,null,null,null,null,null,null,null,"N/A","N/A","N/A","N/A","N/A","N/A","N/A","N/A","N/A","N/A",1,1,1,1,1,1,1,1,1,1]
[null,null,null,null,null,null,null,null,null,null,null,null,null,null,null,null,null,null,null,null,null,null,null,null,null,null,null,null,null,null,null,null,null,null,null,null,null,null,null,null,null,null,null,null,null,null,null,null,null,null,"N/A","N/A","N/A","N/A","N/A","N/A","N/A","N/A","N/A","N/A",1,1,1,1,1,1,1,1,1,1]
[null,null,null,null,null,null,null,null,null,null,null,null,null,null,null,null,null,null,null,null,null,null,null,null,null,null,null,null,null,null,null,null,null,null,null,null,null,null,null,null,null,null,null,null,null,null,null,null,null,null,{"$f":"IF(COUNTA(E740:J740)>0,(COUNTIF(E740:J740,\"=0\")*0+COUNTIF(E740:J740,\"=1\")*100+COUNTIF(E740:J740,\"=2\")*80+COUNTIF(E740:J740,\"=3\")*50+COUNTIF(E740:J740,\"=8\")*20+COUNTIF(E740:J740,\"=9\")*0)/COUNTA(E740:J740)/100,\"N/A\")","v":"N/A"},"N/A",{"$f":"IF(COUNTA(P740:U740)>0,(COUNTIF(P740:U740,\"=0\")*0+COUNTIF(P740:U740,\"=1\")*100+COUNTIF(P740:U740,\"=2\")*80+COUNTIF(P740:U740,\"=3\")*50+COUNTIF(P740:U740,\"=8\")*20+COUNTIF(P740:U740,\"=9\")*0)/COUNTA(P740:U740)/100,\"N/A\")","v":"N/A"},{"$f":"IF(COUNTA(V740)<>0,(COUNTIF(V740,\"=0\")*0+COUNTIF(V740,\"=1\")*100+COUNTIF(V740,\"=2\")*80+COUNTIF(V740,\"=3\")*50+COUNTIF(V740,\"=8\")*20+COUNTIF(V740,\"=9\")*0)/COUNTA(V740)/100,\"N/A\")","v":"N/A"},{"$f":"IF(COUNTA(W740:X740)>0,(COUNTIF(W740:X740,\"=0\")*0+COUNTIF(W740:X740,\"=1\")*100+COUNTIF(W740:X740,\"=2\")*80+COUNTIF(W740:X740,\"=3\")*50+COUNTIF(W740:X740,\"=8\")*20+COUNTIF(W740:X740,\"=9\")*0)/COUNTA(W740:X740)/100,\"N/A\")","v":"N/A"},{"$f":"IF(COUNTA(Y740:AJ740)>0,(COUNTIF(Y740:AJ740,\"=0\")*0+COUNTIF(Y740:AJ740,\"=1\")*100+COUNTIF(Y740:AJ740,\"=2\")*80+COUNTIF(Y740:AJ740,\"=3\")*50+COUNTIF(Y740:AJ740,\"=8\")*20+COUNTIF(Y740:AJ740,\"=9\")*0)/COUNTA(Y740:AJ740)/100,\"N/A\")","v":"N/A"},{"$f":"IF(COUNTA(AK740:AP740)>0,(COUNTIF(AK740:AP740,\"=0\")*0+COUNTIF(AK740:AP740,\"=1\")*100+COUNTIF(AK740:AP740,\"=2\")*80+COUNTIF(AK740:AP740,\"=3\")*50+COUNTIF(AK740:AP740,\"=8\")*20+COUNTIF(AK740:AP740,\"=9\")*0)/COUNTA(AK740:AP740)/100,\"N/A\")","v":"N/A"},{"$f":"IF(COUNTA(AQ740:AU740)>0,(COUNTIF(AQ740:AU740,\"=0\")*0+COUNTIF(AQ740:AU740,\"=1\")*100+COUNTIF(AQ740:AU740,\"=2\")*80+COUNTIF(AQ740:AU740,\"=3\")*50+COUNTIF(AQ740:AU740,\"=8\")*20+COUNTIF(AQ740:AU740,\"=9\")*0)/COUNTA(AQ740:AU740)/100,\"N/A\")","v":"N/A"},{"$f":"IF(COUNTA(AV740:AX740)>0,(COUNTIF(AV740:AX740,\"=0\")*0+COUNTIF(AV740:AX740,\"=1\")*100+COUNTIF(AV740:AX740,\"=2\")*80+COUNTIF(AV740:AX740,\"=3\")*50+COUNTIF(AV740:AX740,\"=8\")*20+COUNTIF(AV740:AX740,\"=9\")*0)/COUNTA(AV740:AX740)/100,\"N/A\")","v":"N/A"},{"$f":"IF(AND(COUNTA(E740:AX740)<>0,B740<>\"\"),AVERAGE(BA740:BG740),\"N/A\")","v":"N/A"},1,1,1,1,1,1,1,1,1,1]
[null,null,null,null,null,null,null,null,null,null,null,null,null,null,null,null,null,null,null,null,null,null,null,null,null,null,null,null,null,null,null,null,null,null,null,null,null,null,null,null,null,null,null,null,null,null,null,null,null,null,"N/A","N/A","N/A","N/A","N/A","N/A","N/A","N/A","N/A","N/A",1,1,1,1,1,1,1,1,1,1]
[null,null,null,null,null,null,null,null,null,null,null,null,null,null,null,null,null,null,null,null,null,null,null,null,null,null,null,null,null,null,null,null,null,null,null,null,null,null,null,null,null,null,null,null,null,null,null,null,null,null,"N/A","N/A","N/A","N/A","N/A","N/A","N/A","N/A","N/A","N/A",1,1,1,1,1,1,1,1,1,1]
[null,null,null,null,null,null,null,null,null,null,null,null,null,null,null,null,null,null,null,null,null,null,null,null,null,null,null,null,null,null,null,null,null,null,null,null,null,null,null,null,null,null,null,null,null,null,null,null,null,null,"N/A","N/A","N/A","N/A","N/A","N/A","N/A","N/A","N/A","N/A",1,1,1,1,1,1,1,1,1,1]
[null,null,null,null,null,null,null,null,null,null,null,null,null,null,null,null,null,null,null,null,null,null,null,null,null,null,null,null,null,null,null,null,null,null,null,null,null,null,null,null,null,null,null,null,null,null,null,null,null,null,"N/A",{"$f":"IF(COUNTA(K744:O744)>0,(COUNTIF(K744:O744,\"=0\")*0+COUNTIF(K744:O744,\"=1\")*100+COUNTIF(K744:O744,\"=2\")*80+COUNTIF(K744:O744,\"=3\")*50+COUNTIF(K744:O744,\"=8\")*20+COUNTIF(K744:O744,\"=9\")*0)/COUNTA(K744:O744)/100,\"N/A\")","v":"N/A"},"N/A","N/A","N/A","N/A","N/A","N/A","N/A","N/A",1,1,1,1,1,1,1,1,1,1]
[null,null,null,null,null,null,null,null,null,null,null,null,null,null,null,null,null,null,null,null,null,null,null,null,null,null,null,null,null,null,null,null,null,null,null,null,null,null,null,null,null,null,null,null,null,null,null,null,null,null,"N/A","N/A","N/A","N/A","N/A","N/A","N/A","N/A","N/A","N/A",1,1,1,1,1,1,1,1,1,1]
[null,null,null,null,null,null,null,null,null,null,null,null,null,null,null,null,null,null,null,null,null,null,null,null,null,null,null,null,null,null,null,null,null,null,null,null,null,null,null,null,null,null,null,null,null,null,null,null,null,null,"N/A","N/A","N/A","N/A","N/A","N/A","N/A","N/A","N/A","N/A",1,1,1,1,1,1,1,1,1,1]
[null,null,null,null,null,null,null,null,null,null,null,null,null,null,null,null,null,null,null,null,null,null,null,null,null,null,null,null,null,null,null,null,null,null,null,null,null,null,null,null,null,null,null,null,null,null,null,null,null,null,"N/A","N/A","N/A","N/A","N/A","N/A","N/A","N/A","N/A","N/A",1,1,1,1,1,1,1,1,1,1]
[null,null,null,null,null,null,null,null,null,null,null,null,null,null,null,null,null,null,null,null,null,null,null,null,null,null,null,null,null,null,null,null,null,null,null,null,null,null,null,null,null,null,null,null,null,null,null,null,null,null,"N/A","N/A","N/A","N/A","N/A","N/A","N/A","N/A","N/A","N/A",1,1,1,1,1,1,1,1,1,1]
[null,null,null,null,null,null,null,null,null,null,null,null,null,null,null,null,null,null,null,null,null,null,null,null,null,null,null,null,null,null,null,null,null,null,null,null,null,null,null,null,null,null,null,null,null,null,null,null,null,null,"N/A","N/A","N/A","N/A","N/A","N/A","N/A","N/A","N/A","N/A",1,1,1,1,1,1,1,1,1,1]
[null,null,null,null,null,null,null,null,null,null,null,null,null,null,null,null,null,null,null,null,null,null,null,null,null,null,null,null,null,null,null,null,null,null,null,null,null,null,null,null,null,null,null,null,null,null,null,null,null,null,"N/A","N/A","N/A","N/A","N/A","N/A","N/A","N/A","N/A","N/A",1,1,1,1,1,1,1,1,1,1]
[null,null,null,null,null,null,null,null,null,null,null,null,null,null,null,null,null,null,null,null,null,null,null,null,null,null,null,null,null,null,null,null,null,null,null,null,null,null,null,null,null,null,null,null,null,null,null,null,null,null,"N/A","N/A","N/A","N/A","N/A","N/A","N/A","N/A","N/A","N/A",1,1,1,1,1,1,1,1,1,1]
[null,null,null,null,null,null,null,null,null,null,null,null,null,null,null,null,null,null,null,null,null,null,null,null,null,null,null,null,null,null,null,null,null,null,null,null,null,null,null,null,null,null,null,null,null,null,null,null,null,null,"N/A","N/A","N/A","N/A","N/A","N/A","N/A","N/A","N/A","N/A",1,1,1,1,1,1,1,1,1,1]
[null,null,null,null,null,null,null,null,null,null,null,null,null,null,null,null,null,null,null,null,null,null,null,null,null,null,null,null,null,null,null,null,null,null,null,null,null,null,null,null,null,null,null,null,null,null,null,null,null,null,"N/A","N/A","N/A","N/A","N/A","N/A","N/A","N/A","N/A","N/A",1,1,1,1,1,1,1,1,1,1]
[null,null,null,null,null,null,null,null,null,null,null,null,null,null,null,null,null,null,null,null,null,null,null,null,null,null,null,null,null,null,null,null,null,null,null,null,null,null,null,null,null,null,null,null,null,null,null,null,null,null,"N/A","N/A","N/A","N/A","N/A","N/A","N/A","N/A","N/A","N/A",1,1,1,1,1,1,1,1,1,1]
[null,null,null,null,null,null,null,null,null,null,null,null,null,null,null,null,null,null,null,null,null,null,null,null,null,null,null,null,null,null,null,null,null,null,null,null,null,null,null,null,null,null,null,null,null,null,null,null,null,null,"N/A","N/A","N/A","N/A","N/A","N/A","N/A","N/A","N/A","N/A",1,1,1,1,1,1,1,1,1,1]
[null,null,null,null,null,null,null,null,null,null,null,null,null,null,null,null,null,null,null,null,null,null,null,null,null,null,null,null,null,null,null,null,null,null,null,null,null,null,null,null,null,null,null,null,null,null,null,null,null,null,"N/A","N/A","N/A","N/A","N/A","N/A","N/A","N/A","N/A","N/A",1,1,1,1,1,1,1,1,1,1]
[null,null,null,null,null,null,null,null,null,null,null,null,null,null,null,null,null,null,null,null,null,null,null,null,null,null,null,null,null,null,null,null,null,null,null,null,null,null,null,null,null,null,null,null,null,null,null,null,null,null,"N/A","N/A","N/A","N/A","N/A","N/A","N/A","N/A","N/A","N/A",1,1,1,1,1,1,1,1,1,1]
[null,null,null,null,null,null,null,null,null,null,null,null,null,null,null,null,null,null,null,null,null,null,null,null,null,null,null,null,null,null,null,null,null,null,null,null,null,null,null,null,null,null,null,null,null,null,null,null,null,null,"N/A","N/A","N/A","N/A","N/A","N/A","N/A","N/A","N/A","N/A",1,1,1,1,1,1,1,1,1,1]
[null,null,null,null,null,null,null,null,null,null,null,null,null,null,null,null,null,null,null,null,null,null,null,null,null,null,null,null,null,null,null,null,null,null,null,null,null,null,null,null,null,null,null,null,null,null,null,null,null,null,"N/A","N/A","N/A","N/A","N/A","N/A","N/A","N/A","N/A","N/A",1,1,1,1,1,1,1,1,1,1]
[null,null,null,null,null,null,null,null,null,null,null,null,null,null,null,null,null,null,null,null,null,null,null,null,null,null,null,null,null,null,null,null,null,null,null,null,null,null,null,null,null,null,null,null,null,null,null,null,null,null,"N/A","N/A","N/A","N/A","N/A","N/A","N/A","N/A","N/A","N/A",1,1,1,1,1,1,1,1,1,1]
[null,null,null,null,null,null,null,null,null,null,null,null,null,null,null,null,null,null,null,null,null,null,null,null,null,null,null,null,null,null,null,null,null,null,null,null,null,null,null,null,null,null,null,null,null,null,null,null,null,null,"N/A","N/A","N/A","N/A","N/A","N/A","N/A","N/A","N/A","N/A",1,1,1,1,1,1,1,1,1,{"$f":"IF(BH761=\"N/A\",1,\"\")","v":1}]
[null,null,null,null,null,null,null,null,null,null,null,null,null,null,null,null,null,null,null,null,null,null,null,null,null,null,null,null,null,null,null,null,null,null,null,null,null,null,null,null,null,null,null,null,null,null,null,null,null,null,"N/A","N/A","N/A","N/A","N/A","N/A","N/A","N/A","N/A","N/A",{"$f":"IF(AY762=\"N/A\",1,\"\")","v":1},{"$f":"IF(AZ762=\"N/A\",1,\"\")","v":1},{"$f":"IF(BA762=\"N/A\",1,\"\")","v":1},{"$f":"IF(BB762=\"N/A\",1,\"\")","v":1},{"$f":"IF(BC762=\"N/A\",1,\"\")","v":1},{"$f":"IF(BD762=\"N/A\",1,\"\")","v":1},{"$f":"IF(BE762=\"N/A\",1,\"\")","v":1},1,1,1]
[null,null,null,null,null,null,null,null,null,null,null,null,null,null,null,null,null,null,null,null,null,null,null,null,null,null,null,null,null,null,null,null,null,null,null,null,null,null,null,null,null,null,null,null,null,null,null,null,null,null,"N/A","N/A","N/A","N/A","N/A","N/A","N/A","N/A","N/A","N/A",1,1,1,1,1,1,1,1,1,1]
[null,null,null,null,null,null,null,null,null,null,null,null,null,null,null,null,null,null,null,null,null,null,null,null,null,null,null,null,null,null,null,null,null,null,null,null,null,null,null,null,null,null,null,null,null,null,null,null,null,null,"N/A","N/A","N/A","N/A","N/A","N/A","N/A","N/A","N/A","N/A",1,1,1,1,1,1,1,1,1,1]
[null,null,null,null,null,null,null,null,null,null,null,null,null,null,null,null,null,null,null,null,null,null,null,null,null,null,null,null,null,null,null,null,null,null,null,null,null,null,null,null,null,null,null,null,null,null,null,null,null,null,"N/A","N/A","N/A","N/A","N/A","N/A","N/A","N/A","N/A","N/A",1,1,1,1,1,1,1,1,1,1]
[null,null,null,null,null,null,null,null,null,null,null,null,null,null,null,null,null,null,null,null,null,null,null,null,null,null,null,null,null,null,null,null,null,null,null,null,null,null,null,null,null,null,null,null,null,null,null,null,null,null,"N/A","N/A","N/A","N/A","N/A","N/A","N/A","N/A","N/A","N/A",1,1,1,1,1,1,1,1,1,1]
[null,null,null,null,null,null,null,null,null,null,null,null,null,null,null,null,null,null,null,null,null,null,null,null,null,null,null,null,null,null,null,null,null,null,null,null,null,null,null,null,null,null,null,null,null,null,null,null,null,null,"N/A","N/A","N/A","N/A","N/A","N/A","N/A","N/A","N/A","N/A",1,1,1,1,1,1,1,1,1,1]
[null,null,null,null,null,null,null,null,null,null,null,null,null,null,null,null,null,null,null,null,null,null,null,null,null,null,null,null,null,null,null,null,null,null,null,null,null,null,null,null,null,null,null,null,null,null,null,null,null,null,"N/A","N/A","N/A","N/A","N/A","N/A","N/A","N/A","N/A","N/A",1,1,1,1,1,1,1,1,1,1]
[null,null,null,null,null,null,null,null,null,null,null,null,null,null,null,null,null,null,null,null,null,null,null,null,null,null,null,null,null,null,null,null,null,null,null,null,null,null,null,null,null,null,null,null,null,null,null,null,null,null,"N/A","N/A","N/A","N/A","N/A","N/A","N/A","N/A","N/A","N/A",1,1,1,1,1,1,1,1,1,1]
[null,null,null,null,null,null,null,null,null,null,null,null,null,null,null,null,null,null,null,null,null,null,null,null,null,null,null,null,null,null,null,null,null,null,null,null,null,null,null,null,null,null,null,null,null,null,null,null,null,null,"N/A","N/A","N/A","N/A","N/A","N/A","N/A","N/A","N/A","N/A",1,1,1,1,1,1,1,1,1,1]
[null,null,null,null,null,null,null,null,null,null,null,null,null,null,null,null,null,null,null,null,null,null,null,null,null,null,null,null,null,null,null,null,null,null,null,null,null,null,null,null,null,null,null,null,null,null,null,null,null,null,"N/A","N/A","N/A","N/A","N/A","N/A","N/A","N/A","N/A","N/A",1,1,1,1,1,1,1,1,1,1]
[null,null,null,null,null,null,null,null,null,null,null,null,null,null,null,null,null,null,null,null,null,null,null,null,null,null,null,null,null,null,null,null,null,null,null,null,null,null,null,null,null,null,null,null,null,null,null,null,null,null,"N/A","N/A","N/A","N/A","N/A","N/A","N/A","N/A","N/A","N/A",1,1,1,1,1,1,1,1,1,1]
[null,null,null,null,null,null,null,null,null,null,null,null,null,null,null,null,null,null,null,null,null,null,null,null,null,null,null,null,null,null,null,null,null,null,null,null,null,null,null,null,null,null,null,null,null,null,null,null,null,null,"N/A","N/A","N/A","N/A","N/A","N/A","N/A","N/A","N/A","N/A",1,1,1,1,1,1,1,1,1,1]
[null,null,null,null,null,null,null,null,null,null,null,null,null,null,null,null,null,null,null,null,null,null,null,null,null,null,null,null,null,null,null,null,null,null,null,null,null,null,null,null,null,null,null,null,null,null,null,null,null,null,"N/A","N/A","N/A","N/A","N/A","N/A","N/A","N/A","N/A","N/A",1,1,1,1,1,1,1,1,1,1]
[null,null,null,null,null,null,null,null,null,null,null,null,null,null,null,null,null,null,null,null,null,null,null,null,null,null,null,null,null,null,null,null,null,null,null,null,null,null,null,null,null,null,null,null,null,null,null,null,null,null,"N/A","N/A","N/A","N/A","N/A","N/A","N/A","N/A","N/A","N/A",1,1,1,1,1,1,1,1,1,1]
[null,null,null,null,null,null,null,null,null,null,null,null,null,null,null,null,null,null,null,null,null,null,null,null,null,null,null,null,null,null,null,null,null,null,null,null,null,null,null,null,null,null,null,null,null,null,null,null,null,null,"N/A","N/A","N/A","N/A","N/A","N/A","N/A","N/A","N/A","N/A",1,1,1,1,1,1,1,1,1,1]
[null,null,null,null,null,null,null,null,null,null,null,null,null,null,null,null,null,null,null,null,null,null,null,null,null,null,null,null,null,null,null,null,null,null,null,null,null,null,null,null,null,null,null,null,null,null,null,null,null,null,"N/A","N/A","N/A","N/A","N/A","N/A","N/A","N/A","N/A","N/A",1,1,1,1,1,1,1,1,1,1]
[null,null,null,null,null,null,null,null,null,null,null,null,null,null,null,null,null,null,null,null,null,null,null,null,null,null,null,null,null,null,null,null,null,null,null,null,null,null,null,null,null,null,null,null,null,null,null,null,null,null,"N/A","N/A","N/A","N/A","N/A","N/A","N/A","N/A","N/A","N/A",1,1,1,1,1,1,1,1,1,1]
[null,null,null,null,null,null,null,null,null,null,null,null,null,null,null,null,null,null,null,null,null,null,null,null,null,null,null,null,null,null,null,null,null,null,null,null,null,null,null,null,null,null,null,null,null,null,null,null,null,null,"N/A","N/A","N/A","N/A","N/A","N/A","N/A","N/A","N/A","N/A",1,1,1,1,1,1,1,1,1,1]
[null,null,null,null,null,null,null,null,null,null,null,null,null,null,null,null,null,null,null,null,null,null,null,null,null,null,null,null,null,null,null,null,null,null,null,null,null,null,null,null,null,null,null,null,null,null,null,null,null,null,"N/A","N/A","N/A","N/A","N/A","N/A","N/A","N/A","N/A","N/A",1,1,1,1,1,1,1,1,1,1]
[null,null,null,null,null,null,null,null,null,null,null,null,null,null,null,null,null,null,null,null,null,null,null,null,null,null,null,null,null,null,null,null,null,null,null,null,null,null,null,null,null,null,null,null,null,null,null,null,null,null,"N/A","N/A","N/A","N/A","N/A","N/A","N/A","N/A","N/A","N/A",1,1,1,1,1,1,1,1,1,1]
[null,null,null,null,null,null,null,null,null,null,null,null,null,null,null,null,null,null,null,null,null,null,null,null,null,null,null,null,null,null,null,null,null,null,null,null,null,null,null,null,null,null,null,null,null,null,null,null,null,null,"N/A","N/A","N/A","N/A","N/A","N/A","N/A","N/A","N/A","N/A",1,1,1,1,1,1,1,1,1,1]
[null,null,null,null,null,null,null,null,null,null,null,null,null,null,null,null,null,null,null,null,null,null,null,null,null,null,null,null,null,null,null,null,null,null,null,null,null,null,null,null,null,null,null,null,null,null,null,null,null,null,"N/A","N/A","N/A","N/A","N/A","N/A","N/A","N/A","N/A","N/A",1,1,1,1,1,1,1,1,1,1]
[null,null,null,null,null,null,null,null,null,null,null,null,null,null,null,null,null,null,null,null,null,null,null,null,null,null,null,null,null,null,null,null,null,null,null,null,null,null,null,null,null,null,null,null,null,null,null,null,null,null,"N/A","N/A","N/A","N/A","N/A","N/A","N/A","N/A","N/A","N/A",1,1,1,1,1,1,1,{"$f":"IF(BF784=\"N/A\",1,\"\")","v":1},{"$f":"IF(BG784=\"N/A\",1,\"\")","v":1},1]
[null,null,null,null,null,null,null,null,null,null,null,null,null,null,null,null,null,null,null,null,null,null,null,null,null,null,null,null,null,null,null,null,null,null,null,null,null,null,null,null,null,null,null,null,null,null,null,null,null,null,"N/A","N/A","N/A","N/A","N/A","N/A","N/A","N/A","N/A","N/A",1,1,1,1,1,1,1,1,1,1]
[null,null,null,null,null,null,null,null,null,null,null,null,null,null,null,null,null,null,null,null,null,null,null,null,null,null,null,null,null,null,null,null,null,null,null,null,null,null,null,null,null,null,null,null,null,null,null,null,null,null,"N/A","N/A","N/A","N/A","N/A","N/A","N/A","N/A","N/A","N/A",1,1,1,1,1,1,1,1,1,1]
[null,null,null,null,null,null,null,null,null,null,null,null,null,null,null,null,null,null,null,null,null,null,null,null,null,null,null,null,null,null,null,null,null,null,null,null,null,null,null,null,null,null,null,null,null,null,null,null,null,null,"N/A","N/A","N/A","N/A","N/A","N/A","N/A","N/A","N/A","N/A",1,1,1,1,1,1,1,1,1,1]
[null,null,null,null,null,null,null,null,null,null,null,null,null,null,null,null,null,null,null,null,null,null,null,null,null,null,null,null,null,null,null,null,null,null,null,null,null,null,null,null,null,null,null,null,null,null,null,null,null,null,"N/A","N/A","N/A","N/A","N/A","N/A","N/A","N/A","N/A","N/A",1,1,1,1,1,1,1,1,1,1]
[null,null,null,null,null,null,null,null,null,null,null,null,null,null,null,null,null,null,null,null,null,null,null,null,null,null,null,null,null,null,null,null,null,null,null,null,null,null,null,null,null,null,null,null,null,null,null,null,null,null,"N/A","N/A","N/A","N/A","N/A","N/A","N/A","N/A","N/A","N/A",1,1,1,1,1,1,1,1,1,1]
[null,null,null,null,null,null,null,null,null,null,null,null,null,null,null,null,null,null,null,null,null,null,null,null,null,null,null,null,null,null,null,null,null,null,null,null,null,null,null,null,null,null,null,null,null,null,null,null,null,null,"N/A","N/A","N/A","N/A","N/A","N/A","N/A","N/A","N/A","N/A",1,1,1,1,1,1,1,1,1,1]
[null,null,null,null,null,null,null,null,null,null,null,null,null,null,null,null,null,null,null,null,null,null,null,null,null,null,null,null,null,null,null,null,null,null,null,null,null,null,null,null,null,null,null,null,null,null,null,null,null,null,"N/A","N/A","N/A","N/A","N/A","N/A","N/A","N/A","N/A","N/A",1,1,1,1,1,1,1,1,1,1]
[null,null,null,null,null,null,null,null,null,null,null,null,null,null,null,null,null,null,null,null,null,null,null,null,null,null,null,null,null,null,null,null,null,null,null,null,null,null,null,null,null,null,null,null,null,null,null,null,null,null,"N/A","N/A","N/A","N/A","N/A","N/A","N/A","N/A","N/A","N/A",1,1,1,1,1,1,1,1,1,1]
[null,null,null,null,null,null,null,null,null,null,null,null,null,null,null,null,null,null,null,null,null,null,null,null,null,null,null,null,null,null,null,null,null,null,null,null,null,null,null,null,null,null,null,null,null,null,null,null,null,null,"N/A","N/A","N/A","N/A","N/A","N/A","N/A","N/A","N/A","N/A",1,1,1,1,1,1,1,1,1,1]
[null,null,null,null,null,null,null,null,null,null,null,null,null,null,null,null,null,null,null,null,null,null,null,null,null,null,null,null,null,null,null,null,null,null,null,null,null,null,null,null,null,null,null,null,null,null,null,null,null,null,"N/A","N/A","N/A","N/A","N/A","N/A","N/A","N/A","N/A","N/A",1,1,1,1,1,1,1,1,1,1]
[null,null,null,null,null,null,null,null,null,null,null,null,null,null,null,null,null,null,null,null,null,null,null,null,null,null,null,null,null,null,null,null,null,null,null,null,null,null,null,null,null,null,null,null,null,null,null,null,null,null,"N/A","N/A","N/A","N/A","N/A","N/A","N/A","N/A","N/A","N/A",1,1,1,1,1,1,1,1,1,1]
[null,null,null,null,null,null,null,null,null,null,null,null,null,null,null,null,null,null,null,null,null,null,null,null,null,null,null,null,null,null,null,null,null,null,null,null,null,null,null,null,null,null,null,null,null,null,null,null,null,null,"N/A","N/A","N/A","N/A","N/A","N/A","N/A","N/A","N/A","N/A",1,1,1,1,1,1,1,1,1,1]
[null,null,null,null,null,null,null,null,null,null,null,null,null,null,null,null,null,null,null,null,null,null,null,null,null,null,null,null,null,null,null,null,null,null,null,null,null,null,null,null,null,null,null,null,null,null,null,null,null,null,"N/A","N/A","N/A","N/A","N/A","N/A","N/A","N/A","N/A","N/A",1,1,1,1,1,1,1,1,1,1]
[null,null,null,null,null,null,null,null,null,null,null,null,null,null,null,null,null,null,null,null,null,null,null,null,null,null,null,null,null,null,null,null,null,null,null,null,null,null,null,null,null,null,null,null,null,null,null,null,null,null,"N/A","N/A","N/A","N/A","N/A","N/A","N/A","N/A","N/A","N/A",1,1,1,1,1,1,1,1,1,1]
[null,null,null,null,null,null,null,null,null,null,null,null,null,null,null,null,null,null,null,null,null,null,null,null,null,null,null,null,null,null,null,null,null,null,null,null,null,null,null,null,null,null,null,null,null,null,null,null,null,null,"N/A","N/A","N/A","N/A","N/A","N/A","N/A","N/A","N/A","N/A",1,1,1,1,1,1,1,1,1,1]
[null,null,null,null,null,null,null,null,null,null,null,null,null,null,null,null,null,null,null,null,null,null,null,null,null,null,null,null,null,null,null,null,null,null,null,null,null,null,null,null,null,null,null,null,null,null,null,null,null,null,"N/A","N/A","N/A","N/A","N/A","N/A","N/A","N/A","N/A","N/A",1,1,1,1,1,1,1,1,1,1]
[null,null,null,null,null,null,null,null,null,null,null,null,null,null,null,null,null,null,null,null,null,null,null,null,null,null,null,null,null,null,null,null,null,null,null,null,null,null,null,null,null,null,null,null,null,null,null,null,null,null,"N/A","N/A","N/A","N/A","N/A","N/A","N/A","N/A","N/A","N/A",1,1,1,1,1,1,1,1,1,1]
[null,null,null,null,null,null,null,null,null,null,null,null,null,null,null,null,null,null,null,null,null,null,null,null,null,null,null,null,null,null,null,null,null,null,null,null,null,null,null,null,null,null,null,null,null,null,null,null,null,null,"N/A","N/A","N/A","N/A","N/A","N/A","N/A","N/A","N/A","N/A",1,1,1,1,1,1,1,1,1,1]
[null,null,null,null,null,null,null,null,null,null,null,null,null,null,null,null,null,null,null,null,null,null,null,null,null,null,null,null,null,null,null,null,null,null,null,null,null,null,null,null,null,null,null,null,null,null,null,null,null,null,"N/A","N/A","N/A","N/A","N/A","N/A","N/A","N/A","N/A","N/A",1,1,1,1,1,1,1,1,1,1]
[null,null,null,null,null,null,null,null,null,null,null,null,null,null,null,null,null,null,null,null,null,null,null,null,null,null,null,null,null,null,null,null,null,null,null,null,null,null,null,null,null,null,null,null,null,null,null,null,null,null,{"$f":"IF(COUNTA(E804:J804)>0,(COUNTIF(E804:J804,\"=0\")*0+COUNTIF(E804:J804,\"=1\")*100+COUNTIF(E804:J804,\"=2\")*80+COUNTIF(E804:J804,\"=3\")*50+COUNTIF(E804:J804,\"=8\")*20+COUNTIF(E804:J804,\"=9\")*0)/COUNTA(E804:J804)/100,\"N/A\")","v":"N/A"},"N/A",{"$f":"IF(COUNTA(P804:U804)>0,(COUNTIF(P804:U804,\"=0\")*0+COUNTIF(P804:U804,\"=1\")*100+COUNTIF(P804:U804,\"=2\")*80+COUNTIF(P804:U804,\"=3\")*50+COUNTIF(P804:U804,\"=8\")*20+COUNTIF(P804:U804,\"=9\")*0)/COUNTA(P804:U804)/100,\"N/A\")","v":"N/A"},{"$f":"IF(COUNTA(V804)<>0,(COUNTIF(V804,\"=0\")*0+COUNTIF(V804,\"=1\")*100+COUNTIF(V804,\"=2\")*80+COUNTIF(V804,\"=3\")*50+COUNTIF(V804,\"=8\")*20+COUNTIF(V804,\"=9\")*0)/COUNTA(V804)/100,\"N/A\")","v":"N/A"},{"$f":"IF(COUNTA(W804:X804)>0,(COUNTIF(W804:X804,\"=0\")*0+COUNTIF(W804:X804,\"=1\")*100+COUNTIF(W804:X804,\"=2\")*80+COUNTIF(W804:X804,\"=3\")*50+COUNTIF(W804:X804,\"=8\")*20+COUNTIF(W804:X804,\"=9\")*0)/COUNTA(W804:X804)/100,\"N/A\")","v":"N/A"},{"$f":"IF(COUNTA(Y804:AJ804)>0,(COUNTIF(Y804:AJ804,\"=0\")*0+COUNTIF(Y804:AJ804,\"=1\")*100+COUNTIF(Y804:AJ804,\"=2\")*80+COUNTIF(Y804:AJ804,\"=3\")*50+COUNTIF(Y804:AJ804,\"=8\")*20+COUNTIF(Y804:AJ804,\"=9\")*0)/COUNTA(Y804:AJ804)/100,\"N/A\")","v":"N/A"},{"$f":"IF(COUNTA(AK804:AP804)>0,(COUNTIF(AK804:AP804,\"=0\")*0+COUNTIF(AK804:AP804,\"=1\")*100+COUNTIF(AK804:AP804,\"=2\")*80+COUNTIF(AK804:AP804,\"=3\")*50+COUNTIF(AK804:AP804,\"=8\")*20+COUNTIF(AK804:AP804,\"=9\")*0)/COUNTA(AK804:AP804)/100,\"N/A\")","v":"N/A"},{"$f":"IF(COUNTA(AQ804:AU804)>0,(COUNTIF(AQ804:AU804,\"=0\")*0+COUNTIF(AQ804:AU804,\"=1\")*100+COUNTIF(AQ804:AU804,\"=2\")*80+COUNTIF(AQ804:AU804,\"=3\")*50+COUNTIF(AQ804:AU804,\"=8\")*20+COUNTIF(AQ804:AU804,\"=9\")*0)/COUNTA(AQ804:AU804)/100,\"N/A\")","v":"N/A"},{"$f":"IF(COUNTA(AV804:AX804)>0,(COUNTIF(AV804:AX804,\"=0\")*0+COUNTIF(AV804:AX804,\"=1\")*100+COUNTIF(AV804:AX804,\"=2\")*80+COUNTIF(AV804:AX804,\"=3\")*50+COUNTIF(AV804:AX804,\"=8\")*20+COUNTIF(AV804:AX804,\"=9\")*0)/COUNTA(AV804:AX804)/100,\"N/A\")","v":"N/A"},{"$f":"IF(AND(COUNTA(E804:AX804)<>0,B804<>\"\"),AVERAGE(BA804:BG804),\"N/A\")","v":"N/A"},1,1,1,1,1,1,1,1,1,1]
[null,null,null,null,null,null,null,null,null,null,null,null,null,null,null,null,null,null,null,null,null,null,null,null,null,null,null,null,null,null,null,null,null,null,null,null,null,null,null,null,null,null,null,null,null,null,null,null,null,null,"N/A","N/A","N/A","N/A","N/A","N/A","N/A","N/A","N/A","N/A",1,1,1,1,1,1,1,1,1,1]
[null,null,null,null,null,null,null,null,null,null,null,null,null,null,null,null,null,null,null,null,null,null,null,null,null,null,null,null,null,null,null,null,null,null,null,null,null,null,null,null,null,null,null,null,null,null,null,null,null,null,"N/A","N/A","N/A","N/A","N/A","N/A","N/A","N/A","N/A","N/A",1,1,1,1,1,1,1,1,1,1]
[null,null,null,null,null,null,null,null,null,null,null,null,null,null,null,null,null,null,null,null,null,null,null,null,null,null,null,null,null,null,null,null,null,null,null,null,null,null,null,null,null,null,null,null,null,null,null,null,null,null,"N/A","N/A","N/A","N/A","N/A","N/A","N/A","N/A","N/A","N/A",1,1,1,1,1,1,1,1,1,1]
[null,null,null,null,null,null,null,null,null,null,null,null,null,null,null,null,null,null,null,null,null,null,null,null,null,null,null,null,null,null,null,null,null,null,null,null,null,null,null,null,null,null,null,null,null,null,null,null,null,null,"N/A",{"$f":"IF(COUNTA(K808:O808)>0,(COUNTIF(K808:O808,\"=0\")*0+COUNTIF(K808:O808,\"=1\")*100+COUNTIF(K808:O808,\"=2\")*80+COUNTIF(K808:O808,\"=3\")*50+COUNTIF(K808:O808,\"=8\")*20+COUNTIF(K808:O808,\"=9\")*0)/COUNTA(K808:O808)/100,\"N/A\")","v":"N/A"},"N/A","N/A","N/A","N/A","N/A","N/A","N/A","N/A",1,1,1,1,1,1,1,1,1,1]
[null,null,null,null,null,null,null,null,null,null,null,null,null,null,null,null,null,null,null,null,null,null,null,null,null,null,null,null,null,null,null,null,null,null,null,null,null,null,null,null,null,null,null,null,null,null,null,null,null,null,"N/A","N/A","N/A","N/A","N/A","N/A","N/A","N/A","N/A","N/A",1,1,1,1,1,1,1,1,1,1]
[null,null,null,null,null,null,null,null,null,null,null,null,null,null,null,null,null,null,null,null,null,null,null,null,null,null,null,null,null,null,null,null,null,null,null,null,null,null,null,null,null,null,null,null,null,null,null,null,null,null,"N/A","N/A","N/A","N/A","N/A","N/A","N/A","N/A","N/A","N/A",1,1,1,1,1,1,1,1,1,1]
[null,null,null,null,null,null,null,null,null,null,null,null,null,null,null,null,null,null,null,null,null,null,null,null,null,null,null,null,null,null,null,null,null,null,null,null,null,null,null,null,null,null,null,null,null,null,null,null,null,null,"N/A","N/A","N/A","N/A","N/A","N/A","N/A","N/A","N/A","N/A",1,1,1,1,1,1,1,1,1,1]
[null,null,null,null,null,null,null,null,null,null,null,null,null,null,null,null,null,null,null,null,null,null,null,null,null,null,null,null,null,null,null,null,null,null,null,null,null,null,null,null,null,null,null,null,null,null,null,null,null,null,"N/A","N/A","N/A","N/A","N/A","N/A","N/A","N/A","N/A","N/A",1,1,1,1,1,1,1,1,1,1]
[null,null,null,null,null,null,null,null,null,null,null,null,null,null,null,null,null,null,null,null,null,null,null,null,null,null,null,null,null,null,null,null,null,null,null,null,null,null,null,null,null,null,null,null,null,null,null,null,null,null,"N/A","N/A","N/A","N/A","N/A","N/A","N/A","N/A","N/A","N/A",1,1,1,1,1,1,1,1,1,1]
[null,null,null,null,null,null,null,null,null,null,null,null,null,null,null,null,null,null,null,null,null,null,null,null,null,null,null,null,null,null,null,null,null,null,null,null,null,null,null,null,null,null,null,null,null,null,null,null,null,null,"N/A","N/A","N/A","N/A","N/A","N/A","N/A","N/A","N/A","N/A",1,1,1,1,1,1,1,1,1,1]
[null,null,null,null,null,null,null,null,null,null,null,null,null,null,null,null,null,null,null,null,null,null,null,null,null,null,null,null,null,null,null,null,null,null,null,null,null,null,null,null,null,null,null,null,null,null,null,null,null,null,"N/A","N/A","N/A","N/A","N/A","N/A","N/A","N/A","N/A","N/A",1,1,1,1,1,1,1,1,1,1]
[null,null,null,null,null,null,null,null,null,null,null,null,null,null,null,null,null,null,null,null,null,null,null,null,null,null,null,null,null,null,null,null,null,null,null,null,null,null,null,null,null,null,null,null,null,null,null,null,null,null,"N/A","N/A","N/A","N/A","N/A","N/A","N/A","N/A","N/A","N/A",1,1,1,1,1,1,1,1,1,1]
[null,null,null,null,null,null,null,null,null,null,null,null,null,null,null,null,null,null,null,null,null,null,null,null,null,null,null,null,null,null,null,null,null,null,null,null,null,null,null,null,null,null,null,null,null,null,null,null,null,null,"N/A","N/A","N/A","N/A","N/A","N/A","N/A","N/A","N/A","N/A",1,1,1,1,1,1,1,1,1,1]
[null,null,null,null,null,null,null,null,null,null,null,null,null,null,null,null,null,null,null,null,null,null,null,null,null,null,null,null,null,null,null,null,null,null,null,null,null,null,null,null,null,null,null,null,null,null,null,null,null,null,"N/A","N/A","N/A","N/A","N/A","N/A","N/A","N/A","N/A","N/A",1,1,1,1,1,1,1,1,1,1]
[null,null,null,null,null,null,null,null,null,null,null,null,null,null,null,null,null,null,null,null,null,null,null,null,null,null,null,null,null,null,null,null,null,null,null,null,null,null,null,null,null,null,null,null,null,null,null,null,null,null,"N/A","N/A","N/A","N/A","N/A","N/A","N/A","N/A","N/A","N/A",1,1,1,1,1,1,1,1,1,1]
[null,null,null,null,null,null,null,null,null,null,null,null,null,null,null,null,null,null,null,null,null,null,null,null,null,null,null,null,null,null,null,null,null,null,null,null,null,null,null,null,null,null,null,null,null,null,null,null,null,null,"N/A","N/A","N/A","N/A","N/A","N/A","N/A","N/A","N/A","N/A",1,1,1,1,1,1,1,1,1,1]
[null,null,null,null,null,null,null,null,null,null,null,null,null,null,null,null,null,null,null,null,null,null,null,null,null,null,null,null,null,null,null,null,null,null,null,null,null,null,null,null,null,null,null,null,null,null,null,null,null,null,"N/A","N/A","N/A","N/A","N/A","N/A","N/A","N/A","N/A","N/A",1,1,1,1,1,1,1,1,1,1]
[null,null,null,null,null,null,null,null,null,null,null,null,null,null,null,null,null,null,null,null,null,null,null,null,null,null,null,null,null,null,null,null,null,null,null,null,null,null,null,null,null,null,null,null,null,null,null,null,null,null,"N/A","N/A","N/A","N/A","N/A","N/A","N/A","N/A","N/A","N/A",1,1,1,1,1,1,1,1,1,1]
[null,null,null,null,null,null,null,null,null,null,null,null,null,null,null,null,null,null,null,null,null,null,null,null,null,null,null,null,null,null,null,null,null,null,null,null,null,null,null,null,null,null,null,null,null,null,null,null,null,null,"N/A","N/A","N/A","N/A","N/A","N/A","N/A","N/A","N/A","N/A",1,1,1,1,1,1,1,1,1,1]
[null,null,null,null,null,null,null,null,null,null,null,null,null,null,null,null,null,null,null,null,null,null,null,null,null,null,null,null,null,null,null,null,null,null,null,null,null,null,null,null,null,null,null,null,null,null,null,null,null,null,"N/A","N/A","N/A","N/A","N/A","N/A","N/A","N/A","N/A","N/A",1,1,1,1,1,1,1,1,1,1]
[null,null,null,null,null,null,null,null,null,null,null,null,null,null,null,null,null,null,null,null,null,null,null,null,null,null,null,null,null,null,null,null,null,null,null,null,null,null,null,null,null,null,null,null,null,null,null,null,null,null,"N/A","N/A","N/A","N/A","N/A","N/A","N/A","N/A","N/A","N/A",1,1,1,1,1,1,1,1,1,{"$f":"IF(BH825=\"N/A\",1,\"\")","v":1}]
[null,null,null,null,null,null,null,null,null,null,null,null,null,null,null,null,null,null,null,null,null,null,null,null,null,null,null,null,null,null,null,null,null,null,null,null,null,null,null,null,null,null,null,null,null,null,null,null,null,null,"N/A","N/A","N/A","N/A","N/A","N/A","N/A","N/A","N/A","N/A",{"$f":"IF(AY826=\"N/A\",1,\"\")","v":1},{"$f":"IF(AZ826=\"N/A\",1,\"\")","v":1},{"$f":"IF(BA826=\"N/A\",1,\"\")","v":1},{"$f":"IF(BB826=\"N/A\",1,\"\")","v":1},{"$f":"IF(BC826=\"N/A\",1,\"\")","v":1},{"$f":"IF(BD826=\"N/A\",1,\"\")","v":1},{"$f":"IF(BE826=\"N/A\",1,\"\")","v":1},1,1,1]
[null,null,null,null,null,null,null,null,null,null,null,null,null,null,null,null,null,null,null,null,null,null,null,null,null,null,null,null,null,null,null,null,null,null,null,null,null,null,null,null,null,null,null,null,null,null,null,null,null,null,"N/A","N/A","N/A","N/A","N/A","N/A","N/A","N/A","N/A","N/A",1,1,1,1,1,1,1,1,1,1]
[null,null,null,null,null,null,null,null,null,null,null,null,null,null,null,null,null,null,null,null,null,null,null,null,null,null,null,null,null,null,null,null,null,null,null,null,null,null,null,null,null,null,null,null,null,null,null,null,null,null,"N/A","N/A","N/A","N/A","N/A","N/A","N/A","N/A","N/A","N/A",1,1,1,1,1,1,1,1,1,1]
[null,null,null,null,null,null,null,null,null,null,null,null,null,null,null,null,null,null,null,null,null,null,null,null,null,null,null,null,null,null,null,null,null,null,null,null,null,null,null,null,null,null,null,null,null,null,null,null,null,null,"N/A","N/A","N/A","N/A","N/A","N/A","N/A","N/A","N/A","N/A",1,1,1,1,1,1,1,1,1,1]
[null,null,null,null,null,null,null,null,null,null,null,null,null,null,null,null,null,null,null,null,null,null,null,null,null,null,null,null,null,null,null,null,null,null,null,null,null,null,null,null,null,null,null,null,null,null,null,null,null,null,"N/A","N/A","N/A","N/A","N/A","N/A","N/A","N/A","N/A","N/A",1,1,1,1,1,1,1,1,1,1]
[null,null,null,null,null,null,null,null,null,null,null,null,null,null,null,null,null,null,null,null,null,null,null,null,null,null,null,null,null,null,null,null,null,null,null,null,null,null,null,null,null,null,null,null,null,null,null,null,null,null,"N/A","N/A","N/A","N/A","N/A","N/A","N/A","N/A","N/A","N/A",1,1,1,1,1,1,1,1,1,1]
[null,null,null,null,null,null,null,null,null,null,null,null,null,null,null,null,null,null,null,null,null,null,null,null,null,null,null,null,null,null,null,null,null,null,null,null,null,null,null,null,null,null,null,null,null,null,null,null,null,null,"N/A","N/A","N/A","N/A","N/A","N/A","N/A","N/A","N/A","N/A",1,1,1,1,1,1,1,1,1,1]
[null,null,null,null,null,null,null,null,null,null,null,null,null,null,null,null,null,null,null,null,null,null,null,null,null,null,null,null,null,null,null,null,null,null,null,null,null,null,null,null,null,null,null,null,null,null,null,null,null,null,"N/A","N/A","N/A","N/A","N/A","N/A","N/A","N/A","N/A","N/A",1,1,1,1,1,1,1,1,1,1]
[null,null,null,null,null,null,null,null,null,null,null,null,null,null,null,null,null,null,null,null,null,null,null,null,null,null,null,null,null,null,null,null,null,null,null,null,null,null,null,null,null,null,null,null,null,null,null,null,null,null,"N/A","N/A","N/A","N/A","N/A","N/A","N/A","N/A","N/A","N/A",1,1,1,1,1,1,1,1,1,1]
[null,null,null,null,null,null,null,null,null,null,null,null,null,null,null,null,null,null,null,null,null,null,null,null,null,null,null,null,null,null,null,null,null,null,null,null,null,null,null,null,null,null,null,null,null,null,null,null,null,null,"N/A","N/A","N/A","N/A","N/A","N/A","N/A","N/A","N/A","N/A",1,1,1,1,1,1,1,1,1,1]
[null,null,null,null,null,null,null,null,null,null,null,null,null,null,null,null,null,null,null,null,null,null,null,null,null,null,null,null,null,null,null,null,null,null,null,null,null,null,null,null,null,null,null,null,null,null,null,null,null,null,"N/A","N/A","N/A","N/A","N/A","N/A","N/A","N/A","N/A","N/A",1,1,1,1,1,1,1,1,1,1]
[null,null,null,null,null,null,null,null,null,null,null,null,null,null,null,null,null,null,null,null,null,null,null,null,null,null,null,null,null,null,null,null,null,null,null,null,null,null,null,null,null,null,null,null,null,null,null,null,null,null,"N/A","N/A","N/A","N/A","N/A","N/A","N/A","N/A","N/A","N/A",1,1,1,1,1,1,1,1,1,1]
[null,null,null,null,null,null,null,null,null,null,null,null,null,null,null,null,null,null,null,null,null,null,null,null,null,null,null,null,null,null,null,null,null,null,null,null,null,null,null,null,null,null,null,null,null,null,null,null,null,null,"N/A","N/A","N/A","N/A","N/A","N/A","N/A","N/A","N/A","N/A",1,1,1,1,1,1,1,1,1,1]
[null,null,null,null,null,null,null,null,null,null,null,null,null,null,null,null,null,null,null,null,null,null,null,null,null,null,null,null,null,null,null,null,null,null,null,null,null,null,null,null,null,null,null,null,null,null,null,null,null,null,"N/A","N/A","N/A","N/A","N/A","N/A","N/A","N/A","N/A","N/A",1,1,1,1,1,1,1,1,1,1]
[null,null,null,null,null,null,null,null,null,null,null,null,null,null,null,null,null,null,null,null,null,null,null,null,null,null,null,null,null,null,null,null,null,null,null,null,null,null,null,null,null,null,null,null,null,null,null,null,null,null,"N/A","N/A","N/A","N/A","N/A","N/A","N/A","N/A","N/A","N/A",1,1,1,1,1,1,1,1,1,1]
[null,null,null,null,null,null,null,null,null,null,null,null,null,null,null,null,null,null,null,null,null,null,null,null,null,null,null,null,null,null,null,null,null,null,null,null,null,null,null,null,null,null,null,null,null,null,null,null,null,null,"N/A","N/A","N/A","N/A","N/A","N/A","N/A","N/A","N/A","N/A",1,1,1,1,1,1,1,1,1,1]
[null,null,null,null,null,null,null,null,null,null,null,null,null,null,null,null,null,null,null,null,null,null,null,null,null,null,null,null,null,null,null,null,null,null,null,null,null,null,null,null,null,null,null,null,null,null,null,null,null,null,"N/A","N/A","N/A","N/A","N/A","N/A","N/A","N/A","N/A","N/A",1,1,1,1,1,1,1,1,1,1]
[null,null,null,null,null,null,null,null,null,null,null,null,null,null,null,null,null,null,null,null,null,null,null,null,null,null,null,null,null,null,null,null,null,null,null,null,null,null,null,null,null,null,null,null,null,null,null,null,null,null,"N/A","N/A","N/A","N/A","N/A","N/A","N/A","N/A","N/A","N/A",1,1,1,1,1,1,1,1,1,1]
[null,null,null,null,null,null,null,null,null,null,null,null,null,null,null,null,null,null,null,null,null,null,null,null,null,null,null,null,null,null,null,null,null,null,null,null,null,null,null,null,null,null,null,null,null,null,null,null,null,null,"N/A","N/A","N/A","N/A","N/A","N/A","N/A","N/A","N/A","N/A",1,1,1,1,1,1,1,1,1,1]
[null,null,null,null,null,null,null,null,null,null,null,null,null,null,null,null,null,null,null,null,null,null,null,null,null,null,null,null,null,null,null,null,null,null,null,null,null,null,null,null,null,null,null,null,null,null,null,null,null,null,"N/A","N/A","N/A","N/A","N/A","N/A","N/A","N/A","N/A","N/A",1,1,1,1,1,1,1,1,1,1]
[null,null,null,null,null,null,null,null,null,null,null,null,null,null,null,null,null,null,null,null,null,null,null,null,null,null,null,null,null,null,null,null,null,null,null,null,null,null,null,null,null,null,null,null,null,null,null,null,null,null,"N/A","N/A","N/A","N/A","N/A","N/A","N/A","N/A","N/A","N/A",1,1,1,1,1,1,1,1,1,1]
[null,null,null,null,null,null,null,null,null,null,null,null,null,null,null,null,null,null,null,null,null,null,null,null,null,null,null,null,null,null,null,null,null,null,null,null,null,null,null,null,null,null,null,null,null,null,null,null,null,null,"N/A","N/A","N/A","N/A","N/A","N/A","N/A","N/A","N/A","N/A",1,1,1,1,1,1,1,1,1,1]
[null,null,null,null,null,null,null,null,null,null,null,null,null,null,null,null,null,null,null,null,null,null,null,null,null,null,null,null,null,null,null,null,null,null,null,null,null,null,null,null,null,null,null,null,null,null,null,null,null,null,"N/A","N/A","N/A","N/A","N/A","N/A","N/A","N/A","N/A","N/A",1,1,1,1,1,1,1,{"$f":"IF(BF848=\"N/A\",1,\"\")","v":1},{"$f":"IF(BG848=\"N/A\",1,\"\")","v":1},1]
[null,null,null,null,null,null,null,null,null,null,null,null,null,null,null,null,null,null,null,null,null,null,null,null,null,null,null,null,null,null,null,null,null,null,null,null,null,null,null,null,null,null,null,null,null,null,null,null,null,null,"N/A","N/A","N/A","N/A","N/A","N/A","N/A","N/A","N/A","N/A",1,1,1,1,1,1,1,1,1,1]
[null,null,null,null,null,null,null,null,null,null,null,null,null,null,null,null,null,null,null,null,null,null,null,null,null,null,null,null,null,null,null,null,null,null,null,null,null,null,null,null,null,null,null,null,null,null,null,null,null,null,"N/A","N/A","N/A","N/A","N/A","N/A","N/A","N/A","N/A","N/A",1,1,1,1,1,1,1,1,1,1]
[null,null,null,null,null,null,null,null,null,null,null,null,null,null,null,null,null,null,null,null,null,null,null,null,null,null,null,null,null,null,null,null,null,null,null,null,null,null,null,null,null,null,null,null,null,null,null,null,null,null,"N/A","N/A","N/A","N/A","N/A","N/A","N/A","N/A","N/A","N/A",1,1,1,1,1,1,1,1,1,1]
[null,null,null,null,null,null,null,null,null,null,null,null,null,null,null,null,null,null,null,null,null,null,null,null,null,null,null,null,null,null,null,null,null,null,null,null,null,null,null,null,null,null,null,null,null,null,null,null,null,null,"N/A","N/A","N/A","N/A","N/A","N/A","N/A","N/A","N/A","N/A",1,1,1,1,1,1,1,1,1,1]
[null,null,null,null,null,null,null,null,null,null,null,null,null,null,null,null,null,null,null,null,null,null,null,null,null,null,null,null,null,null,null,null,null,null,null,null,null,null,null,null,null,null,null,null,null,null,null,null,null,null,"N/A","N/A","N/A","N/A","N/A","N/A","N/A","N/A","N/A","N/A",1,1,1,1,1,1,1,1,1,1]
[null,null,null,null,null,null,null,null,null,null,null,null,null,null,null,null,null,null,null,null,null,null,null,null,null,null,null,null,null,null,null,null,null,null,null,null,null,null,null,null,null,null,null,null,null,null,null,null,null,null,"N/A","N/A","N/A","N/A","N/A","N/A","N/A","N/A","N/A","N/A",1,1,1,1,1,1,1,1,1,1]
[null,null,null,null,null,null,null,null,null,null,null,null,null,null,null,null,null,null,null,null,null,null,null,null,null,null,null,null,null,null,null,null,null,null,null,null,null,null,null,null,null,null,null,null,null,null,null,null,null,null,"N/A","N/A","N/A","N/A","N/A","N/A","N/A","N/A","N/A","N/A",1,1,1,1,1,1,1,1,1,1]
[null,null,null,null,null,null,null,null,null,null,null,null,null,null,null,null,null,null,null,null,null,null,null,null,null,null,null,null,null,null,null,null,null,null,null,null,null,null,null,null,null,null,null,null,null,null,null,null,null,null,"N/A","N/A","N/A","N/A","N/A","N/A","N/A","N/A","N/A","N/A",1,1,1,1,1,1,1,1,1,1]
[null,null,null,null,null,null,null,null,null,null,null,null,null,null,null,null,null,null,null,null,null,null,null,null,null,null,null,null,null,null,null,null,null,null,null,null,null,null,null,null,null,null,null,null,null,null,null,null,null,null,"N/A","N/A","N/A","N/A","N/A","N/A","N/A","N/A","N/A","N/A",1,1,1,1,1,1,1,1,1,1]
[null,null,null,null,null,null,null,null,null,null,null,null,null,null,null,null,null,null,null,null,null,null,null,null,null,null,null,null,null,null,null,null,null,null,null,null,null,null,null,null,null,null,null,null,null,null,null,null,null,null,"N/A","N/A","N/A","N/A","N/A","N/A","N/A","N/A","N/A","N/A",1,1,1,1,1,1,1,1,1,1]
[null,null,null,null,null,null,null,null,null,null,null,null,null,null,null,null,null,null,null,null,null,null,null,null,null,null,null,null,null,null,null,null,null,null,null,null,null,null,null,null,null,null,null,null,null,null,null,null,null,null,"N/A","N/A","N/A","N/A","N/A","N/A","N/A","N/A","N/A","N/A",1,1,1,1,1,1,1,1,1,1]
[null,null,null,null,null,null,null,null,null,null,null,null,null,null,null,null,null,null,null,null,null,null,null,null,null,null,null,null,null,null,null,null,null,null,null,null,null,null,null,null,null,null,null,null,null,null,null,null,null,null,"N/A","N/A","N/A","N/A","N/A","N/A","N/A","N/A","N/A","N/A",1,1,1,1,1,1,1,1,1,1]
[null,null,null,null,null,null,null,null,null,null,null,null,null,null,null,null,null,null,null,null,null,null,null,null,null,null,null,null,null,null,null,null,null,null,null,null,null,null,null,null,null,null,null,null,null,null,null,null,null,null,"N/A","N/A","N/A","N/A","N/A","N/A","N/A","N/A","N/A","N/A",1,1,1,1,1,1,1,1,1,1]
[null,null,null,null,null,null,null,null,null,null,null,null,null,null,null,null,null,null,null,null,null,null,null,null,null,null,null,null,null,null,null,null,null,null,null,null,null,null,null,null,null,null,null,null,null,null,null,null,null,null,"N/A","N/A","N/A","N/A","N/A","N/A","N/A","N/A","N/A","N/A",1,1,1,1,1,1,1,1,1,1]
[null,null,null,null,null,null,null,null,null,null,null,null,null,null,null,null,null,null,null,null,null,null,null,null,null,null,null,null,null,null,null,null,null,null,null,null,null,null,null,null,null,null,null,null,null,null,null,null,null,null,"N/A","N/A","N/A","N/A","N/A","N/A","N/A","N/A","N/A","N/A",1,1,1,1,1,1,1,1,1,1]
[null,null,null,null,null,null,null,null,null,null,null,null,null,null,null,null,null,null,null,null,null,null,null,null,null,null,null,null,null,null,null,null,null,null,null,null,null,null,null,null,null,null,null,null,null,null,null,null,null,null,"N/A","N/A","N/A","N/A","N/A","N/A","N/A","N/A","N/A","N/A",1,1,1,1,1,1,1,1,1,1]
[null,null,null,null,null,null,null,null,null,null,null,null,null,null,null,null,null,null,null,null,null,null,null,null,null,null,null,null,null,null,null,null,null,null,null,null,null,null,null,null,null,null,null,null,null,null,null,null,null,null,"N/A","N/A","N/A","N/A","N/A","N/A","N/A","N/A","N/A","N/A",1,1,1,1,1,1,1,1,1,1]
[null,null,null,null,null,null,null,null,null,null,null,null,null,null,null,null,null,null,null,null,null,null,null,null,null,null,null,null,null,null,null,null,null,null,null,null,null,null,null,null,null,null,null,null,null,null,null,null,null,null,"N/A","N/A","N/A","N/A","N/A","N/A","N/A","N/A","N/A","N/A",1,1,1,1,1,1,1,1,1,1]
[null,null,null,null,null,null,null,null,null,null,null,null,null,null,null,null,null,null,null,null,null,null,null,null,null,null,null,null,null,null,null,null,null,null,null,null,null,null,null,null,null,null,null,null,null,null,null,null,null,null,"N/A","N/A","N/A","N/A","N/A","N/A","N/A","N/A","N/A","N/A",1,1,1,1,1,1,1,1,1,1]
[null,null,null,null,null,null,null,null,null,null,null,null,null,null,null,null,null,null,null,null,null,null,null,null,null,null,null,null,null,null,null,null,null,null,null,null,null,null,null,null,null,null,null,null,null,null,null,null,null,null,{"$f":"IF(COUNTA(E868:J868)>0,(COUNTIF(E868:J868,\"=0\")*0+COUNTIF(E868:J868,\"=1\")*100+COUNTIF(E868:J868,\"=2\")*80+COUNTIF(E868:J868,\"=3\")*50+COUNTIF(E868:J868,\"=8\")*20+COUNTIF(E868:J868,\"=9\")*0)/COUNTA(E868:J868)/100,\"N/A\")","v":"N/A"},"N/A",{"$f":"IF(COUNTA(P868:U868)>0,(COUNTIF(P868:U868,\"=0\")*0+COUNTIF(P868:U868,\"=1\")*100+COUNTIF(P868:U868,\"=2\")*80+COUNTIF(P868:U868,\"=3\")*50+COUNTIF(P868:U868,\"=8\")*20+COUNTIF(P868:U868,\"=9\")*0)/COUNTA(P868:U868)/100,\"N/A\")","v":"N/A"},{"$f":"IF(COUNTA(V868)<>0,(COUNTIF(V868,\"=0\")*0+COUNTIF(V868,\"=1\")*100+COUNTIF(V868,\"=2\")*80+COUNTIF(V868,\"=3\")*50+COUNTIF(V868,\"=8\")*20+COUNTIF(V868,\"=9\")*0)/COUNTA(V868)/100,\"N/A\")","v":"N/A"},{"$f":"IF(COUNTA(W868:X868)>0,(COUNTIF(W868:X868,\"=0\")*0+COUNTIF(W868:X868,\"=1\")*100+COUNTIF(W868:X868,\"=2\")*80+COUNTIF(W868:X868,\"=3\")*50+COUNTIF(W868:X868,\"=8\")*20+COUNTIF(W868:X868,\"=9\")*0)/COUNTA(W868:X868)/100,\"N/A\")","v":"N/A"},{"$f":"IF(COUNTA(Y868:AJ868)>0,(COUNTIF(Y868:AJ868,\"=0\")*0+COUNTIF(Y868:AJ868,\"=1\")*100+COUNTIF(Y868:AJ868,\"=2\")*80+COUNTIF(Y868:AJ868,\"=3\")*50+COUNTIF(Y868:AJ868,\"=8\")*20+COUNTIF(Y868:AJ868,\"=9\")*0)/COUNTA(Y868:AJ868)/100,\"N/A\")","v":"N/A"},{"$f":"IF(COUNTA(AK868:AP868)>0,(COUNTIF(AK868:AP868,\"=0\")*0+COUNTIF(AK868:AP868,\"=1\")*100+COUNTIF(AK868:AP868,\"=2\")*80+COUNTIF(AK868:AP868,\"=3\")*50+COUNTIF(AK868:AP868,\"=8\")*20+COUNTIF(AK868:AP868,\"=9\")*0)/COUNTA(AK868:AP868)/100,\"N/A\")","v":"N/A"},{"$f":"IF(COUNTA(AQ868:AU868)>0,(COUNTIF(AQ868:AU868,\"=0\")*0+COUNTIF(AQ868:AU868,\"=1\")*100+COUNTIF(AQ868:AU868,\"=2\")*80+COUNTIF(AQ868:AU868,\"=3\")*50+COUNTIF(AQ868:AU868,\"=8\")*20+COUNTIF(AQ868:AU868,\"=9\")*0)/COUNTA(AQ868:AU868)/100,\"N/A\")","v":"N/A"},{"$f":"IF(COUNTA(AV868:AX868)>0,(COUNTIF(AV868:AX868,\"=0\")*0+COUNTIF(AV868:AX868,\"=1\")*100+COUNTIF(AV868:AX868,\"=2\")*80+COUNTIF(AV868:AX868,\"=3\")*50+COUNTIF(AV868:AX868,\"=8\")*20+COUNTIF(AV868:AX868,\"=9\")*0)/COUNTA(AV868:AX868)/100,\"N/A\")","v":"N/A"},{"$f":"IF(AND(COUNTA(E868:AX868)<>0,B868<>\"\"),AVERAGE(BA868:BG868),\"N/A\")","v":"N/A"},1,1,1,1,1,1,1,1,1,1]
[null,null,null,null,null,null,null,null,null,null,null,null,null,null,null,null,null,null,null,null,null,null,null,null,null,null,null,null,null,null,null,null,null,null,null,null,null,null,null,null,null,null,null,null,null,null,null,null,null,null,"N/A","N/A","N/A","N/A","N/A","N/A","N/A","N/A","N/A","N/A",1,1,1,1,1,1,1,1,1,1]
[null,null,null,null,null,null,null,null,null,null,null,null,null,null,null,null,null,null,null,null,null,null,null,null,null,null,null,null,null,null,null,null,null,null,null,null,null,null,null,null,null,null,null,null,null,null,null,null,null,null,"N/A","N/A","N/A","N/A","N/A","N/A","N/A","N/A","N/A","N/A",1,1,1,1,1,1,1,1,1,1]
[null,null,null,null,null,null,null,null,null,null,null,null,null,null,null,null,null,null,null,null,null,null,null,null,null,null,null,null,null,null,null,null,null,null,null,null,null,null,null,null,null,null,null,null,null,null,null,null,null,null,"N/A","N/A","N/A","N/A","N/A","N/A","N/A","N/A","N/A","N/A",1,1,1,1,1,1,1,1,1,1]
[null,null,null,null,null,null,null,null,null,null,null,null,null,null,null,null,null,null,null,null,null,null,null,null,null,null,null,null,null,null,null,null,null,null,null,null,null,null,null,null,null,null,null,null,null,null,null,null,null,null,"N/A",{"$f":"IF(COUNTA(K872:O872)>0,(COUNTIF(K872:O872,\"=0\")*0+COUNTIF(K872:O872,\"=1\")*100+COUNTIF(K872:O872,\"=2\")*80+COUNTIF(K872:O872,\"=3\")*50+COUNTIF(K872:O872,\"=8\")*20+COUNTIF(K872:O872,\"=9\")*0)/COUNTA(K872:O872)/100,\"N/A\")","v":"N/A"},"N/A","N/A","N/A","N/A","N/A","N/A","N/A","N/A",1,1,1,1,1,1,1,1,1,1]
[null,null,null,null,null,null,null,null,null,null,null,null,null,null,null,null,null,null,null,null,null,null,null,null,null,null,null,null,null,null,null,null,null,null,null,null,null,null,null,null,null,null,null,null,null,null,null,null,null,null,"N/A","N/A","N/A","N/A","N/A","N/A","N/A","N/A","N/A","N/A",1,1,1,1,1,1,1,1,1,1]
[null,null,null,null,null,null,null,null,null,null,null,null,null,null,null,null,null,null,null,null,null,null,null,null,null,null,null,null,null,null,null,null,null,null,null,null,null,null,null,null,null,null,null,null,null,null,null,null,null,null,"N/A","N/A","N/A","N/A","N/A","N/A","N/A","N/A","N/A","N/A",1,1,1,1,1,1,1,1,1,1]
[null,null,null,null,null,null,null,null,null,null,null,null,null,null,null,null,null,null,null,null,null,null,null,null,null,null,null,null,null,null,null,null,null,null,null,null,null,null,null,null,null,null,null,null,null,null,null,null,null,null,"N/A","N/A","N/A","N/A","N/A","N/A","N/A","N/A","N/A","N/A",1,1,1,1,1,1,1,1,1,1]
[null,null,null,null,null,null,null,null,null,null,null,null,null,null,null,null,null,null,null,null,null,null,null,null,null,null,null,null,null,null,null,null,null,null,null,null,null,null,null,null,null,null,null,null,null,null,null,null,null,null,"N/A","N/A","N/A","N/A","N/A","N/A","N/A","N/A","N/A","N/A",1,1,1,1,1,1,1,1,1,1]
[null,null,null,null,null,null,null,null,null,null,null,null,null,null,null,null,null,null,null,null,null,null,null,null,null,null,null,null,null,null,null,null,null,null,null,null,null,null,null,null,null,null,null,null,null,null,null,null,null,null,"N/A","N/A","N/A","N/A","N/A","N/A","N/A","N/A","N/A","N/A",1,1,1,1,1,1,1,1,1,1]
[null,null,null,null,null,null,null,null,null,null,null,null,null,null,null,null,null,null,null,null,null,null,null,null,null,null,null,null,null,null,null,null,null,null,null,null,null,null,null,null,null,null,null,null,null,null,null,null,null,null,"N/A","N/A","N/A","N/A","N/A","N/A","N/A","N/A","N/A","N/A",1,1,1,1,1,1,1,1,1,1]
[null,null,null,null,null,null,null,null,null,null,null,null,null,null,null,null,null,null,null,null,null,null,null,null,null,null,null,null,null,null,null,null,null,null,null,null,null,null,null,null,null,null,null,null,null,null,null,null,null,null,"N/A","N/A","N/A","N/A","N/A","N/A","N/A","N/A","N/A","N/A",1,1,1,1,1,1,1,1,1,1]
[null,null,null,null,null,null,null,null,null,null,null,null,null,null,null,null,null,null,null,null,null,null,null,null,null,null,null,null,null,null,null,null,null,null,null,null,null,null,null,null,null,null,null,null,null,null,null,null,null,null,"N/A","N/A","N/A","N/A","N/A","N/A","N/A","N/A","N/A","N/A",1,1,1,1,1,1,1,1,1,1]
[null,null,null,null,null,null,null,null,null,null,null,null,null,null,null,null,null,null,null,null,null,null,null,null,null,null,null,null,null,null,null,null,null,null,null,null,null,null,null,null,null,null,null,null,null,null,null,null,null,null,"N/A","N/A","N/A","N/A","N/A","N/A","N/A","N/A","N/A","N/A",1,1,1,1,1,1,1,1,1,1]
[null,null,null,null,null,null,null,null,null,null,null,null,null,null,null,null,null,null,null,null,null,null,null,null,null,null,null,null,null,null,null,null,null,null,null,null,null,null,null,null,null,null,null,null,null,null,null,null,null,null,"N/A","N/A","N/A","N/A","N/A","N/A","N/A","N/A","N/A","N/A",1,1,1,1,1,1,1,1,1,1]
[null,null,null,null,null,null,null,null,null,null,null,null,null,null,null,null,null,null,null,null,null,null,null,null,null,null,null,null,null,null,null,null,null,null,null,null,null,null,null,null,null,null,null,null,null,null,null,null,null,null,"N/A","N/A","N/A","N/A","N/A","N/A","N/A","N/A","N/A","N/A",1,1,1,1,1,1,1,1,1,1]
[null,null,null,null,null,null,null,null,null,null,null,null,null,null,null,null,null,null,null,null,null,null,null,null,null,null,null,null,null,null,null,null,null,null,null,null,null,null,null,null,null,null,null,null,null,null,null,null,null,null,"N/A","N/A","N/A","N/A","N/A","N/A","N/A","N/A","N/A","N/A",1,1,1,1,1,1,1,1,1,1]
[null,null,null,null,null,null,null,null,null,null,null,null,null,null,null,null,null,null,null,null,null,null,null,null,null,null,null,null,null,null,null,null,null,null,null,null,null,null,null,null,null,null,null,null,null,null,null,null,null,null,"N/A","N/A","N/A","N/A","N/A","N/A","N/A","N/A","N/A","N/A",1,1,1,1,1,1,1,1,1,1]
[null,null,null,null,null,null,null,null,null,null,null,null,null,null,null,null,null,null,null,null,null,null,null,null,null,null,null,null,null,null,null,null,null,null,null,null,null,null,null,null,null,null,null,null,null,null,null,null,null,null,"N/A","N/A","N/A","N/A","N/A","N/A","N/A","N/A","N/A","N/A",1,1,1,1,1,1,1,1,1,1]
[null,null,null,null,null,null,null,null,null,null,null,null,null,null,null,null,null,null,null,null,null,null,null,null,null,null,null,null,null,null,null,null,null,null,null,null,null,null,null,null,null,null,null,null,null,null,null,null,null,null,"N/A","N/A","N/A","N/A","N/A","N/A","N/A","N/A","N/A","N/A",1,1,1,1,1,1,1,1,1,1]
[null,null,null,null,null,null,null,null,null,null,null,null,null,null,null,null,null,null,null,null,null,null,null,null,null,null,null,null,null,null,null,null,null,null,null,null,null,null,null,null,null,null,null,null,null,null,null,null,null,null,"N/A","N/A","N/A","N/A","N/A","N/A","N/A","N/A","N/A","N/A",1,1,1,1,1,1,1,1,1,1]
[null,null,null,null,null,null,null,null,null,null,null,null,null,null,null,null,null,null,null,null,null,null,null,null,null,null,null,null,null,null,null,null,null,null,null,null,null,null,null,null,null,null,null,null,null,null,null,null,null,null,"N/A","N/A","N/A","N/A","N/A","N/A","N/A","N/A","N/A","N/A",1,1,1,1,1,1,1,1,1,{"$f":"IF(BH889=\"N/A\",1,\"\")","v":1}]
[null,null,null,null,null,null,null,null,null,null,null,null,null,null,null,null,null,null,null,null,null,null,null,null,null,null,null,null,null,null,null,null,null,null,null,null,null,null,null,null,null,null,null,null,null,null,null,null,null,null,"N/A","N/A","N/A","N/A","N/A","N/A","N/A","N/A","N/A","N/A",{"$f":"IF(AY890=\"N/A\",1,\"\")","v":1},{"$f":"IF(AZ890=\"N/A\",1,\"\")","v":1},{"$f":"IF(BA890=\"N/A\",1,\"\")","v":1},{"$f":"IF(BB890=\"N/A\",1,\"\")","v":1},{"$f":"IF(BC890=\"N/A\",1,\"\")","v":1},{"$f":"IF(BD890=\"N/A\",1,\"\")","v":1},{"$f":"IF(BE890=\"N/A\",1,\"\")","v":1},1,1,1]
[null,null,null,null,null,null,null,null,null,null,null,null,null,null,null,null,null,null,null,null,null,null,null,null,null,null,null,null,null,null,null,null,null,null,null,null,null,null,null,null,null,null,null,null,null,null,null,null,null,null,"N/A","N/A","N/A","N/A","N/A","N/A","N/A","N/A","N/A","N/A",1,1,1,1,1,1,1,1,1,1]
[null,null,null,null,null,null,null,null,null,null,null,null,null,null,null,null,null,null,null,null,null,null,null,null,null,null,null,null,null,null,null,null,null,null,null,null,null,null,null,null,null,null,null,null,null,null,null,null,null,null,"N/A","N/A","N/A","N/A","N/A","N/A","N/A","N/A","N/A","N/A",1,1,1,1,1,1,1,1,1,1]
[null,null,null,null,null,null,null,null,null,null,null,null,null,null,null,null,null,null,null,null,null,null,null,null,null,null,null,null,null,null,null,null,null,null,null,null,null,null,null,null,null,null,null,null,null,null,null,null,null,null,"N/A","N/A","N/A","N/A","N/A","N/A","N/A","N/A","N/A","N/A",1,1,1,1,1,1,1,1,1,1]
[null,null,null,null,null,null,null,null,null,null,null,null,null,null,null,null,null,null,null,null,null,null,null,null,null,null,null,null,null,null,null,null,null,null,null,null,null,null,null,null,null,null,null,null,null,null,null,null,null,null,"N/A","N/A","N/A","N/A","N/A","N/A","N/A","N/A","N/A","N/A",1,1,1,1,1,1,1,1,1,1]
[null,null,null,null,null,null,null,null,null,null,null,null,null,null,null,null,null,null,null,null,null,null,null,null,null,null,null,null,null,null,null,null,null,null,null,null,null,null,null,null,null,null,null,null,null,null,null,null,null,null,"N/A","N/A","N/A","N/A","N/A","N/A","N/A","N/A","N/A","N/A",1,1,1,1,1,1,1,1,1,1]
[null,null,null,null,null,null,null,null,null,null,null,null,null,null,null,null,null,null,null,null,null,null,null,null,null,null,null,null,null,null,null,null,null,null,null,null,null,null,null,null,null,null,null,null,null,null,null,null,null,null,"N/A","N/A","N/A","N/A","N/A","N/A","N/A","N/A","N/A","N/A",1,1,1,1,1,1,1,1,1,1]
[null,null,null,null,null,null,null,null,null,null,null,null,null,null,null,null,null,null,null,null,null,null,null,null,null,null,null,null,null,null,null,null,null,null,null,null,null,null,null,null,null,null,null,null,null,null,null,null,null,null,"N/A","N/A","N/A","N/A","N/A","N/A","N/A","N/A","N/A","N/A",1,1,1,1,1,1,1,1,1,1]
[null,null,null,null,null,null,null,null,null,null,null,null,null,null,null,null,null,null,null,null,null,null,null,null,null,null,null,null,null,null,null,null,null,null,null,null,null,null,null,null,null,null,null,null,null,null,null,null,null,null,"N/A","N/A","N/A","N/A","N/A","N/A","N/A","N/A","N/A","N/A",1,1,1,1,1,1,1,1,1,1]
[null,null,null,null,null,null,null,null,null,null,null,null,null,null,null,null,null,null,null,null,null,null,null,null,null,null,null,null,null,null,null,null,null,null,null,null,null,null,null,null,null,null,null,null,null,null,null,null,null,null,"N/A","N/A","N/A","N/A","N/A","N/A","N/A","N/A","N/A","N/A",1,1,1,1,1,1,1,1,1,1]
[null,null,null,null,null,null,null,null,null,null,null,null,null,null,null,null,null,null,null,null,null,null,null,null,null,null,null,null,null,null,null,null,null,null,null,null,null,null,null,null,null,null,null,null,null,null,null,null,null,null,"N/A","N/A","N/A","N/A","N/A","N/A","N/A","N/A","N/A","N/A",1,1,1,1,1,1,1,1,1,1]
[null,null,null,null,null,null,null,null,null,null,null,null,null,null,null,null,null,null,null,null,null,null,null,null,null,null,null,null,null,null,null,null,null,null,null,null,null,null,null,null,null,null,null,null,null,null,null,null,null,null,"N/A","N/A","N/A","N/A","N/A","N/A","N/A","N/A","N/A","N/A",1,1,1,1,1,1,1,1,1,1]
[null,null,null,null,null,null,null,null,null,null,null,null,null,null,null,null,null,null,null,null,null,null,null,null,null,null,null,null,null,null,null,null,null,null,null,null,null,null,null,null,null,null,null,null,null,null,null,null,null,null,"N/A","N/A","N/A","N/A","N/A","N/A","N/A","N/A","N/A","N/A",1,1,1,1,1,1,1,1,1,1]
[null,null,null,null,null,null,null,null,null,null,null,null,null,null,null,null,null,null,null,null,null,null,null,null,null,null,null,null,null,null,null,null,null,null,null,null,null,null,null,null,null,null,null,null,null,null,null,null,null,null,"N/A","N/A","N/A","N/A","N/A","N/A","N/A","N/A","N/A","N/A",1,1,1,1,1,1,1,1,1,1]
[null,null,null,null,null,null,null,null,null,null,null,null,null,null,null,null,null,null,null,null,null,null,null,null,null,null,null,null,null,null,null,null,null,null,null,null,null,null,null,null,null,null,null,null,null,null,null,null,null,null,"N/A","N/A","N/A","N/A","N/A","N/A","N/A","N/A","N/A","N/A",1,1,1,1,1,1,1,1,1,1]
[null,null,null,null,null,null,null,null,null,null,null,null,null,null,null,null,null,null,null,null,null,null,null,null,null,null,null,null,null,null,null,null,null,null,null,null,null,null,null,null,null,null,null,null,null,null,null,null,null,null,"N/A","N/A","N/A","N/A","N/A","N/A","N/A","N/A","N/A","N/A",1,1,1,1,1,1,1,1,1,1]
[null,null,null,null,null,null,null,null,null,null,null,null,null,null,null,null,null,null,null,null,null,null,null,null,null,null,null,null,null,null,null,null,null,null,null,null,null,null,null,null,null,null,null,null,null,null,null,null,null,null,"N/A","N/A","N/A","N/A","N/A","N/A","N/A","N/A","N/A","N/A",1,1,1,1,1,1,1,1,1,1]
[null,null,null,null,null,null,null,null,null,null,null,null,null,null,null,null,null,null,null,null,null,null,null,null,null,null,null,null,null,null,null,null,null,null,null,null,null,null,null,null,null,null,null,null,null,null,null,null,null,null,"N/A","N/A","N/A","N/A","N/A","N/A","N/A","N/A","N/A","N/A",1,1,1,1,1,1,1,1,1,1]
[null,null,null,null,null,null,null,null,null,null,null,null,null,null,null,null,null,null,null,null,null,null,null,null,null,null,null,null,null,null,null,null,null,null,null,null,null,null,null,null,null,null,null,null,null,null,null,null,null,null,"N/A","N/A","N/A","N/A","N/A","N/A","N/A","N/A","N/A","N/A",1,1,1,1,1,1,1,1,1,1]
[null,null,null,null,null,null,null,null,null,null,null,null,null,null,null,null,null,null,null,null,null,null,null,null,null,null,null,null,null,null,null,null,null,null,null,null,null,null,null,null,null,null,null,null,null,null,null,null,null,null,"N/A","N/A","N/A","N/A","N/A","N/A","N/A","N/A","N/A","N/A",1,1,1,1,1,1,1,1,1,1]
[null,null,null,null,null,null,null,null,null,null,null,null,null,null,null,null,null,null,null,null,null,null,null,null,null,null,null,null,null,null,null,null,null,null,null,null,null,null,null,null,null,null,null,null,null,null,null,null,null,null,"N/A","N/A","N/A","N/A","N/A","N/A","N/A","N/A","N/A","N/A",1,1,1,1,1,1,1,1,1,1]
[null,null,null,null,null,null,null,null,null,null,null,null,null,null,null,null,null,null,null,null,null,null,null,null,null,null,null,null,null,null,null,null,null,null,null,null,null,null,null,null,null,null,null,null,null,null,null,null,null,null,"N/A","N/A","N/A","N/A","N/A","N/A","N/A","N/A","N/A","N/A",1,1,1,1,1,1,1,1,1,1]
[null,null,null,null,null,null,null,null,null,null,null,null,null,null,null,null,null,null,null,null,null,null,null,null,null,null,null,null,null,null,null,null,null,null,null,null,null,null,null,null,null,null,null,null,null,null,null,null,null,null,"N/A","N/A","N/A","N/A","N/A","N/A","N/A","N/A","N/A","N/A",1,1,1,1,1,1,1,{"$f":"IF(BF912=\"N/A\",1,\"\")","v":1},{"$f":"IF(BG912=\"N/A\",1,\"\")","v":1},1]
[null,null,null,null,null,null,null,null,null,null,null,null,null,null,null,null,null,null,null,null,null,null,null,null,null,null,null,null,null,null,null,null,null,null,null,null,null,null,null,null,null,null,null,null,null,null,null,null,null,null,"N/A","N/A","N/A","N/A","N/A","N/A","N/A","N/A","N/A","N/A",1,1,1,1,1,1,1,1,1,1]
[null,null,null,null,null,null,null,null,null,null,null,null,null,null,null,null,null,null,null,null,null,null,null,null,null,null,null,null,null,null,null,null,null,null,null,null,null,null,null,null,null,null,null,null,null,null,null,null,null,null,"N/A","N/A","N/A","N/A","N/A","N/A","N/A","N/A","N/A","N/A",1,1,1,1,1,1,1,1,1,1]
[null,null,null,null,null,null,null,null,null,null,null,null,null,null,null,null,null,null,null,null,null,null,null,null,null,null,null,null,null,null,null,null,null,null,null,null,null,null,null,null,null,null,null,null,null,null,null,null,null,null,"N/A","N/A","N/A","N/A","N/A","N/A","N/A","N/A","N/A","N/A",1,1,1,1,1,1,1,1,1,1]
[null,null,null,null,null,null,null,null,null,null,null,null,null,null,null,null,null,null,null,null,null,null,null,null,null,null,null,null,null,null,null,null,null,null,null,null,null,null,null,null,null,null,null,null,null,null,null,null,null,null,"N/A","N/A","N/A","N/A","N/A","N/A","N/A","N/A","N/A","N/A",1,1,1,1,1,1,1,1,1,1]
[null,null,null,null,null,null,null,null,null,null,null,null,null,null,null,null,null,null,null,null,null,null,null,null,null,null,null,null,null,null,null,null,null,null,null,null,null,null,null,null,null,null,null,null,null,null,null,null,null,null,"N/A","N/A","N/A","N/A","N/A","N/A","N/A","N/A","N/A","N/A",1,1,1,1,1,1,1,1,1,1]
[null,null,null,null,null,null,null,null,null,null,null,null,null,null,null,null,null,null,null,null,null,null,null,null,null,null,null,null,null,null,null,null,null,null,null,null,null,null,null,null,null,null,null,null,null,null,null,null,null,null,"N/A","N/A","N/A","N/A","N/A","N/A","N/A","N/A","N/A","N/A",1,1,1,1,1,1,1,1,1,1]
[null,null,null,null,null,null,null,null,null,null,null,null,null,null,null,null,null,null,null,null,null,null,null,null,null,null,null,null,null,null,null,null,null,null,null,null,null,null,null,null,null,null,null,null,null,null,null,null,null,null,"N/A","N/A","N/A","N/A","N/A","N/A","N/A","N/A","N/A","N/A",1,1,1,1,1,1,1,1,1,1]
[null,null,null,null,null,null,null,null,null,null,null,null,null,null,null,null,null,null,null,null,null,null,null,null,null,null,null,null,null,null,null,null,null,null,null,null,null,null,null,null,null,null,null,null,null,null,null,null,null,null,"N/A","N/A","N/A","N/A","N/A","N/A","N/A","N/A","N/A","N/A",1,1,1,1,1,1,1,1,1,1]
[null,null,null,null,null,null,null,null,null,null,null,null,null,null,null,null,null,null,null,null,null,null,null,null,null,null,null,null,null,null,null,null,null,null,null,null,null,null,null,null,null,null,null,null,null,null,null,null,null,null,"N/A","N/A","N/A","N/A","N/A","N/A","N/A","N/A","N/A","N/A",1,1,1,1,1,1,1,1,1,1]
[null,null,null,null,null,null,null,null,null,null,null,null,null,null,null,null,null,null,null,null,null,null,null,null,null,null,null,null,null,null,null,null,null,null,null,null,null,null,null,null,null,null,null,null,null,null,null,null,null,null,"N/A","N/A","N/A","N/A","N/A","N/A","N/A","N/A","N/A","N/A",1,1,1,1,1,1,1,1,1,1]
[null,null,null,null,null,null,null,null,null,null,null,null,null,null,null,null,null,null,null,null,null,null,null,null,null,null,null,null,null,null,null,null,null,null,null,null,null,null,null,null,null,null,null,null,null,null,null,null,null,null,"N/A","N/A","N/A","N/A","N/A","N/A","N/A","N/A","N/A","N/A",1,1,1,1,1,1,1,1,1,1]
[null,null,null,null,null,null,null,null,null,null,null,null,null,null,null,null,null,null,null,null,null,null,null,null,null,null,null,null,null,null,null,null,null,null,null,null,null,null,null,null,null,null,null,null,null,null,null,null,null,null,"N/A","N/A","N/A","N/A","N/A","N/A","N/A","N/A","N/A","N/A",1,1,1,1,1,1,1,1,1,1]
[null,null,null,null,null,null,null,null,null,null,null,null,null,null,null,null,null,null,null,null,null,null,null,null,null,null,null,null,null,null,null,null,null,null,null,null,null,null,null,null,null,null,null,null,null,null,null,null,null,null,"N/A","N/A","N/A","N/A","N/A","N/A","N/A","N/A","N/A","N/A",1,1,1,1,1,1,1,1,1,1]
[null,null,null,null,null,null,null,null,null,null,null,null,null,null,null,null,null,null,null,null,null,null,null,null,null,null,null,null,null,null,null,null,null,null,null,null,null,null,null,null,null,null,null,null,null,null,null,null,null,null,"N/A","N/A","N/A","N/A","N/A","N/A","N/A","N/A","N/A","N/A",1,1,1,1,1,1,1,1,1,1]
[null,null,null,null,null,null,null,null,null,null,null,null,null,null,null,null,null,null,null,null,null,null,null,null,null,null,null,null,null,null,null,null,null,null,null,null,null,null,null,null,null,null,null,null,null,null,null,null,null,null,"N/A","N/A","N/A","N/A","N/A","N/A","N/A","N/A","N/A","N/A",1,1,1,1,1,1,1,1,1,1]
[null,null,null,null,null,null,null,null,null,null,null,null,null,null,null,null,null,null,null,null,null,null,null,null,null,null,null,null,null,null,null,null,null,null,null,null,null,null,null,null,null,null,null,null,null,null,null,null,null,null,"N/A","N/A","N/A","N/A","N/A","N/A","N/A","N/A","N/A","N/A",1,1,1,1,1,1,1,1,1,1]
[null,null,null,null,null,null,null,null,null,null,null,null,null,null,null,null,null,null,null,null,null,null,null,null,null,null,null,null,null,null,null,null,null,null,null,null,null,null,null,null,null,null,null,null,null,null,null,null,null,null,"N/A","N/A","N/A","N/A","N/A","N/A","N/A","N/A","N/A","N/A",1,1,1,1,1,1,1,1,1,1]
[null,null,null,null,null,null,null,null,null,null,null,null,null,null,null,null,null,null,null,null,null,null,null,null,null,null,null,null,null,null,null,null,null,null,null,null,null,null,null,null,null,null,null,null,null,null,null,null,null,null,"N/A","N/A","N/A","N/A","N/A","N/A","N/A","N/A","N/A","N/A",1,1,1,1,1,1,1,1,1,1]
[null,null,null,null,null,null,null,null,null,null,null,null,null,null,null,null,null,null,null,null,null,null,null,null,null,null,null,null,null,null,null,null,null,null,null,null,null,null,null,null,null,null,null,null,null,null,null,null,null,null,"N/A","N/A","N/A","N/A","N/A","N/A","N/A","N/A","N/A","N/A",1,1,1,1,1,1,1,1,1,1]
[null,null,null,null,null,null,null,null,null,null,null,null,null,null,null,null,null,null,null,null,null,null,null,null,null,null,null,null,null,null,null,null,null,null,null,null,null,null,null,null,null,null,null,null,null,null,null,null,null,null,{"$f":"IF(COUNTA(E932:J932)>0,(COUNTIF(E932:J932,\"=0\")*0+COUNTIF(E932:J932,\"=1\")*100+COUNTIF(E932:J932,\"=2\")*80+COUNTIF(E932:J932,\"=3\")*50+COUNTIF(E932:J932,\"=8\")*20+COUNTIF(E932:J932,\"=9\")*0)/COUNTA(E932:J932)/100,\"N/A\")","v":"N/A"},"N/A",{"$f":"IF(COUNTA(P932:U932)>0,(COUNTIF(P932:U932,\"=0\")*0+COUNTIF(P932:U932,\"=1\")*100+COUNTIF(P932:U932,\"=2\")*80+COUNTIF(P932:U932,\"=3\")*50+COUNTIF(P932:U932,\"=8\")*20+COUNTIF(P932:U932,\"=9\")*0)/COUNTA(P932:U932)/100,\"N/A\")","v":"N/A"},{"$f":"IF(COUNTA(V932)<>0,(COUNTIF(V932,\"=0\")*0+COUNTIF(V932,\"=1\")*100+COUNTIF(V932,\"=2\")*80+COUNTIF(V932,\"=3\")*50+COUNTIF(V932,\"=8\")*20+COUNTIF(V932,\"=9\")*0)/COUNTA(V932)/100,\"N/A\")","v":"N/A"},{"$f":"IF(COUNTA(W932:X932)>0,(COUNTIF(W932:X932,\"=0\")*0+COUNTIF(W932:X932,\"=1\")*100+COUNTIF(W932:X932,\"=2\")*80+COUNTIF(W932:X932,\"=3\")*50+COUNTIF(W932:X932,\"=8\")*20+COUNTIF(W932:X932,\"=9\")*0)/COUNTA(W932:X932)/100,\"N/A\")","v":"N/A"},{"$f":"IF(COUNTA(Y932:AJ932)>0,(COUNTIF(Y932:AJ932,\"=0\")*0+COUNTIF(Y932:AJ932,\"=1\")*100+COUNTIF(Y932:AJ932,\"=2\")*80+COUNTIF(Y932:AJ932,\"=3\")*50+COUNTIF(Y932:AJ932,\"=8\")*20+COUNTIF(Y932:AJ932,\"=9\")*0)/COUNTA(Y932:AJ932)/100,\"N/A\")","v":"N/A"},{"$f":"IF(COUNTA(AK932:AP932)>0,(COUNTIF(AK932:AP932,\"=0\")*0+COUNTIF(AK932:AP932,\"=1\")*100+COUNTIF(AK932:AP932,\"=2\")*80+COUNTIF(AK932:AP932,\"=3\")*50+COUNTIF(AK932:AP932,\"=8\")*20+COUNTIF(AK932:AP932,\"=9\")*0)/COUNTA(AK932:AP932)/100,\"N/A\")","v":"N/A"},{"$f":"IF(COUNTA(AQ932:AU932)>0,(COUNTIF(AQ932:AU932,\"=0\")*0+COUNTIF(AQ932:AU932,\"=1\")*100+COUNTIF(AQ932:AU932,\"=2\")*80+COUNTIF(AQ932:AU932,\"=3\")*50+COUNTIF(AQ932:AU932,\"=8\")*20+COUNTIF(AQ932:AU932,\"=9\")*0)/COUNTA(AQ932:AU932)/100,\"N/A\")","v":"N/A"},{"$f":"IF(COUNTA(AV932:AX932)>0,(COUNTIF(AV932:AX932,\"=0\")*0+COUNTIF(AV932:AX932,\"=1\")*100+COUNTIF(AV932:AX932,\"=2\")*80+COUNTIF(AV932:AX932,\"=3\")*50+COUNTIF(AV932:AX932,\"=8\")*20+COUNTIF(AV932:AX932,\"=9\")*0)/COUNTA(AV932:AX932)/100,\"N/A\")","v":"N/A"},{"$f":"IF(AND(COUNTA(E932:AX932)<>0,B932<>\"\"),AVERAGE(BA932:BG932),\"N/A\")","v":"N/A"},1,1,1,1,1,1,1,1,1,1]
[null,null,null,null,null,null,null,null,null,null,null,null,null,null,null,null,null,null,null,null,null,null,null,null,null,null,null,null,null,null,null,null,null,null,null,null,null,null,null,null,null,null,null,null,null,null,null,null,null,null,"N/A","N/A","N/A","N/A","N/A","N/A","N/A","N/A","N/A","N/A",1,1,1,1,1,1,1,1,1,1]
[null,null,null,null,null,null,null,null,null,null,null,null,null,null,null,null,null,null,null,null,null,null,null,null,null,null,null,null,null,null,null,null,null,null,null,null,null,null,null,null,null,null,null,null,null,null,null,null,null,null,"N/A","N/A","N/A","N/A","N/A","N/A","N/A","N/A","N/A","N/A",1,1,1,1,1,1,1,1,1,1]
[null,null,null,null,null,null,null,null,null,null,null,null,null,null,null,null,null,null,null,null,null,null,null,null,null,null,null,null,null,null,null,null,null,null,null,null,null,null,null,null,null,null,null,null,null,null,null,null,null,null,"N/A","N/A","N/A","N/A","N/A","N/A","N/A","N/A","N/A","N/A",1,1,1,1,1,1,1,1,1,1]
[null,null,null,null,null,null,null,null,null,null,null,null,null,null,null,null,null,null,null,null,null,null,null,null,null,null,null,null,null,null,null,null,null,null,null,null,null,null,null,null,null,null,null,null,null,null,null,null,null,null,"N/A",{"$f":"IF(COUNTA(K936:O936)>0,(COUNTIF(K936:O936,\"=0\")*0+COUNTIF(K936:O936,\"=1\")*100+COUNTIF(K936:O936,\"=2\")*80+COUNTIF(K936:O936,\"=3\")*50+COUNTIF(K936:O936,\"=8\")*20+COUNTIF(K936:O936,\"=9\")*0)/COUNTA(K936:O936)/100,\"N/A\")","v":"N/A"},"N/A","N/A","N/A","N/A","N/A","N/A","N/A","N/A",1,1,1,1,1,1,1,1,1,1]
[null,null,null,null,null,null,null,null,null,null,null,null,null,null,null,null,null,null,null,null,null,null,null,null,null,null,null,null,null,null,null,null,null,null,null,null,null,null,null,null,null,null,null,null,null,null,null,null,null,null,"N/A","N/A","N/A","N/A","N/A","N/A","N/A","N/A","N/A","N/A",1,1,1,1,1,1,1,1,1,1]
[null,null,null,null,null,null,null,null,null,null,null,null,null,null,null,null,null,null,null,null,null,null,null,null,null,null,null,null,null,null,null,null,null,null,null,null,null,null,null,null,null,null,null,null,null,null,null,null,null,null,"N/A","N/A","N/A","N/A","N/A","N/A","N/A","N/A","N/A","N/A",1,1,1,1,1,1,1,1,1,1]
[null,null,null,null,null,null,null,null,null,null,null,null,null,null,null,null,null,null,null,null,null,null,null,null,null,null,null,null,null,null,null,null,null,null,null,null,null,null,null,null,null,null,null,null,null,null,null,null,null,null,"N/A","N/A","N/A","N/A","N/A","N/A","N/A","N/A","N/A","N/A",1,1,1,1,1,1,1,1,1,1]
[null,null,null,null,null,null,null,null,null,null,null,null,null,null,null,null,null,null,null,null,null,null,null,null,null,null,null,null,null,null,null,null,null,null,null,null,null,null,null,null,null,null,null,null,null,null,null,null,null,null,"N/A","N/A","N/A","N/A","N/A","N/A","N/A","N/A","N/A","N/A",1,1,1,1,1,1,1,1,1,1]
[null,null,null,null,null,null,null,null,null,null,null,null,null,null,null,null,null,null,null,null,null,null,null,null,null,null,null,null,null,null,null,null,null,null,null,null,null,null,null,null,null,null,null,null,null,null,null,null,null,null,"N/A","N/A","N/A","N/A","N/A","N/A","N/A","N/A","N/A","N/A",1,1,1,1,1,1,1,1,1,1]
[null,null,null,null,null,null,null,null,null,null,null,null,null,null,null,null,null,null,null,null,null,null,null,null,null,null,null,null,null,null,null,null,null,null,null,null,null,null,null,null,null,null,null,null,null,null,null,null,null,null,"N/A","N/A","N/A","N/A","N/A","N/A","N/A","N/A","N/A","N/A",1,1,1,1,1,1,1,1,1,1]
[null,null,null,null,null,null,null,null,null,null,null,null,null,null,null,null,null,null,null,null,null,null,null,null,null,null,null,null,null,null,null,null,null,null,null,null,null,null,null,null,null,null,null,null,null,null,null,null,null,null,"N/A","N/A","N/A","N/A","N/A","N/A","N/A","N/A","N/A","N/A",1,1,1,1,1,1,1,1,1,1]
[null,null,null,null,null,null,null,null,null,null,null,null,null,null,null,null,null,null,null,null,null,null,null,null,null,null,null,null,null,null,null,null,null,null,null,null,null,null,null,null,null,null,null,null,null,null,null,null,null,null,"N/A","N/A","N/A","N/A","N/A","N/A","N/A","N/A","N/A","N/A",1,1,1,1,1,1,1,1,1,1]
[null,null,null,null,null,null,null,null,null,null,null,null,null,null,null,null,null,null,null,null,null,null,null,null,null,null,null,null,null,null,null,null,null,null,null,null,null,null,null,null,null,null,null,null,null,null,null,null,null,null,"N/A","N/A","N/A","N/A","N/A","N/A","N/A","N/A","N/A","N/A",1,1,1,1,1,1,1,1,1,1]
[null,null,null,null,null,null,null,null,null,null,null,null,null,null,null,null,null,null,null,null,null,null,null,null,null,null,null,null,null,null,null,null,null,null,null,null,null,null,null,null,null,null,null,null,null,null,null,null,null,null,"N/A","N/A","N/A","N/A","N/A","N/A","N/A","N/A","N/A","N/A",1,1,1,1,1,1,1,1,1,1]
[null,null,null,null,null,null,null,null,null,null,null,null,null,null,null,null,null,null,null,null,null,null,null,null,null,null,null,null,null,null,null,null,null,null,null,null,null,null,null,null,null,null,null,null,null,null,null,null,null,null,"N/A","N/A","N/A","N/A","N/A","N/A","N/A","N/A","N/A","N/A",1,1,1,1,1,1,1,1,1,1]
[null,null,null,null,null,null,null,null,null,null,null,null,null,null,null,null,null,null,null,null,null,null,null,null,null,null,null,null,null,null,null,null,null,null,null,null,null,null,null,null,null,null,null,null,null,null,null,null,null,null,"N/A","N/A","N/A","N/A","N/A","N/A","N/A","N/A","N/A","N/A",1,1,1,1,1,1,1,1,1,1]
[null,null,null,null,null,null,null,null,null,null,null,null,null,null,null,null,null,null,null,null,null,null,null,null,null,null,null,null,null,null,null,null,null,null,null,null,null,null,null,null,null,null,null,null,null,null,null,null,null,null,"N/A","N/A","N/A","N/A","N/A","N/A","N/A","N/A","N/A","N/A",1,1,1,1,1,1,1,1,1,1]
[null,null,null,null,null,null,null,null,null,null,null,null,null,null,null,null,null,null,null,null,null,null,null,null,null,null,null,null,null,null,null,null,null,null,null,null,null,null,null,null,null,null,null,null,null,null,null,null,null,null,"N/A","N/A","N/A","N/A","N/A","N/A","N/A","N/A","N/A","N/A",1,1,1,1,1,1,1,1,1,1]
[null,null,null,null,null,null,null,null,null,null,null,null,null,null,null,null,null,null,null,null,null,null,null,null,null,null,null,null,null,null,null,null,null,null,null,null,null,null,null,null,null,null,null,null,null,null,null,null,null,null,"N/A","N/A","N/A","N/A","N/A","N/A","N/A","N/A","N/A","N/A",1,1,1,1,1,1,1,1,1,1]
[null,null,null,null,null,null,null,null,null,null,null,null,null,null,null,null,null,null,null,null,null,null,null,null,null,null,null,null,null,null,null,null,null,null,null,null,null,null,null,null,null,null,null,null,null,null,null,null,null,null,"N/A","N/A","N/A","N/A","N/A","N/A","N/A","N/A","N/A","N/A",1,1,1,1,1,1,1,1,1,1]
[null,null,null,null,null,null,null,null,null,null,null,null,null,null,null,null,null,null,null,null,null,null,null,null,null,null,null,null,null,null,null,null,null,null,null,null,null,null,null,null,null,null,null,null,null,null,null,null,null,null,"N/A","N/A","N/A","N/A","N/A","N/A","N/A","N/A","N/A","N/A",1,1,1,1,1,1,1,1,1,{"$f":"IF(BH953=\"N/A\",1,\"\")","v":1}]
[null,null,null,null,null,null,null,null,null,null,null,null,null,null,null,null,null,null,null,null,null,null,null,null,null,null,null,null,null,null,null,null,null,null,null,null,null,null,null,null,null,null,null,null,null,null,null,null,null,null,"N/A","N/A","N/A","N/A","N/A","N/A","N/A","N/A","N/A","N/A",{"$f":"IF(AY954=\"N/A\",1,\"\")","v":1},{"$f":"IF(AZ954=\"N/A\",1,\"\")","v":1},{"$f":"IF(BA954=\"N/A\",1,\"\")","v":1},{"$f":"IF(BB954=\"N/A\",1,\"\")","v":1},{"$f":"IF(BC954=\"N/A\",1,\"\")","v":1},{"$f":"IF(BD954=\"N/A\",1,\"\")","v":1},{"$f":"IF(BE954=\"N/A\",1,\"\")","v":1},1,1,1]
[null,null,null,null,null,null,null,null,null,null,null,null,null,null,null,null,null,null,null,null,null,null,null,null,null,null,null,null,null,null,null,null,null,null,null,null,null,null,null,null,null,null,null,null,null,null,null,null,null,null,"N/A","N/A","N/A","N/A","N/A","N/A","N/A","N/A","N/A","N/A",1,1,1,1,1,1,1,1,1,1]
[null,null,null,null,null,null,null,null,null,null,null,null,null,null,null,null,null,null,null,null,null,null,null,null,null,null,null,null,null,null,null,null,null,null,null,null,null,null,null,null,null,null,null,null,null,null,null,null,null,null,"N/A","N/A","N/A","N/A","N/A","N/A","N/A","N/A","N/A","N/A",1,1,1,1,1,1,1,1,1,1]
[null,null,null,null,null,null,null,null,null,null,null,null,null,null,null,null,null,null,null,null,null,null,null,null,null,null,null,null,null,null,null,null,null,null,null,null,null,null,null,null,null,null,null,null,null,null,null,null,null,null,"N/A","N/A","N/A","N/A","N/A","N/A","N/A","N/A","N/A","N/A",1,1,1,1,1,1,1,1,1,1]
[null,null,null,null,null,null,null,null,null,null,null,null,null,null,null,null,null,null,null,null,null,null,null,null,null,null,null,null,null,null,null,null,null,null,null,null,null,null,null,null,null,null,null,null,null,null,null,null,null,null,"N/A","N/A","N/A","N/A","N/A","N/A","N/A","N/A","N/A","N/A",1,1,1,1,1,1,1,1,1,1]
[null,null,null,null,null,null,null,null,null,null,null,null,null,null,null,null,null,null,null,null,null,null,null,null,null,null,null,null,null,null,null,null,null,null,null,null,null,null,null,null,null,null,null,null,null,null,null,null,null,null,"N/A","N/A","N/A","N/A","N/A","N/A","N/A","N/A","N/A","N/A",1,1,1,1,1,1,1,1,1,1]
[null,null,null,null,null,null,null,null,null,null,null,null,null,null,null,null,null,null,null,null,null,null,null,null,null,null,null,null,null,null,null,null,null,null,null,null,null,null,null,null,null,null,null,null,null,null,null,null,null,null,"N/A","N/A","N/A","N/A","N/A","N/A","N/A","N/A","N/A","N/A",1,1,1,1,1,1,1,1,1,1]
[null,null,null,null,null,null,null,null,null,null,null,null,null,null,null,null,null,null,null,null,null,null,null,null,null,null,null,null,null,null,null,null,null,null,null,null,null,null,null,null,null,null,null,null,null,null,null,null,null,null,"N/A","N/A","N/A","N/A","N/A","N/A","N/A","N/A","N/A","N/A",1,1,1,1,1,1,1,1,1,1]
[null,null,null,null,null,null,null,null,null,null,null,null,null,null,null,null,null,null,null,null,null,null,null,null,null,null,null,null,null,null,null,null,null,null,null,null,null,null,null,null,null,null,null,null,null,null,null,null,null,null,"N/A","N/A","N/A","N/A","N/A","N/A","N/A","N/A","N/A","N/A",1,1,1,1,1,1,1,1,1,1]
[null,null,null,null,null,null,null,null,null,null,null,null,null,null,null,null,null,null,null,null,null,null,null,null,null,null,null,null,null,null,null,null,null,null,null,null,null,null,null,null,null,null,null,null,null,null,null,null,null,null,"N/A","N/A","N/A","N/A","N/A","N/A","N/A","N/A","N/A","N/A",1,1,1,1,1,1,1,1,1,1]
[null,null,null,null,null,null,null,null,null,null,null,null,null,null,null,null,null,null,null,null,null,null,null,null,null,null,null,null,null,null,null,null,null,null,null,null,null,null,null,null,null,null,null,null,null,null,null,null,null,null,"N/A","N/A","N/A","N/A","N/A","N/A","N/A","N/A","N/A","N/A",1,1,1,1,1,1,1,1,1,1]
[null,null,null,null,null,null,null,null,null,null,null,null,null,null,null,null,null,null,null,null,null,null,null,null,null,null,null,null,null,null,null,null,null,null,null,null,null,null,null,null,null,null,null,null,null,null,null,null,null,null,"N/A","N/A","N/A","N/A","N/A","N/A","N/A","N/A","N/A","N/A",1,1,1,1,1,1,1,1,1,1]
[null,null,null,null,null,null,null,null,null,null,null,null,null,null,null,null,null,null,null,null,null,null,null,null,null,null,null,null,null,null,null,null,null,null,null,null,null,null,null,null,null,null,null,null,null,null,null,null,null,null,"N/A","N/A","N/A","N/A","N/A","N/A","N/A","N/A","N/A","N/A",1,1,1,1,1,1,1,1,1,1]
[null,null,null,null,null,null,null,null,null,null,null,null,null,null,null,null,null,null,null,null,null,null,null,null,null,null,null,null,null,null,null,null,null,null,null,null,null,null,null,null,null,null,null,null,null,null,null,null,null,null,"N/A","N/A","N/A","N/A","N/A","N/A","N/A","N/A","N/A","N/A",1,1,1,1,1,1,1,1,1,1]
[null,null,null,null,null,null,null,null,null,null,null,null,null,null,null,null,null,null,null,null,null,null,null,null,null,null,null,null,null,null,null,null,null,null,null,null,null,null,null,null,null,null,null,null,null,null,null,null,null,null,"N/A","N/A","N/A","N/A","N/A","N/A","N/A","N/A","N/A","N/A",1,1,1,1,1,1,1,1,1,1]
[null,null,null,null,null,null,null,null,null,null,null,null,null,null,null,null,null,null,null,null,null,null,null,null,null,null,null,null,null,null,null,null,null,null,null,null,null,null,null,null,null,null,null,null,null,null,null,null,null,null,"N/A","N/A","N/A","N/A","N/A","N/A","N/A","N/A","N/A","N/A",1,1,1,1,1,1,1,1,1,1]
[null,null,null,null,null,null,null,null,null,null,null,null,null,null,null,null,null,null,null,null,null,null,null,null,null,null,null,null,null,null,null,null,null,null,null,null,null,null,null,null,null,null,null,null,null,null,null,null,null,null,"N/A","N/A","N/A","N/A","N/A","N/A","N/A","N/A","N/A","N/A",1,1,1,1,1,1,1,1,1,1]
[null,null,null,null,null,null,null,null,null,null,null,null,null,null,null,null,null,null,null,null,null,null,null,null,null,null,null,null,null,null,null,null,null,null,null,null,null,null,null,null,null,null,null,null,null,null,null,null,null,null,"N/A","N/A","N/A","N/A","N/A","N/A","N/A","N/A","N/A","N/A",1,1,1,1,1,1,1,1,1,1]
[null,null,null,null,null,null,null,null,null,null,null,null,null,null,null,null,null,null,null,null,null,null,null,null,null,null,null,null,null,null,null,null,null,null,null,null,null,null,null,null,null,null,null,null,null,null,null,null,null,null,"N/A","N/A","N/A","N/A","N/A","N/A","N/A","N/A","N/A","N/A",1,1,1,1,1,1,1,1,1,1]
[null,null,null,null,null,null,null,null,null,null,null,null,null,null,null,null,null,null,null,null,null,null,null,null,null,null,null,null,null,null,null,null,null,null,null,null,null,null,null,null,null,null,null,null,null,null,null,null,null,null,"N/A","N/A","N/A","N/A","N/A","N/A","N/A","N/A","N/A","N/A",1,1,1,1,1,1,1,1,1,1]
[null,null,null,null,null,null,null,null,null,null,null,null,null,null,null,null,null,null,null,null,null,null,null,null,null,null,null,null,null,null,null,null,null,null,null,null,null,null,null,null,null,null,null,null,null,null,null,null,null,null,"N/A","N/A","N/A","N/A","N/A","N/A","N/A","N/A","N/A","N/A",1,1,1,1,1,1,1,1,1,1]
[null,null,null,null,null,null,null,null,null,null,null,null,null,null,null,null,null,null,null,null,null,null,null,null,null,null,null,null,null,null,null,null,null,null,null,null,null,null,null,null,null,null,null,null,null,null,null,null,null,null,"N/A","N/A","N/A","N/A","N/A","N/A","N/A","N/A","N/A","N/A",1,1,1,1,1,1,1,1,1,1]
[null,null,null,null,null,null,null,null,null,null,null,null,null,null,null,null,null,null,null,null,null,null,null,null,null,null,null,null,null,null,null,null,null,null,null,null,null,null,null,null,null,null,null,null,null,null,null,null,null,null,"N/A","N/A","N/A","N/A","N/A","N/A","N/A","N/A","N/A","N/A",1,1,1,1,1,1,1,{"$f":"IF(BF976=\"N/A\",1,\"\")","v":1},{"$f":"IF(BG976=\"N/A\",1,\"\")","v":1},1]
[null,null,null,null,null,null,null,null,null,null,null,null,null,null,null,null,null,null,null,null,null,null,null,null,null,null,null,null,null,null,null,null,null,null,null,null,null,null,null,null,null,null,null,null,null,null,null,null,null,null,"N/A","N/A","N/A","N/A","N/A","N/A","N/A","N/A","N/A","N/A",1,1,1,1,1,1,1,1,1,1]
[null,null,null,null,null,null,null,null,null,null,null,null,null,null,null,null,null,null,null,null,null,null,null,null,null,null,null,null,null,null,null,null,null,null,null,null,null,null,null,null,null,null,null,null,null,null,null,null,null,null,"N/A","N/A","N/A","N/A","N/A","N/A","N/A","N/A","N/A","N/A",1,1,1,1,1,1,1,1,1,1]
[null,null,null,null,null,null,null,null,null,null,null,null,null,null,null,null,null,null,null,null,null,null,null,null,null,null,null,null,null,null,null,null,null,null,null,null,null,null,null,null,null,null,null,null,null,null,null,null,null,null,"N/A","N/A","N/A","N/A","N/A","N/A","N/A","N/A","N/A","N/A",1,1,1,1,1,1,1,1,1,1]
[null,null,null,null,null,null,null,null,null,null,null,null,null,null,null,null,null,null,null,null,null,null,null,null,null,null,null,null,null,null,null,null,null,null,null,null,null,null,null,null,null,null,null,null,null,null,null,null,null,null,"N/A","N/A","N/A","N/A","N/A","N/A","N/A","N/A","N/A","N/A",1,1,1,1,1,1,1,1,1,1]
[null,null,null,null,null,null,null,null,null,null,null,null,null,null,null,null,null,null,null,null,null,null,null,null,null,null,null,null,null,null,null,null,null,null,null,null,null,null,null,null,null,null,null,null,null,null,null,null,null,null,"N/A","N/A","N/A","N/A","N/A","N/A","N/A","N/A","N/A","N/A",1,1,1,1,1,1,1,1,1,1]
[null,null,null,null,null,null,null,null,null,null,null,null,null,null,null,null,null,null,null,null,null,null,null,null,null,null,null,null,null,null,null,null,null,null,null,null,null,null,null,null,null,null,null,null,null,null,null,null,null,null,"N/A","N/A","N/A","N/A","N/A","N/A","N/A","N/A","N/A","N/A",1,1,1,1,1,1,1,1,1,1]
[null,null,null,null,null,null,null,null,null,null,null,null,null,null,null,null,null,null,null,null,null,null,null,null,null,null,null,null,null,null,null,null,null,null,null,null,null,null,null,null,null,null,null,null,null,null,null,null,null,null,"N/A","N/A","N/A","N/A","N/A","N/A","N/A","N/A","N/A","N/A",1,1,1,1,1,1,1,1,1,1]
[null,null,null,null,null,null,null,null,null,null,null,null,null,null,null,null,null,null,null,null,null,null,null,null,null,null,null,null,null,null,null,null,null,null,null,null,null,null,null,null,null,null,null,null,null,null,null,null,null,null,"N/A","N/A","N/A","N/A","N/A","N/A","N/A","N/A","N/A","N/A",1,1,1,1,1,1,1,1,1,1]
[null,null,null,null,null,null,null,null,null,null,null,null,null,null,null,null,null,null,null,null,null,null,null,null,null,null,null,null,null,null,null,null,null,null,null,null,null,null,null,null,null,null,null,null,null,null,null,null,null,null,"N/A","N/A","N/A","N/A","N/A","N/A","N/A","N/A","N/A","N/A",1,1,1,1,1,1,1,1,1,1]
[null,null,null,null,null,null,null,null,null,null,null,null,null,null,null,null,null,null,null,null,null,null,null,null,null,null,null,null,null,null,null,null,null,null,null,null,null,null,null,null,null,null,null,null,null,null,null,null,null,null,"N/A","N/A","N/A","N/A","N/A","N/A","N/A","N/A","N/A","N/A",1,1,1,1,1,1,1,1,1,1]
[null,null,null,null,null,null,null,null,null,null,null,null,null,null,null,null,null,null,null,null,null,null,null,null,null,null,null,null,null,null,null,null,null,null,null,null,null,null,null,null,null,null,null,null,null,null,null,null,null,null,"N/A","N/A","N/A","N/A","N/A","N/A","N/A","N/A","N/A","N/A",1,1,1,1,1,1,1,1,1,1]
[null,null,null,null,null,null,null,null,null,null,null,null,null,null,null,null,null,null,null,null,null,null,null,null,null,null,null,null,null,null,null,null,null,null,null,null,null,null,null,null,null,null,null,null,null,null,null,null,null,null,"N/A","N/A","N/A","N/A","N/A","N/A","N/A","N/A","N/A","N/A",1,1,1,1,1,1,1,1,1,1]
[null,null,null,null,null,null,null,null,null,null,null,null,null,null,null,null,null,null,null,null,null,null,null,null,null,null,null,null,null,null,null,null,null,null,null,null,null,null,null,null,null,null,null,null,null,null,null,null,null,null,"N/A","N/A","N/A","N/A","N/A","N/A","N/A","N/A","N/A","N/A",1,1,1,1,1,1,1,1,1,1]
[null,null,null,null,null,null,null,null,null,null,null,null,null,null,null,null,null,null,null,null,null,null,null,null,null,null,null,null,null,null,null,null,null,null,null,null,null,null,null,null,null,null,null,null,null,null,null,null,null,null,"N/A","N/A","N/A","N/A","N/A","N/A","N/A","N/A","N/A","N/A",1,1,1,1,1,1,1,1,1,1]
[null,null,null,null,null,null,null,null,null,null,null,null,null,null,null,null,null,null,null,null,null,null,null,null,null,null,null,null,null,null,null,null,null,null,null,null,null,null,null,null,null,null,null,null,null,null,null,null,null,null,"N/A","N/A","N/A","N/A","N/A","N/A","N/A","N/A","N/A","N/A",1,1,1,1,1,1,1,1,1,1]
[null,null,null,null,null,null,null,null,null,null,null,null,null,null,null,null,null,null,null,null,null,null,null,null,null,null,null,null,null,null,null,null,null,null,null,null,null,null,null,null,null,null,null,null,null,null,null,null,null,null,"N/A","N/A","N/A","N/A","N/A","N/A","N/A","N/A","N/A","N/A",1,1,1,1,1,1,1,1,1,1]
[null,null,null,null,null,null,null,null,null,null,null,null,null,null,null,null,null,null,null,null,null,null,null,null,null,null,null,null,null,null,null,null,null,null,null,null,null,null,null,null,null,null,null,null,null,null,null,null,null,null,"N/A","N/A","N/A","N/A","N/A","N/A","N/A","N/A","N/A","N/A",1,1,1,1,1,1,1,1,1,1]
[null,null,null,null,null,null,null,null,null,null,null,null,null,null,null,null,null,null,null,null,null,null,null,null,null,null,null,null,null,null,null,null,null,null,null,null,null,null,null,null,null,null,null,null,null,null,null,null,null,null,"N/A","N/A","N/A","N/A","N/A","N/A","N/A","N/A","N/A","N/A",1,1,1,1,1,1,1,1,1,1]
[null,null,null,null,null,null,null,null,null,null,null,null,null,null,null,null,null,null,null,null,null,null,null,null,null,null,null,null,null,null,null,null,null,null,null,null,null,null,null,null,null,null,null,null,null,null,null,null,null,null,"N/A","N/A","N/A","N/A","N/A","N/A","N/A","N/A","N/A","N/A",1,1,1,1,1,1,1,1,1,1]
[null,null,null,null,null,null,null,null,null,null,null,null,null,null,null,null,null,null,null,null,null,null,null,null,null,null,null,null,null,null,null,null,null,null,null,null,null,null,null,null,null,null,null,null,null,null,null,null,null,null,{"$f":"IF(COUNTA(E996:J996)>0,(COUNTIF(E996:J996,\"=0\")*0+COUNTIF(E996:J996,\"=1\")*100+COUNTIF(E996:J996,\"=2\")*80+COUNTIF(E996:J996,\"=3\")*50+COUNTIF(E996:J996,\"=8\")*20+COUNTIF(E996:J996,\"=9\")*0)/COUNTA(E996:J996)/100,\"N/A\")","v":"N/A"},"N/A",{"$f":"IF(COUNTA(P996:U996)>0,(COUNTIF(P996:U996,\"=0\")*0+COUNTIF(P996:U996,\"=1\")*100+COUNTIF(P996:U996,\"=2\")*80+COUNTIF(P996:U996,\"=3\")*50+COUNTIF(P996:U996,\"=8\")*20+COUNTIF(P996:U996,\"=9\")*0)/COUNTA(P996:U996)/100,\"N/A\")","v":"N/A"},{"$f":"IF(COUNTA(V996)<>0,(COUNTIF(V996,\"=0\")*0+COUNTIF(V996,\"=1\")*100+COUNTIF(V996,\"=2\")*80+COUNTIF(V996,\"=3\")*50+COUNTIF(V996,\"=8\")*20+COUNTIF(V996,\"=9\")*0)/COUNTA(V996)/100,\"N/A\")","v":"N/A"},{"$f":"IF(COUNTA(W996:X996)>0,(COUNTIF(W996:X996,\"=0\")*0+COUNTIF(W996:X996,\"=1\")*100+COUNTIF(W996:X996,\"=2\")*80+COUNTIF(W996:X996,\"=3\")*50+COUNTIF(W996:X996,\"=8\")*20+COUNTIF(W996:X996,\"=9\")*0)/COUNTA(W996:X996)/100,\"N/A\")","v":"N/A"},{"$f":"IF(COUNTA(Y996:AJ996)>0,(COUNTIF(Y996:AJ996,\"=0\")*0+COUNTIF(Y996:AJ996,\"=1\")*100+COUNTIF(Y996:AJ996,\"=2\")*80+COUNTIF(Y996:AJ996,\"=3\")*50+COUNTIF(Y996:AJ996,\"=8\")*20+COUNTIF(Y996:AJ996,\"=9\")*0)/COUNTA(Y996:AJ996)/100,\"N/A\")","v":"N/A"},{"$f":"IF(COUNTA(AK996:AP996)>0,(COUNTIF(AK996:AP996,\"=0\")*0+COUNTIF(AK996:AP996,\"=1\")*100+COUNTIF(AK996:AP996,\"=2\")*80+COUNTIF(AK996:AP996,\"=3\")*50+COUNTIF(AK996:AP996,\"=8\")*20+COUNTIF(AK996:AP996,\"=9\")*0)/COUNTA(AK996:AP996)/100,\"N/A\")","v":"N/A"},{"$f":"IF(COUNTA(AQ996:AU996)>0,(COUNTIF(AQ996:AU996,\"=0\")*0+COUNTIF(AQ996:AU996,\"=1\")*100+COUNTIF(AQ996:AU996,\"=2\")*80+COUNTIF(AQ996:AU996,\"=3\")*50+COUNTIF(AQ996:AU996,\"=8\")*20+COUNTIF(AQ996:AU996,\"=9\")*0)/COUNTA(AQ996:AU996)/100,\"N/A\")","v":"N/A"},{"$f":"IF(COUNTA(AV996:AX996)>0,(COUNTIF(AV996:AX996,\"=0\")*0+COUNTIF(AV996:AX996,\"=1\")*100+COUNTIF(AV996:AX996,\"=2\")*80+COUNTIF(AV996:AX996,\"=3\")*50+COUNTIF(AV996:AX996,\"=8\")*20+COUNTIF(AV996:AX996,\"=9\")*0)/COUNTA(AV996:AX996)/100,\"N/A\")","v":"N/A"},{"$f":"IF(AND(COUNTA(E996:AX996)<>0,B996<>\"\"),AVERAGE(BA996:BG996),\"N/A\")","v":"N/A"},1,1,1,1,1,1,1,1,1,1]
[null,null,null,null,null,null,null,null,null,null,null,null,null,null,null,null,null,null,null,null,null,null,null,null,null,null,null,null,null,null,null,null,null,null,null,null,null,null,null,null,null,null,null,null,null,null,null,null,null,null,"N/A","N/A","N/A","N/A","N/A","N/A","N/A","N/A","N/A","N/A",1,1,1,1,1,1,1,1,1,1]
[null,null,null,null,null,null,null,null,null,null,null,null,null,null,null,null,null,null,null,null,null,null,null,null,null,null,null,null,null,null,null,null,null,null,null,null,null,null,null,null,null,null,null,null,null,null,null,null,null,null,"N/A","N/A","N/A","N/A","N/A","N/A","N/A","N/A","N/A","N/A",1,1,1,1,1,1,1,1,1,1]
[null,null,null,null,null,null,null,null,null,null,null,null,null,null,null,null,null,null,null,null,null,null,null,null,null,null,null,null,null,null,null,null,null,null,null,null,null,null,null,null,null,null,null,null,null,null,null,null,null,null,"N/A","N/A","N/A","N/A","N/A","N/A","N/A","N/A","N/A","N/A",1,1,1,1,1,1,1,1,1,1]
[null,null,null,null,null,null,null,null,null,null,null,null,null,null,null,null,null,null,null,null,null,null,null,null,null,null,null,null,null,null,null,null,null,null,null,null,null,null,null,null,null,null,null,null,null,null,null,null,null,null,"N/A",{"$f":"IF(COUNTA(K1000:O1000)>0,(COUNTIF(K1000:O1000,\"=0\")*0+COUNTIF(K1000:O1000,\"=1\")*100+COUNTIF(K1000:O1000,\"=2\")*80+COUNTIF(K1000:O1000,\"=3\")*50+COUNTIF(K1000:O1000,\"=8\")*20+COUNTIF(K1000:O1000,\"=9\")*0)/COUNTA(K1000:O1000)/100,\"N/A\")","v":"N/A"},"N/A","N/A","N/A","N/A","N/A","N/A","N/A","N/A",1,1,1,1,1,1,1,1,1,1]
[null,null,null,null,null,null,null,null,null,null,null,null,null,null,null,null,null,null,null,null,null,null,null,null,null,null,null,null,null,null,null,null,null,null,null,null,null,null,null,null,null,null,null,null,null,null,null,null,null,null,"N/A","N/A","N/A","N/A","N/A","N/A","N/A","N/A","N/A","N/A",1,1,1,1,1,1,1,1,1,1]
[null,null,null,null,null,null,null,null,null,null,null,null,null,null,null,null,null,null,null,null,null,null,null,null,null,null,null,null,null,null,null,null,null,null,null,null,null,null,null,null,null,null,null,null,null,null,null,null,null,null,"N/A","N/A","N/A","N/A","N/A","N/A","N/A","N/A","N/A","N/A",1,1,1,1,1,1,1,1,1,1]
[null,null,null,null,null,null,null,null,null,null,null,null,null,null,null,null,null,null,null,null,null,null,null,null,null,null,null,null,null,null,null,null,null,null,null,null,null,null,null,null,null,null,null,null,null,null,null,null,null,null,"N/A","N/A","N/A","N/A","N/A","N/A","N/A","N/A","N/A","N/A",1,1,1,1,1,1,1,1,1,1]
[null,null,null,null,null,null,null,null,null,null,null,null,null,null,null,null,null,null,null,null,null,null,null,null,null,null,null,null,null,null,null,null,null,null,null,null,null,null,null,null,null,null,null,null,null,null,null,null,null,null,"N/A","N/A","N/A","N/A","N/A","N/A","N/A","N/A","N/A","N/A",1,1,1,1,1,1,1,1,1,1]
[null,null,null,null,null,null,null,null,null,null,null,null,null,null,null,null,null,null,null,null,null,null,null,null,null,null,null,null,null,null,null,null,null,null,null,null,null,null,null,null,null,null,null,null,null,null,null,null,null,null,{"$f":"IF(COUNTA(E1005:J1005)>0,(COUNTIF(E1005:J1005,\"=0\")*0+COUNTIF(E1005:J1005,\"=1\")*100+COUNTIF(E1005:J1005,\"=2\")*80+COUNTIF(E1005:J1005,\"=3\")*50+COUNTIF(E1005:J1005,\"=8\")*20+COUNTIF(E1005:J1005,\"=9\")*0)/COUNTA(E1005:J1005)/100,\"N/A\")","v":"N/A"},{"$f":"IF(COUNTA(K1005:O1005)>0,(COUNTIF(K1005:O1005,\"=0\")*0+COUNTIF(K1005:O1005,\"=1\")*100+COUNTIF(K1005:O1005,\"=2\")*80+COUNTIF(K1005:O1005,\"=3\")*50+COUNTIF(K1005:O1005,\"=8\")*20+COUNTIF(K1005:O1005,\"=9\")*0)/COUNTA(K1005:O1005)/100,\"N/A\")","v":"N/A"},{"$f":"IF(COUNTA(P1005:U1005)>0,(COUNTIF(P1005:U1005,\"=0\")*0+COUNTIF(P1005:U1005,\"=1\")*100+COUNTIF(P1005:U1005,\"=2\")*80+COUNTIF(P1005:U1005,\"=3\")*50+COUNTIF(P1005:U1005,\"=8\")*20+COUNTIF(P1005:U1005,\"=9\")*0)/COUNTA(P1005:U1005)/100,\"N/A\")","v":"N/A"},{"$f":"IF(COUNTA(V1005)<>0,(COUNTIF(V1005,\"=0\")*0+COUNTIF(V1005,\"=1\")*100+COUNTIF(V1005,\"=2\")*80+COUNTIF(V1005,\"=3\")*50+COUNTIF(V1005,\"=8\")*20+COUNTIF(V1005,\"=9\")*0)/COUNTA(V1005)/100,\"N/A\")","v":"N/A"},{"$f":"IF(COUNTA(W1005:X1005)>0,(COUNTIF(W1005:X1005,\"=0\")*0+COUNTIF(W1005:X1005,\"=1\")*100+COUNTIF(W1005:X1005,\"=2\")*80+COUNTIF(W1005:X1005,\"=3\")*50+COUNTIF(W1005:X1005,\"=8\")*20+COUNTIF(W1005:X1005,\"=9\")*0)/COUNTA(W1005:X1005)/100,\"N/A\")","v":"N/A"},{"$f":"IF(COUNTA(Y1005:AJ1005)>0,(COUNTIF(Y1005:AJ1005,\"=0\")*0+COUNTIF(Y1005:AJ1005,\"=1\")*100+COUNTIF(Y1005:AJ1005,\"=2\")*80+COUNTIF(Y1005:AJ1005,\"=3\")*50+COUNTIF(Y1005:AJ1005,\"=8\")*20+COUNTIF(Y1005:AJ1005,\"=9\")*0)/COUNTA(Y1005:AJ1005)/100,\"N/A\")","v":"N/A"},{"$f":"IF(COUNTA(AK1005:AP1005)>0,(COUNTIF(AK1005:AP1005,\"=0\")*0+COUNTIF(AK1005:AP1005,\"=1\")*100+COUNTIF(AK1005:AP1005,\"=2\")*80+COUNTIF(AK1005:AP1005,\"=3\")*50+COUNTIF(AK1005:AP1005,\"=8\")*20+COUNTIF(AK1005:AP1005,\"=9\")*0)/COUNTA(AK1005:AP1005)/100,\"N/A\")","v":"N/A"},{"$f":"IF(COUNTA(AQ1005:AU1005)>0,(COUNTIF(AQ1005:AU1005,\"=0\")*0+COUNTIF(AQ1005:AU1005,\"=1\")*100+COUNTIF(AQ1005:AU1005,\"=2\")*80+COUNTIF(AQ1005:AU1005,\"=3\")*50+COUNTIF(AQ1005:AU1005,\"=8\")*20+COUNTIF(AQ1005:AU1005,\"=9\")*0)/COUNTA(AQ1005:AU1005)/100,\"N/A\")","v":"N/A"},{"$f":"IF(COUNTA(AV1005:AX1005)>0,(COUNTIF(AV1005:AX1005,\"=0\")*0+COUNTIF(AV1005:AX1005,\"=1\")*100+COUNTIF(AV1005:AX1005,\"=2\")*80+COUNTIF(AV1005:AX1005,\"=3\")*50+COUNTIF(AV1005:AX1005,\"=8\")*20+COUNTIF(AV1005:AX1005,\"=9\")*0)/COUNTA(AV1005:AX1005)/100,\"N/A\")","v":"N/A"},{"$f":"IF(AND(COUNTA(E1005:AX1005)<>0,B1005<>\"\"),AVERAGE(BA1005:BG1005),\"N/A\")","v":"N/A"},1,1,1,1,1,1,1,1,1,1]
[null,null,null,null,null,null,null,null,null,null,null,null,null,null,null,null,null,null,null,null,null,null,null,null,null,null,null,null,null,null,null,null,null,null,null,null,null,null,null,null,null,null,null,null,null,null,null,null,null,null,{"$f":"IF(COUNTA(E1006:J1006)>0,(COUNTIF(E1006:J1006,\"=0\")*0+COUNTIF(E1006:J1006,\"=1\")*100+COUNTIF(E1006:J1006,\"=2\")*80+COUNTIF(E1006:J1006,\"=3\")*50+COUNTIF(E1006:J1006,\"=8\")*20+COUNTIF(E1006:J1006,\"=9\")*0)/COUNTA(E1006:J1006)/100,\"N/A\")","v":"N/A"},{"$f":"IF(COUNTA(K1006:O1006)>0,(COUNTIF(K1006:O1006,\"=0\")*0+COUNTIF(K1006:O1006,\"=1\")*100+COUNTIF(K1006:O1006,\"=2\")*80+COUNTIF(K1006:O1006,\"=3\")*50+COUNTIF(K1006:O1006,\"=8\")*20+COUNTIF(K1006:O1006,\"=9\")*0)/COUNTA(K1006:O1006)/100,\"N/A\")","v":"N/A"},{"$f":"IF(COUNTA(P1006:U1006)>0,(COUNTIF(P1006:U1006,\"=0\")*0+COUNTIF(P1006:U1006,\"=1\")*100+COUNTIF(P1006:U1006,\"=2\")*80+COUNTIF(P1006:U1006,\"=3\")*50+COUNTIF(P1006:U1006,\"=8\")*20+COUNTIF(P1006:U1006,\"=9\")*0)/COUNTA(P1006:U1006)/100,\"N/A\")","v":"N/A"},{"$f":"IF(COUNTA(V1006)<>0,(COUNTIF(V1006,\"=0\")*0+COUNTIF(V1006,\"=1\")*100+COUNTIF(V1006,\"=2\")*80+COUNTIF(V1006,\"=3\")*50+COUNTIF(V1006,\"=8\")*20+COUNTIF(V1006,\"=9\")*0)/COUNTA(V1006)/100,\"N/A\")","v":"N/A"},{"$f":"IF(COUNTA(W1006:X1006)>0,(COUNTIF(W1006:X1006,\"=0\")*0+COUNTIF(W1006:X1006,\"=1\")*100+COUNTIF(W1006:X1006,\"=2\")*80+COUNTIF(W1006:X1006,\"=3\")*50+COUNTIF(W1006:X1006,\"=8\")*20+COUNTIF(W1006:X1006,\"=9\")*0)/COUNTA(W1006:X1006)/100,\"N/A\")","v":"N/A"},{"$f":"IF(COUNTA(Y1006:AJ1006)>0,(COUNTIF(Y1006:AJ1006,\"=0\")*0+COUNTIF(Y1006:AJ1006,\"=1\")*100+COUNTIF(Y1006:AJ1006,\"=2\")*80+COUNTIF(Y1006:AJ1006,\"=3\")*50+COUNTIF(Y1006:AJ1006,\"=8\")*20+COUNTIF(Y1006:AJ1006,\"=9\")*0)/COUNTA(Y1006:AJ1006)/100,\"N/A\")","v":"N/A"},{"$f":"IF(COUNTA(AK1006:AP1006)>0,(COUNTIF(AK1006:AP1006,\"=0\")*0+COUNTIF(AK1006:AP1006,\"=1\")*100+COUNTIF(AK1006:AP1006,\"=2\")*80+COUNTIF(AK1006:AP1006,\"=3\")*50+COUNTIF(AK1006:AP1006,\"=8\")*20+COUNTIF(AK1006:AP1006,\"=9\")*0)/COUNTA(AK1006:AP1006)/100,\"N/A\")","v":"N/A"},{"$f":"IF(COUNTA(AQ1006:AU1006)>0,(COUNTIF(AQ1006:AU1006,\"=0\")*0+COUNTIF(AQ1006:AU1006,\"=1\")*100+COUNTIF(AQ1006:AU1006,\"=2\")*80+COUNTIF(AQ1006:AU1006,\"=3\")*50+COUNTIF(AQ1006:AU1006,\"=8\")*20+COUNTIF(AQ1006:AU1006,\"=9\")*0)/COUNTA(AQ1006:AU1006)/100,\"N/A\")","v":"N/A"},{"$f":"IF(COUNTA(AV1006:AX1006)>0,(COUNTIF(AV1006:AX1006,\"=0\")*0+COUNTIF(AV1006:AX1006,\"=1\")*100+COUNTIF(AV1006:AX1006,\"=2\")*80+COUNTIF(AV1006:AX1006,\"=3\")*50+COUNTIF(AV1006:AX1006,\"=8\")*20+COUNTIF(AV1006:AX1006,\"=9\")*0)/COUNTA(AV1006:AX1006)/100,\"N/A\")","v":"N/A"},{"$f":"IF(AND(COUNTA(E1006:AX1006)<>0,B1006<>\"\"),AVERAGE(BA1006:BG1006),\"N/A\")","v":"N/A"},1,1,1,1,1,1,1,1,1,1]
[null,null,null,null,null,null,null,null,null,null,null,null,null,null,null,null,null,null,null,null,null,null,null,null,null,null,null,null,null,null,null,null,null,null,null,null,null,null,null,null,null,null,null,null,null,null,null,null,null,null,"N/A","N/A","N/A","N/A","N/A","N/A","N/A","N/A","N/A","N/A",1,1,1,1,1,1,1,1,1,1]
[null,null,null,null,null,null,null,null,null,null,null,null,null,null,null,null,null,null,null,null,null,null,null,null,null,null,null,null,null,null,null,null,null,null,null,null,null,null,null,null,null,null,null,null,null,null,null,null,null,null,"N/A","N/A","N/A","N/A","N/A","N/A","N/A","N/A","N/A","N/A",1,1,1,1,1,1,1,1,1,1]
[null,null,null,null,null,null,null,null,null,null,null,null,null,null,null,null,null,null,null,null,null,null,null,null,null,null,null,null,null,null,null,null,null,null,null,null,null,null,null,null,null,null,null,null,null,null,null,null,null,null,"N/A",{"$f":"IF(COUNTA(K1009:O1009)>0,(COUNTIF(K1009:O1009,\"=0\")*0+COUNTIF(K1009:O1009,\"=1\")*100+COUNTIF(K1009:O1009,\"=2\")*80+COUNTIF(K1009:O1009,\"=3\")*50+COUNTIF(K1009:O1009,\"=8\")*20+COUNTIF(K1009:O1009,\"=9\")*0)/COUNTA(K1009:O1009)/100,\"N/A\")","v":"N/A"},"N/A","N/A","N/A","N/A","N/A","N/A","N/A","N/A",1,1,1,1,1,1,1,1,1,1]
[null,null,null,null,null,null,null,null,null,null,null,null,null,null,null,null,null,null,null,null,null,null,null,null,null,null,null,null,null,null,null,null,null,null,null,null,null,null,null,null,null,null,null,null,null,null,null,null,null,null,"N/A",{"$f":"IF(COUNTA(K1010:O1010)>0,(COUNTIF(K1010:O1010,\"=0\")*0+COUNTIF(K1010:O1010,\"=1\")*100+COUNTIF(K1010:O1010,\"=2\")*80+COUNTIF(K1010:O1010,\"=3\")*50+COUNTIF(K1010:O1010,\"=8\")*20+COUNTIF(K1010:O1010,\"=9\")*0)/COUNTA(K1010:O1010)/100,\"N/A\")","v":"N/A"},"N/A","N/A","N/A","N/A","N/A","N/A","N/A","N/A",1,1,1,1,1,1,1,1,1,1]
[null,null,null,null,null,null,null,null,null,null,null,null,null,null,null,null,null,null,null,null,null,null,null,null,null,null,null,null,null,null,null,null,null,null,null,null,null,null,null,null,null,null,null,null,null,null,null,null,null,null,"N/A","N/A","N/A","N/A","N/A","N/A","N/A","N/A","N/A","N/A",1,1,1,1,1,1,1,1,1,1]
[null,null,null,null,null,null,null,null,null,null,null,null,null,null,null,null,null,null,null,null,null,null,null,null,null,null,null,null,null,null,null,null,null,null,null,null,null,null,null,null,null,null,null,null,null,null,null,null,null,null,"N/A","N/A","N/A","N/A","N/A","N/A","N/A","N/A","N/A","N/A",1,1,1,1,1,1,1,1,1,1]
[null,null,null,null,null,null,null,null,null,null,null,null,null,null,null,null,null,null,null,null,null,null,null,null,null,null,null,null,null,null,null,null,null,null,null,null,null,null,null,null,null,null,null,null,null,null,null,null,null,null,"N/A","N/A","N/A","N/A","N/A","N/A","N/A","N/A","N/A","N/A",1,1,1,1,1,1,1,1,1,1]
[null,null,null,null,null,null,null,null,null,null,null,null,null,null,null,null,null,null,null,null,null,null,null,null,null,null,null,null,null,null,null,null,null,null,null,null,null,null,null,null,null,null,null,null,null,null,null,null,null,null,"N/A","N/A","N/A","N/A","N/A","N/A","N/A","N/A","N/A","N/A",1,1,1,1,1,1,1,1,1,1]
[null,null,null,null,null,null,null,null,null,null,null,null,null,null,null,null,null,null,null,null,null,null,null,null,null,null,null,null,null,null,null,null,null,null,null,null,null,null,null,null,null,null,null,null,null,null,null,null,null,null,"N/A","N/A","N/A","N/A","N/A","N/A","N/A","N/A","N/A","N/A",1,1,1,1,1,1,1,1,1,1]
[null,null,null,null,null,null,null,null,null,null,null,null,null,null,null,null,null,null,null,null,null,null,null,null,null,null,null,null,null,null,null,null,null,null,null,null,null,null,null,null,null,null,null,null,null,null,null,null,null,null,"N/A","N/A","N/A","N/A","N/A","N/A","N/A","N/A","N/A","N/A",1,1,1,1,1,1,1,1,1,1]
[null,null,null,null,null,null,null,null,null,null,null,null,null,null,null,null,null,null,null,null,null,null,null,null,null,null,null,null,null,null,null,null,null,null,null,null,null,null,null,null,null,null,null,null,null,null,null,null,null,null,"N/A","N/A","N/A","N/A","N/A","N/A","N/A","N/A","N/A","N/A",1,1,1,1,1,1,1,1,1,{"$f":"IF(BH1017=\"N/A\",1,\"\")","v":1}]
[null,null,null,null,null,null,null,null,null,null,null,null,null,null,null,null,null,null,null,null,null,null,null,null,null,null,null,null,null,null,null,null,null,null,null,null,null,null,null,null,null,null,null,null,null,null,null,null,null,null,"N/A","N/A","N/A","N/A","N/A","N/A","N/A","N/A","N/A","N/A",{"$f":"IF(AY1018=\"N/A\",1,\"\")","v":1},{"$f":"IF(AZ1018=\"N/A\",1,\"\")","v":1},{"$f":"IF(BA1018=\"N/A\",1,\"\")","v":1},{"$f":"IF(BB1018=\"N/A\",1,\"\")","v":1},{"$f":"IF(BC1018=\"N/A\",1,\"\")","v":1},{"$f":"IF(BD1018=\"N/A\",1,\"\")","v":1},{"$f":"IF(BE1018=\"N/A\",1,\"\")","v":1},1,1,1]
[null,null,null,null,null,null,null,null,null,null,null,null,null,null,null,null,null,null,null,null,null,null,null,null,null,null,null,null,null,null,null,null,null,null,null,null,null,null,null,null,null,null,null,null,null,null,null,null,null,null,"N/A","N/A","N/A","N/A","N/A","N/A","N/A","N/A","N/A","N/A",1,1,1,1,1,1,1,1,1,1]
[null,null,null,null,null,null,null,null,null,null,null,null,null,null,null,null,null,null,null,null,null,null,null,null,null,null,null,null,null,null,null,null,null,null,null,null,null,null,null,null,null,null,null,null,null,null,null,null,null,null,"N/A","N/A","N/A","N/A","N/A","N/A","N/A","N/A","N/A","N/A",1,1,1,1,1,1,1,1,1,1]
[null,null,null,null,null,null,null,null,null,null,null,null,null,null,null,null,null,null,null,null,null,null,null,null,null,null,null,null,null,null,null,null,null,null,null,null,null,null,null,null,null,null,null,null,null,null,null,null,null,null,"N/A","N/A","N/A","N/A","N/A","N/A","N/A","N/A","N/A","N/A",1,1,1,1,1,1,1,1,1,1]
[null,null,null,null,null,null,null,null,null,null,null,null,null,null,null,null,null,null,null,null,null,null,null,null,null,null,null,null,null,null,null,null,null,null,null,null,null,null,null,null,null,null,null,null,null,null,null,null,null,null,"N/A","N/A","N/A","N/A","N/A","N/A","N/A","N/A","N/A","N/A",1,1,1,1,1,1,1,1,1,1]
[null,null,null,null,null,null,null,null,null,null,null,null,null,null,null,null,null,null,null,null,null,null,null,null,null,null,null,null,null,null,null,null,null,null,null,null,null,null,null,null,null,null,null,null,null,null,null,null,null,null,"N/A","N/A","N/A","N/A","N/A","N/A","N/A","N/A","N/A","N/A",1,1,1,1,1,1,1,1,1,1]
[null,null,null,null,null,null,null,null,null,null,null,null,null,null,null,null,null,null,null,null,null,null,null,null,null,null,null,null,null,null,null,null,null,null,null,null,null,null,null,null,null,null,null,null,null,null,null,null,null,null,"N/A","N/A","N/A","N/A","N/A","N/A","N/A","N/A","N/A","N/A",1,1,1,1,1,1,1,1,1,1]
[null,null,null,null,null,null,null,null,null,null,null,null,null,null,null,null,null,null,null,null,null,null,null,null,null,null,null,null,null,null,null,null,null,null,null,null,null,null,null,null,null,null,null,null,null,null,null,null,null,null,"N/A","N/A","N/A","N/A","N/A","N/A","N/A","N/A","N/A","N/A",1,1,1,1,1,1,1,1,1,1]
[null,null,null,null,null,null,null,null,null,null,null,null,null,null,null,null,null,null,null,null,null,null,null,null,null,null,null,null,null,null,null,null,null,null,null,null,null,null,null,null,null,null,null,null,null,null,null,null,null,null,"N/A","N/A","N/A","N/A","N/A","N/A","N/A","N/A","N/A","N/A",1,1,1,1,1,1,1,1,1,1]
[null,null,null,null,null,null,null,null,null,null,null,null,null,null,null,null,null,null,null,null,null,null,null,null,null,null,null,null,null,null,null,null,null,null,null,null,null,null,null,null,null,null,null,null,null,null,null,null,null,null,"N/A","N/A","N/A","N/A","N/A","N/A","N/A","N/A","N/A","N/A",1,1,1,1,1,1,1,1,1,1]
[null,null,null,null,null,null,null,null,null,null,null,null,null,null,null,null,null,null,null,null,null,null,null,null,null,null,null,null,null,null,null,null,null,null,null,null,null,null,null,null,null,null,null,null,null,null,null,null,null,null,"N/A","N/A","N/A","N/A","N/A","N/A","N/A","N/A","N/A","N/A",1,1,1,1,1,1,1,1,1,1]
[null,null,null,null,null,null,null,null,null,null,null,null,null,null,null,null,null,null,null,null,null,null,null,null,null,null,null,null,null,null,null,null,null,null,null,null,null,null,null,null,null,null,null,null,null,null,null,null,null,null,"N/A","N/A","N/A","N/A","N/A","N/A","N/A","N/A","N/A","N/A",1,1,1,1,1,1,1,1,1,1]
[null,null,null,null,null,null,null,null,null,null,null,null,null,null,null,null,null,null,null,null,null,null,null,null,null,null,null,null,null,null,null,null,null,null,null,null,null,null,null,null,null,null,null,null,null,null,null,null,null,null,"N/A","N/A","N/A","N/A","N/A","N/A","N/A","N/A","N/A","N/A",1,1,1,1,1,1,1,1,1,1]
[null,null,null,null,null,null,null,null,null,null,null,null,null,null,null,null,null,null,null,null,null,null,null,null,null,null,null,null,null,null,null,null,null,null,null,null,null,null,null,null,null,null,null,null,null,null,null,null,null,null,"N/A","N/A","N/A","N/A","N/A","N/A","N/A","N/A","N/A","N/A",1,1,1,1,1,1,1,1,1,1]
[null,null,null,null,null,null,null,null,null,null,null,null,null,null,null,null,null,null,null,null,null,null,null,null,null,null,null,null,null,null,null,null,null,null,null,null,null,null,null,null,null,null,null,null,null,null,null,null,null,null,"N/A","N/A","N/A","N/A","N/A","N/A","N/A","N/A","N/A","N/A",1,1,1,1,1,1,1,1,1,1]
[null,null,null,null,null,null,null,null,null,null,null,null,null,null,null,null,null,null,null,null,null,null,null,null,null,null,null,null,null,null,null,null,null,null,null,null,null,null,null,null,null,null,null,null,null,null,null,null,null,null,"N/A","N/A","N/A","N/A","N/A","N/A","N/A","N/A","N/A","N/A",1,1,1,1,1,1,1,1,1,1]
[null,null,null,null,null,null,null,null,null,null,null,null,null,null,null,null,null,null,null,null,null,null,null,null,null,null,null,null,null,null,null,null,null,null,null,null,null,null,null,null,null,null,null,null,null,null,null,null,null,null,"N/A","N/A","N/A","N/A","N/A","N/A","N/A","N/A","N/A","N/A",1,1,1,1,1,1,1,1,1,1]
[null,null,null,null,null,null,null,null,null,null,null,null,null,null,null,null,null,null,null,null,null,null,null,null,null,null,null,null,null,null,null,null,null,null,null,null,null,null,null,null,null,null,null,null,null,null,null,null,null,null,"N/A","N/A","N/A","N/A","N/A","N/A","N/A","N/A","N/A","N/A",1,1,1,1,1,1,1,1,1,1]
[null,null,null,null,null,null,null,null,null,null,null,null,null,null,null,null,null,null,null,null,null,null,null,null,null,null,null,null,null,null,null,null,null,null,null,null,null,null,null,null,null,null,null,null,null,null,null,null,null,null,"N/A","N/A","N/A","N/A","N/A","N/A","N/A","N/A","N/A","N/A",1,1,1,1,1,1,1,1,1,1]
[null,null,null,null,null,null,null,null,null,null,null,null,null,null,null,null,null,null,null,null,null,null,null,null,null,null,null,null,null,null,null,null,null,null,null,null,null,null,null,null,null,null,null,null,null,null,null,null,null,null,"N/A","N/A","N/A","N/A","N/A","N/A","N/A","N/A","N/A","N/A",1,1,1,1,1,1,1,1,1,1]
[null,null,null,null,null,null,null,null,null,null,null,null,null,null,null,null,null,null,null,null,null,null,null,null,null,null,null,null,null,null,null,null,null,null,null,null,null,null,null,null,null,null,null,null,null,null,null,null,null,null,"N/A","N/A","N/A","N/A","N/A","N/A","N/A","N/A","N/A","N/A",1,1,1,1,1,1,1,1,1,1]
[null,null,null,null,null,null,null,null,null,null,null,null,null,null,null,null,null,null,null,null,null,null,null,null,null,null,null,null,null,null,null,null,null,null,null,null,null,null,null,null,null,null,null,null,null,null,null,null,null,null,"N/A","N/A","N/A","N/A","N/A","N/A","N/A","N/A","N/A","N/A",1,1,1,1,1,1,1,1,1,1]
[null,null,null,null,null,null,null,null,null,null,null,null,null,null,null,null,null,null,null,null,null,null,null,null,null,null,null,null,null,null,null,null,null,null,null,null,null,null,null,null,null,null,null,null,null,null,null,null,null,null,"N/A","N/A","N/A","N/A","N/A","N/A","N/A","N/A","N/A","N/A",1,1,1,1,1,1,1,{"$f":"IF(BF1040=\"N/A\",1,\"\")","v":1},{"$f":"IF(BG1040=\"N/A\",1,\"\")","v":1},1]
[null,null,null,null,null,null,null,null,null,null,null,null,null,null,null,null,null,null,null,null,null,null,null,null,null,null,null,null,null,null,null,null,null,null,null,null,null,null,null,null,null,null,null,null,null,null,null,null,null,null,"N/A","N/A","N/A","N/A","N/A","N/A","N/A","N/A","N/A","N/A",1,1,1,1,1,1,1,1,1,1]
[null,null,null,null,null,null,null,null,null,null,null,null,null,null,null,null,null,null,null,null,null,null,null,null,null,null,null,null,null,null,null,null,null,null,null,null,null,null,null,null,null,null,null,null,null,null,null,null,null,null,"N/A","N/A","N/A","N/A","N/A","N/A","N/A","N/A","N/A","N/A",1,1,1,1,1,1,1,1,1,1]
[null,null,null,null,null,null,null,null,null,null,null,null,null,null,null,null,null,null,null,null,null,null,null,null,null,null,null,null,null,null,null,null,null,null,null,null,null,null,null,null,null,null,null,null,null,null,null,null,null,null,"N/A","N/A","N/A","N/A","N/A","N/A","N/A","N/A","N/A","N/A",1,1,1,1,1,1,1,1,1,1]
[null,null,null,null,null,null,null,null,null,null,null,null,null,null,null,null,null,null,null,null,null,null,null,null,null,null,null,null,null,null,null,null,null,null,null,null,null,null,null,null,null,null,null,null,null,null,null,null,null,null,"N/A","N/A","N/A","N/A","N/A","N/A","N/A","N/A","N/A","N/A",1,1,1,1,1,1,1,1,1,1]
[null,null,null,null,null,null,null,null,null,null,null,null,null,null,null,null,null,null,null,null,null,null,null,null,null,null,null,null,null,null,null,null,null,null,null,null,null,null,null,null,null,null,null,null,null,null,null,null,null,null,"N/A","N/A","N/A","N/A","N/A","N/A","N/A","N/A","N/A","N/A",1,1,1,1,1,1,1,1,1,1]
[null,null,null,null,null,null,null,null,null,null,null,null,null,null,null,null,null,null,null,null,null,null,null,null,null,null,null,null,null,null,null,null,null,null,null,null,null,null,null,null,null,null,null,null,null,null,null,null,null,null,"N/A","N/A","N/A","N/A","N/A","N/A","N/A","N/A","N/A","N/A",1,1,1,1,1,1,1,1,1,1]
[null,null,null,null,null,null,null,null,null,null,null,null,null,null,null,null,null,null,null,null,null,null,null,null,null,null,null,null,null,null,null,null,null,null,null,null,null,null,null,null,null,null,null,null,null,null,null,null,null,null,"N/A","N/A","N/A","N/A","N/A","N/A","N/A","N/A","N/A","N/A",1,1,1,1,1,1,1,1,1,1]
[null,null,null,null,null,null,null,null,null,null,null,null,null,null,null,null,null,null,null,null,null,null,null,null,null,null,null,null,null,null,null,null,null,null,null,null,null,null,null,null,null,null,null,null,null,null,null,null,null,null,"N/A","N/A","N/A","N/A","N/A","N/A","N/A","N/A","N/A","N/A",1,1,1,1,1,1,1,1,1,1]
[null,null,null,null,null,null,null,null,null,null,null,null,null,null,null,null,null,null,null,null,null,null,null,null,null,null,null,null,null,null,null,null,null,null,null,null,null,null,null,null,null,null,null,null,null,null,null,null,null,null,"N/A","N/A","N/A","N/A","N/A","N/A","N/A","N/A","N/A","N/A",1,1,1,1,1,1,1,1,1,1]
[null,null,null,null,null,null,null,null,null,null,null,null,null,null,null,null,null,null,null,null,null,null,null,null,null,null,null,null,null,null,null,null,null,null,null,null,null,null,null,null,null,null,null,null,null,null,null,null,null,null,"N/A","N/A","N/A","N/A","N/A","N/A","N/A","N/A","N/A","N/A",1,1,1,1,1,1,1,1,1,1]
[null,null,null,null,null,null,null,null,null,null,null,null,null,null,null,null,null,null,null,null,null,null,null,null,null,null,null,null,null,null,null,null,null,null,null,null,null,null,null,null,null,null,null,null,null,null,null,null,null,null,"N/A","N/A","N/A","N/A","N/A","N/A","N/A","N/A","N/A","N/A",1,1,1,1,1,1,1,1,1,1]
[null,null,null,null,null,null,null,null,null,null,null,null,null,null,null,null,null,null,null,null,null,null,null,null,null,null,null,null,null,null,null,null,null,null,null,null,null,null,null,null,null,null,null,null,null,null,null,null,null,null,"N/A","N/A","N/A","N/A","N/A","N/A","N/A","N/A","N/A","N/A",1,1,1,1,1,1,1,1,1,1]
[null,null,null,null,null,null,null,null,null,null,null,null,null,null,null,null,null,null,null,null,null,null,null,null,null,null,null,null,null,null,null,null,null,null,null,null,null,null,null,null,null,null,null,null,null,null,null,null,null,null,"N/A","N/A","N/A","N/A","N/A","N/A","N/A","N/A","N/A","N/A",1,1,1,1,1,1,1,1,1,1]
[null,null,null,null,null,null,null,null,null,null,null,null,null,null,null,null,null,null,null,null,null,null,null,null,null,null,null,null,null,null,null,null,null,null,null,null,null,null,null,null,null,null,null,null,null,null,null,null,null,null,"N/A","N/A","N/A","N/A","N/A","N/A","N/A","N/A","N/A","N/A",1,1,1,1,1,1,1,1,1,1]
[null,null,null,null,null,null,null,null,null,null,null,null,null,null,null,null,null,null,null,null,null,null,null,null,null,null,null,null,null,null,null,null,null,null,null,null,null,null,null,null,null,null,null,null,null,null,null,null,null,null,"N/A","N/A","N/A","N/A","N/A","N/A","N/A","N/A","N/A","N/A",1,1,1,1,1,1,1,1,1,1]
[null,null,null,null,null,null,null,null,null,null,null,null,null,null,null,null,null,null,null,null,null,null,null,null,null,null,null,null,null,null,null,null,null,null,null,null,null,null,null,null,null,null,null,null,null,null,null,null,null,null,"N/A","N/A","N/A","N/A","N/A","N/A","N/A","N/A","N/A","N/A",1,1,1,1,1,1,1,1,1,1]
[null,null,null,null,null,null,null,null,null,null,null,null,null,null,null,null,null,null,null,null,null,null,null,null,null,null,null,null,null,null,null,null,null,null,null,null,null,null,null,null,null,null,null,null,null,null,null,null,null,null,"N/A","N/A","N/A","N/A","N/A","N/A","N/A","N/A","N/A","N/A",1,1,1,1,1,1,1,1,1,1]
[null,null,null,null,null,null,null,null,null,null,null,null,null,null,null,null,null,null,null,null,null,null,null,null,null,null,null,null,null,null,null,null,null,null,null,null,null,null,null,null,null,null,null,null,null,null,null,null,null,null,"N/A","N/A","N/A","N/A","N/A","N/A","N/A","N/A","N/A","N/A",1,1,1,1,1,1,1,1,1,1]
[null,null,null,null,null,null,null,null,null,null,null,null,null,null,null,null,null,null,null,null,null,null,null,null,null,null,null,null,null,null,null,null,null,null,null,null,null,null,null,null,null,null,null,null,null,null,null,null,null,null,"N/A","N/A","N/A","N/A","N/A","N/A","N/A","N/A","N/A","N/A",1,1,1,1,1,1,1,1,1,1]
[null,null,null,null,null,null,null,null,null,null,null,null,null,null,null,null,null,null,null,null,null,null,null,null,null,null,null,null,null,null,null,null,null,null,null,null,null,null,null,null,null,null,null,null,null,null,null,null,null,null,"N/A","N/A","N/A","N/A","N/A","N/A","N/A","N/A","N/A","N/A",1,1,1,1,1,1,1,1,1,1]
[null,null,null,null,null,null,null,null,null,null,null,null,null,null,null,null,null,null,null,null,null,null,null,null,null,null,null,null,null,null,null,null,null,null,null,null,null,null,null,null,null,null,null,null,null,null,null,null,null,null,"N/A","N/A","N/A","N/A","N/A","N/A","N/A","N/A","N/A","N/A",1,1,1,1,1,1,1,1,1,1]
[null,null,null,null,null,null,null,null,null,null,null,null,null,null,null,null,null,null,null,null,null,null,null,null,null,null,null,null,null,null,null,null,null,null,null,null,null,null,null,null,null,null,null,null,null,null,null,null,null,null,"N/A","N/A","N/A","N/A","N/A","N/A","N/A","N/A","N/A","N/A",1,1,1,1,1,1,1,1,1,1]
[null,null,null,null,null,null,null,null,null,null,null,null,null,null,null,null,null,null,null,null,null,null,null,null,null,null,null,null,null,null,null,null,null,null,null,null,null,null,null,null,null,null,null,null,null,null,null,null,null,null,"N/A","N/A","N/A","N/A","N/A","N/A","N/A","N/A","N/A","N/A",1,1,1,1,1,1,1,1,1,1]
[null,null,null,null,null,null,null,null,null,null,null,null,null,null,null,null,null,null,null,null,null,null,null,null,null,null,null,null,null,null,null,null,null,null,null,null,null,null,null,null,null,null,null,null,null,null,null,null,null,null,"N/A","N/A","N/A","N/A","N/A","N/A","N/A","N/A","N/A","N/A",1,1,1,1,1,1,1,1,1,1]
[null,null,null,null,null,null,null,null,null,null,null,null,null,null,null,null,null,null,null,null,null,null,null,null,null,null,null,null,null,null,null,null,null,null,null,null,null,null,null,null,null,null,null,null,null,null,null,null,null,null,"N/A","N/A","N/A","N/A","N/A","N/A","N/A","N/A","N/A","N/A",1,1,1,1,1,1,1,1,1,1]
[null,null,null,null,null,null,null,null,null,null,null,null,null,null,null,null,null,null,null,null,null,null,null,null,null,null,null,null,null,null,null,null,null,null,null,null,null,null,null,null,null,null,null,null,null,null,null,null,null,null,"N/A","N/A","N/A","N/A","N/A","N/A","N/A","N/A","N/A","N/A",1,1,1,1,1,1,1,1,1,1]
[null,null,null,null,null,null,null,null,null,null,null,null,null,null,null,null,null,null,null,null,null,null,null,null,null,null,null,null,null,null,null,null,null,null,null,null,null,null,null,null,null,null,null,null,null,null,null,null,null,null,"N/A","N/A","N/A","N/A","N/A","N/A","N/A","N/A","N/A","N/A",1,1,1,1,1,1,1,1,1,1]
[null,null,null,null,null,null,null,null,null,null,null,null,null,null,null,null,null,null,null,null,null,null,null,null,null,null,null,null,null,null,null,null,null,null,null,null,null,null,null,null,null,null,null,null,null,null,null,null,null,null,"N/A","N/A","N/A","N/A","N/A","N/A","N/A","N/A","N/A","N/A",1,1,1,1,1,1,1,1,1,1]
[null,null,null,null,null,null,null,null,null,null,null,null,null,null,null,null,null,null,null,null,null,null,null,null,null,null,null,null,null,null,null,null,null,null,null,null,null,null,null,null,null,null,null,null,null,null,null,null,null,null,"N/A","N/A","N/A","N/A","N/A","N/A","N/A","N/A","N/A","N/A",1,1,1,1,1,1,1,1,1,1]
[null,null,null,null,null,null,null,null,null,null,null,null,null,null,null,null,null,null,null,null,null,null,null,null,null,null,null,null,null,null,null,null,null,null,null,null,null,null,null,null,null,null,null,null,null,null,null,null,null,null,{"$f":"IF(COUNTA(E1070:J1070)>0,(COUNTIF(E1070:J1070,\"=0\")*0+COUNTIF(E1070:J1070,\"=1\")*100+COUNTIF(E1070:J1070,\"=2\")*80+COUNTIF(E1070:J1070,\"=3\")*50+COUNTIF(E1070:J1070,\"=8\")*20+COUNTIF(E1070:J1070,\"=9\")*0)/COUNTA(E1070:J1070)/100,\"N/A\")","v":"N/A"},"N/A",{"$f":"IF(COUNTA(P1070:U1070)>0,(COUNTIF(P1070:U1070,\"=0\")*0+COUNTIF(P1070:U1070,\"=1\")*100+COUNTIF(P1070:U1070,\"=2\")*80+COUNTIF(P1070:U1070,\"=3\")*50+COUNTIF(P1070:U1070,\"=8\")*20+COUNTIF(P1070:U1070,\"=9\")*0)/COUNTA(P1070:U1070)/100,\"N/A\")","v":"N/A"},{"$f":"IF(COUNTA(V1070)<>0,(COUNTIF(V1070,\"=0\")*0+COUNTIF(V1070,\"=1\")*100+COUNTIF(V1070,\"=2\")*80+COUNTIF(V1070,\"=3\")*50+COUNTIF(V1070,\"=8\")*20+COUNTIF(V1070,\"=9\")*0)/COUNTA(V1070)/100,\"N/A\")","v":"N/A"},{"$f":"IF(COUNTA(W1070:X1070)>0,(COUNTIF(W1070:X1070,\"=0\")*0+COUNTIF(W1070:X1070,\"=1\")*100+COUNTIF(W1070:X1070,\"=2\")*80+COUNTIF(W1070:X1070,\"=3\")*50+COUNTIF(W1070:X1070,\"=8\")*20+COUNTIF(W1070:X1070,\"=9\")*0)/COUNTA(W1070:X1070)/100,\"N/A\")","v":"N/A"},{"$f":"IF(COUNTA(Y1070:AJ1070)>0,(COUNTIF(Y1070:AJ1070,\"=0\")*0+COUNTIF(Y1070:AJ1070,\"=1\")*100+COUNTIF(Y1070:AJ1070,\"=2\")*80+COUNTIF(Y1070:AJ1070,\"=3\")*50+COUNTIF(Y1070:AJ1070,\"=8\")*20+COUNTIF(Y1070:AJ1070,\"=9\")*0)/COUNTA(Y1070:AJ1070)/100,\"N/A\")","v":"N/A"},{"$f":"IF(COUNTA(AK1070:AP1070)>0,(COUNTIF(AK1070:AP1070,\"=0\")*0+COUNTIF(AK1070:AP1070,\"=1\")*100+COUNTIF(AK1070:AP1070,\"=2\")*80+COUNTIF(AK1070:AP1070,\"=3\")*50+COUNTIF(AK1070:AP1070,\"=8\")*20+COUNTIF(AK1070:AP1070,\"=9\")*0)/COUNTA(AK1070:AP1070)/100,\"N/A\")","v":"N/A"},{"$f":"IF(COUNTA(AQ1070:AU1070)>0,(COUNTIF(AQ1070:AU1070,\"=0\")*0+COUNTIF(AQ1070:AU1070,\"=1\")*100+COUNTIF(AQ1070:AU1070,\"=2\")*80+COUNTIF(AQ1070:AU1070,\"=3\")*50+COUNTIF(AQ1070:AU1070,\"=8\")*20+COUNTIF(AQ1070:AU1070,\"=9\")*0)/COUNTA(AQ1070:AU1070)/100,\"N/A\")","v":"N/A"},{"$f":"IF(COUNTA(AV1070:AX1070)>0,(COUNTIF(AV1070:AX1070,\"=0\")*0+COUNTIF(AV1070:AX1070,\"=1\")*100+COUNTIF(AV1070:AX1070,\"=2\")*80+COUNTIF(AV1070:AX1070,\"=3\")*50+COUNTIF(AV1070:AX1070,\"=8\")*20+COUNTIF(AV1070:AX1070,\"=9\")*0)/COUNTA(AV1070:AX1070)/100,\"N/A\")","v":"N/A"},{"$f":"IF(AND(COUNTA(E1070:AX1070)<>0,B1070<>\"\"),AVERAGE(BA1070:BG1070),\"N/A\")","v":"N/A"},1,1,1,1,1,1,1,1,1,1]
[null,null,null,null,null,null,null,null,null,null,null,null,null,null,null,null,null,null,null,null,null,null,null,null,null,null,null,null,null,null,null,null,null,null,null,null,null,null,null,null,null,null,null,null,null,null,null,null,null,null,"N/A","N/A","N/A","N/A","N/A","N/A","N/A","N/A","N/A","N/A",1,1,1,1,1,1,1,1,1,1]
[null,null,null,null,null,null,null,null,null,null,null,null,null,null,null,null,null,null,null,null,null,null,null,null,null,null,null,null,null,null,null,null,null,null,null,null,null,null,null,null,null,null,null,null,null,null,null,null,null,null,"N/A","N/A","N/A","N/A","N/A","N/A","N/A","N/A","N/A","N/A",1,1,1,1,1,1,1,1,1,1]
[null,null,null,null,null,null,null,null,null,null,null,null,null,null,null,null,null,null,null,null,null,null,null,null,null,null,null,null,null,null,null,null,null,null,null,null,null,null,null,null,null,null,null,null,null,null,null,null,null,null,"N/A","N/A","N/A","N/A","N/A","N/A","N/A","N/A","N/A","N/A",1,1,1,1,1,1,1,1,1,1]
[null,null,null,null,null,null,null,null,null,null,null,null,null,null,null,null,null,null,null,null,null,null,null,null,null,null,null,null,null,null,null,null,null,null,null,null,null,null,null,null,null,null,null,null,null,null,null,null,null,null,"N/A",{"$f":"IF(COUNTA(K1074:O1074)>0,(COUNTIF(K1074:O1074,\"=0\")*0+COUNTIF(K1074:O1074,\"=1\")*100+COUNTIF(K1074:O1074,\"=2\")*80+COUNTIF(K1074:O1074,\"=3\")*50+COUNTIF(K1074:O1074,\"=8\")*20+COUNTIF(K1074:O1074,\"=9\")*0)/COUNTA(K1074:O1074)/100,\"N/A\")","v":"N/A"},"N/A","N/A","N/A","N/A","N/A","N/A","N/A","N/A",1,1,1,1,1,1,1,1,1,1]
[null,null,null,null,null,null,null,null,null,null,null,null,null,null,null,null,null,null,null,null,null,null,null,null,null,null,null,null,null,null,null,null,null,null,null,null,null,null,null,null,null,null,null,null,null,null,null,null,null,null,"N/A","N/A","N/A","N/A","N/A","N/A","N/A","N/A","N/A","N/A",1,1,1,1,1,1,1,1,1,1]
[null,null,null,null,null,null,null,null,null,null,null,null,null,null,null,null,null,null,null,null,null,null,null,null,null,null,null,null,null,null,null,null,null,null,null,null,null,null,null,null,null,null,null,null,null,null,null,null,null,null,"N/A","N/A","N/A","N/A","N/A","N/A","N/A","N/A","N/A","N/A",1,1,1,1,1,1,1,1,1,1]
[null,null,null,null,null,null,null,null,null,null,null,null,null,null,null,null,null,null,null,null,null,null,null,null,null,null,null,null,null,null,null,null,null,null,null,null,null,null,null,null,null,null,null,null,null,null,null,null,null,null,"N/A","N/A","N/A","N/A","N/A","N/A","N/A","N/A","N/A","N/A",1,1,1,1,1,1,1,1,1,1]
[null,null,null,null,null,null,null,null,null,null,null,null,null,null,null,null,null,null,null,null,null,null,null,null,null,null,null,null,null,null,null,null,null,null,null,null,null,null,null,null,null,null,null,null,null,null,null,null,null,null,"N/A","N/A","N/A","N/A","N/A","N/A","N/A","N/A","N/A","N/A",1,1,1,1,1,1,1,1,1,1]
[null,null,null,null,null,null,null,null,null,null,null,null,null,null,null,null,null,null,null,null,null,null,null,null,null,null,null,null,null,null,null,null,null,null,null,null,null,null,null,null,null,null,null,null,null,null,null,null,null,null,"N/A","N/A","N/A","N/A","N/A","N/A","N/A","N/A","N/A","N/A",1,1,1,1,1,1,1,1,1,1]
[null,null,null,null,null,null,null,null,null,null,null,null,null,null,null,null,null,null,null,null,null,null,null,null,null,null,null,null,null,null,null,null,null,null,null,null,null,null,null,null,null,null,null,null,null,null,null,null,null,null,"N/A","N/A","N/A","N/A","N/A","N/A","N/A","N/A","N/A","N/A",1,1,1,1,1,1,1,1,1,1]
[null,null,null,null,null,null,null,null,null,null,null,null,null,null,null,null,null,null,null,null,null,null,null,null,null,null,null,null,null,null,null,null,null,null,null,null,null,null,null,null,null,null,null,null,null,null,null,null,null,null,"N/A","N/A","N/A","N/A","N/A","N/A","N/A","N/A","N/A","N/A",1,1,1,1,1,1,1,1,1,{"$f":"IF(BH1081=\"N/A\",1,\"\")","v":1}]
[null,null,null,null,null,null,null,null,null,null,null,null,null,null,null,null,null,null,null,null,null,null,null,null,null,null,null,null,null,null,null,null,null,null,null,null,null,null,null,null,null,null,null,null,null,null,null,null,null,null,"N/A","N/A","N/A","N/A","N/A","N/A","N/A","N/A","N/A","N/A",{"$f":"IF(AY1082=\"N/A\",1,\"\")","v":1},{"$f":"IF(AZ1082=\"N/A\",1,\"\")","v":1},{"$f":"IF(BA1082=\"N/A\",1,\"\")","v":1},{"$f":"IF(BB1082=\"N/A\",1,\"\")","v":1},{"$f":"IF(BC1082=\"N/A\",1,\"\")","v":1},{"$f":"IF(BD1082=\"N/A\",1,\"\")","v":1},{"$f":"IF(BE1082=\"N/A\",1,\"\")","v":1},1,1,1]
[null,null,null,null,null,null,null,null,null,null,null,null,null,null,null,null,null,null,null,null,null,null,null,null,null,null,null,null,null,null,null,null,null,null,null,null,null,null,null,null,null,null,null,null,null,null,null,null,null,null,"N/A","N/A","N/A","N/A","N/A","N/A","N/A","N/A","N/A","N/A",1,1,1,1,1,1,1,1,1,1]
[null,null,null,null,null,null,null,null,null,null,null,null,null,null,null,null,null,null,null,null,null,null,null,null,null,null,null,null,null,null,null,null,null,null,null,null,null,null,null,null,null,null,null,null,null,null,null,null,null,null,"N/A","N/A","N/A","N/A","N/A","N/A","N/A","N/A","N/A","N/A",1,1,1,1,1,1,1,1,1,1]
[null,null,null,null,null,null,null,null,null,null,null,null,null,null,null,null,null,null,null,null,null,null,null,null,null,null,null,null,null,null,null,null,null,null,null,null,null,null,null,null,null,null,null,null,null,null,null,null,null,null,"N/A","N/A","N/A","N/A","N/A","N/A","N/A","N/A","N/A","N/A",1,1,1,1,1,1,1,1,1,1]
[null,null,null,null,null,null,null,null,null,null,null,null,null,null,null,null,null,null,null,null,null,null,null,null,null,null,null,null,null,null,null,null,null,null,null,null,null,null,null,null,null,null,null,null,null,null,null,null,null,null,"N/A","N/A","N/A","N/A","N/A","N/A","N/A","N/A","N/A","N/A",1,1,1,1,1,1,1,1,1,1]
[null,null,null,null,null,null,null,null,null,null,null,null,null,null,null,null,null,null,null,null,null,null,null,null,null,null,null,null,null,null,null,null,null,null,null,null,null,null,null,null,null,null,null,null,null,null,null,null,null,null,"N/A","N/A","N/A","N/A","N/A","N/A","N/A","N/A","N/A","N/A",1,1,1,1,1,1,1,1,1,1]
[null,null,null,null,null,null,null,null,null,null,null,null,null,null,null,null,null,null,null,null,null,null,null,null,null,null,null,null,null,null,null,null,null,null,null,null,null,null,null,null,null,null,null,null,null,null,null,null,null,null,"N/A","N/A","N/A","N/A","N/A","N/A","N/A","N/A","N/A","N/A",1,1,1,1,1,1,1,1,1,1]
[null,null,null,null,null,null,null,null,null,null,null,null,null,null,null,null,null,null,null,null,null,null,null,null,null,null,null,null,null,null,null,null,null,null,null,null,null,null,null,null,null,null,null,null,null,null,null,null,null,null,"N/A","N/A","N/A","N/A","N/A","N/A","N/A","N/A","N/A","N/A",1,1,1,1,1,1,1,1,1,1]
[null,null,null,null,null,null,null,null,null,null,null,null,null,null,null,null,null,null,null,null,null,null,null,null,null,null,null,null,null,null,null,null,null,null,null,null,null,null,null,null,null,null,null,null,null,null,null,null,null,null,"N/A","N/A","N/A","N/A","N/A","N/A","N/A","N/A","N/A","N/A",1,1,1,1,1,1,1,1,1,1]
[null,null,null,null,null,null,null,null,null,null,null,null,null,null,null,null,null,null,null,null,null,null,null,null,null,null,null,null,null,null,null,null,null,null,null,null,null,null,null,null,null,null,null,null,null,null,null,null,null,null,"N/A","N/A","N/A","N/A","N/A","N/A","N/A","N/A","N/A","N/A",1,1,1,1,1,1,1,1,1,1]
[null,null,null,null,null,null,null,null,null,null,null,null,null,null,null,null,null,null,null,null,null,null,null,null,null,null,null,null,null,null,null,null,null,null,null,null,null,null,null,null,null,null,null,null,null,null,null,null,null,null,"N/A","N/A","N/A","N/A","N/A","N/A","N/A","N/A","N/A","N/A",1,1,1,1,1,1,1,1,1,1]
[null,null,null,null,null,null,null,null,null,null,null,null,null,null,null,null,null,null,null,null,null,null,null,null,null,null,null,null,null,null,null,null,null,null,null,null,null,null,null,null,null,null,null,null,null,null,null,null,null,null,"N/A","N/A","N/A","N/A","N/A","N/A","N/A","N/A","N/A","N/A",1,1,1,1,1,1,1,1,1,1]
[null,null,null,null,null,null,null,null,null,null,null,null,null,null,null,null,null,null,null,null,null,null,null,null,null,null,null,null,null,null,null,null,null,null,null,null,null,null,null,null,null,null,null,null,null,null,null,null,null,null,"N/A","N/A","N/A","N/A","N/A","N/A","N/A","N/A","N/A","N/A",1,1,1,1,1,1,1,1,1,1]
[null,null,null,null,null,null,null,null,null,null,null,null,null,null,null,null,null,null,null,null,null,null,null,null,null,null,null,null,null,null,null,null,null,null,null,null,null,null,null,null,null,null,null,null,null,null,null,null,null,null,"N/A","N/A","N/A","N/A","N/A","N/A","N/A","N/A","N/A","N/A",1,1,1,1,1,1,1,1,1,1]
[null,null,null,null,null,null,null,null,null,null,null,null,null,null,null,null,null,null,null,null,null,null,null,null,null,null,null,null,null,null,null,null,null,null,null,null,null,null,null,null,null,null,null,null,null,null,null,null,null,null,"N/A","N/A","N/A","N/A","N/A","N/A","N/A","N/A","N/A","N/A",1,1,1,1,1,1,1,1,1,1]
[null,null,null,null,null,null,null,null,null,null,null,null,null,null,null,null,null,null,null,null,null,null,null,null,null,null,null,null,null,null,null,null,null,null,null,null,null,null,null,null,null,null,null,null,null,null,null,null,null,null,"N/A","N/A","N/A","N/A","N/A","N/A","N/A","N/A","N/A","N/A",1,1,1,1,1,1,1,1,1,1]
[null,null,null,null,null,null,null,null,null,null,null,null,null,null,null,null,null,null,null,null,null,null,null,null,null,null,null,null,null,null,null,null,null,null,null,null,null,null,null,null,null,null,null,null,null,null,null,null,null,null,"N/A","N/A","N/A","N/A","N/A","N/A","N/A","N/A","N/A","N/A",1,1,1,1,1,1,1,1,1,1]
[null,null,null,null,null,null,null,null,null,null,null,null,null,null,null,null,null,null,null,null,null,null,null,null,null,null,null,null,null,null,null,null,null,null,null,null,null,null,null,null,null,null,null,null,null,null,null,null,null,null,"N/A","N/A","N/A","N/A","N/A","N/A","N/A","N/A","N/A","N/A",1,1,1,1,1,1,1,1,1,1]
[null,null,null,null,null,null,null,null,null,null,null,null,null,null,null,null,null,null,null,null,null,null,null,null,null,null,null,null,null,null,null,null,null,null,null,null,null,null,null,null,null,null,null,null,null,null,null,null,null,null,"N/A","N/A","N/A","N/A","N/A","N/A","N/A","N/A","N/A","N/A",1,1,1,1,1,1,1,1,1,1]
[null,null,null,null,null,null,null,null,null,null,null,null,null,null,null,null,null,null,null,null,null,null,null,null,null,null,null,null,null,null,null,null,null,null,null,null,null,null,null,null,null,null,null,null,null,null,null,null,null,null,"N/A","N/A","N/A","N/A","N/A","N/A","N/A","N/A","N/A","N/A",1,1,1,1,1,1,1,1,1,1]
[null,null,null,null,null,null,null,null,null,null,null,null,null,null,null,null,null,null,null,null,null,null,null,null,null,null,null,null,null,null,null,null,null,null,null,null,null,null,null,null,null,null,null,null,null,null,null,null,null,null,"N/A","N/A","N/A","N/A","N/A","N/A","N/A","N/A","N/A","N/A",1,1,1,1,1,1,1,1,1,1]
[null,null,null,null,null,null,null,null,null,null,null,null,null,null,null,null,null,null,null,null,null,null,null,null,null,null,null,null,null,null,null,null,null,null,null,null,null,null,null,null,null,null,null,null,null,null,null,null,null,null,"N/A","N/A","N/A","N/A","N/A","N/A","N/A","N/A","N/A","N/A",1,1,1,1,1,1,1,1,1,1]
[null,null,null,null,null,null,null,null,null,null,null,null,null,null,null,null,null,null,null,null,null,null,null,null,null,null,null,null,null,null,null,null,null,null,null,null,null,null,null,null,null,null,null,null,null,null,null,null,null,null,"N/A","N/A","N/A","N/A","N/A","N/A","N/A","N/A","N/A","N/A",1,1,1,1,1,1,1,{"$f":"IF(BF1104=\"N/A\",1,\"\")","v":1},{"$f":"IF(BG1104=\"N/A\",1,\"\")","v":1},1]
[null,null,null,null,null,null,null,null,null,null,null,null,null,null,null,null,null,null,null,null,null,null,null,null,null,null,null,null,null,null,null,null,null,null,null,null,null,null,null,null,null,null,null,null,null,null,null,null,null,null,"N/A","N/A","N/A","N/A","N/A","N/A","N/A","N/A","N/A","N/A",1,1,1,1,1,1,1,1,1,1]
[null,null,null,null,null,null,null,null,null,null,null,null,null,null,null,null,null,null,null,null,null,null,null,null,null,null,null,null,null,null,null,null,null,null,null,null,null,null,null,null,null,null,null,null,null,null,null,null,null,null,"N/A","N/A","N/A","N/A","N/A","N/A","N/A","N/A","N/A","N/A",1,1,1,1,1,1,1,1,1,1]
[null,null,null,null,null,null,null,null,null,null,null,null,null,null,null,null,null,null,null,null,null,null,null,null,null,null,null,null,null,null,null,null,null,null,null,null,null,null,null,null,null,null,null,null,null,null,null,null,null,null,"N/A","N/A","N/A","N/A","N/A","N/A","N/A","N/A","N/A","N/A",1,1,1,1,1,1,1,1,1,1]
[null,null,null,null,null,null,null,null,null,null,null,null,null,null,null,null,null,null,null,null,null,null,null,null,null,null,null,null,null,null,null,null,null,null,null,null,null,null,null,null,null,null,null,null,null,null,null,null,null,null,"N/A","N/A","N/A","N/A","N/A","N/A","N/A","N/A","N/A","N/A",1,1,1,1,1,1,1,1,1,1]
[null,null,null,null,null,null,null,null,null,null,null,null,null,null,null,null,null,null,null,null,null,null,null,null,null,null,null,null,null,null,null,null,null,null,null,null,null,null,null,null,null,null,null,null,null,null,null,null,null,null,"N/A","N/A","N/A","N/A","N/A","N/A","N/A","N/A","N/A","N/A",1,1,1,1,1,1,1,1,1,1]
[null,null,null,null,null,null,null,null,null,null,null,null,null,null,null,null,null,null,null,null,null,null,null,null,null,null,null,null,null,null,null,null,null,null,null,null,null,null,null,null,null,null,null,null,null,null,null,null,null,null,"N/A","N/A","N/A","N/A","N/A","N/A","N/A","N/A","N/A","N/A",1,1,1,1,1,1,1,1,1,1]
[null,null,null,null,null,null,null,null,null,null,null,null,null,null,null,null,null,null,null,null,null,null,null,null,null,null,null,null,null,null,null,null,null,null,null,null,null,null,null,null,null,null,null,null,null,null,null,null,null,null,"N/A","N/A","N/A","N/A","N/A","N/A","N/A","N/A","N/A","N/A",1,1,1,1,1,1,1,1,1,1]
[null,null,null,null,null,null,null,null,null,null,null,null,null,null,null,null,null,null,null,null,null,null,null,null,null,null,null,null,null,null,null,null,null,null,null,null,null,null,null,null,null,null,null,null,null,null,null,null,null,null,"N/A","N/A","N/A","N/A","N/A","N/A","N/A","N/A","N/A","N/A",1,1,1,1,1,1,1,1,1,1]
[null,null,null,null,null,null,null,null,null,null,null,null,null,null,null,null,null,null,null,null,null,null,null,null,null,null,null,null,null,null,null,null,null,null,null,null,null,null,null,null,null,null,null,null,null,null,null,null,null,null,"N/A","N/A","N/A","N/A","N/A","N/A","N/A","N/A","N/A","N/A",1,1,1,1,1,1,1,1,1,1]
[null,null,null,null,null,null,null,null,null,null,null,null,null,null,null,null,null,null,null,null,null,null,null,null,null,null,null,null,null,null,null,null,null,null,null,null,null,null,null,null,null,null,null,null,null,null,null,null,null,null,"N/A","N/A","N/A","N/A","N/A","N/A","N/A","N/A","N/A","N/A",1,1,1,1,1,1,1,1,1,1]
[null,null,null,null,null,null,null,null,null,null,null,null,null,null,null,null,null,null,null,null,null,null,null,null,null,null,null,null,null,null,null,null,null,null,null,null,null,null,null,null,null,null,null,null,null,null,null,null,null,null,"N/A","N/A","N/A","N/A","N/A","N/A","N/A","N/A","N/A","N/A",1,1,1,1,1,1,1,1,1,1]
[null,null,null,null,null,null,null,null,null,null,null,null,null,null,null,null,null,null,null,null,null,null,null,null,null,null,null,null,null,null,null,null,null,null,null,null,null,null,null,null,null,null,null,null,null,null,null,null,null,null,"N/A","N/A","N/A","N/A","N/A","N/A","N/A","N/A","N/A","N/A",1,1,1,1,1,1,1,1,1,1]
[null,null,null,null,null,null,null,null,null,null,null,null,null,null,null,null,null,null,null,null,null,null,null,null,null,null,null,null,null,null,null,null,null,null,null,null,null,null,null,null,null,null,null,null,null,null,null,null,null,null,"N/A","N/A","N/A","N/A","N/A","N/A","N/A","N/A","N/A","N/A",1,1,1,1,1,1,1,1,1,1]
[null,null,null,null,null,null,null,null,null,null,null,null,null,null,null,null,null,null,null,null,null,null,null,null,null,null,null,null,null,null,null,null,null,null,null,null,null,null,null,null,null,null,null,null,null,null,null,null,null,null,"N/A","N/A","N/A","N/A","N/A","N/A","N/A","N/A","N/A","N/A",1,1,1,1,1,1,1,1,1,1]
[null,null,null,null,null,null,null,null,null,null,null,null,null,null,null,null,null,null,null,null,null,null,null,null,null,null,null,null,null,null,null,null,null,null,null,null,null,null,null,null,null,null,null,null,null,null,null,null,null,null,"N/A","N/A","N/A","N/A","N/A","N/A","N/A","N/A","N/A","N/A",1,1,1,1,1,1,1,1,1,1]
[null,null,null,null,null,null,null,null,null,null,null,null,null,null,null,null,null,null,null,null,null,null,null,null,null,null,null,null,null,null,null,null,null,null,null,null,null,null,null,null,null,null,null,null,null,null,null,null,null,null,"N/A","N/A","N/A","N/A","N/A","N/A","N/A","N/A","N/A","N/A",1,1,1,1,1,1,1,1,1,1]
[null,null,null,null,null,null,null,null,null,null,null,null,null,null,null,null,null,null,null,null,null,null,null,null,null,null,null,null,null,null,null,null,null,null,null,null,null,null,null,null,null,null,null,null,null,null,null,null,null,null,"N/A","N/A","N/A","N/A","N/A","N/A","N/A","N/A","N/A","N/A",1,1,1,1,1,1,1,1,1,1]
[null,null,null,null,null,null,null,null,null,null,null,null,null,null,null,null,null,null,null,null,null,null,null,null,null,null,null,null,null,null,null,null,null,null,null,null,null,null,null,null,null,null,null,null,null,null,null,null,null,null,"N/A","N/A","N/A","N/A","N/A","N/A","N/A","N/A","N/A","N/A",1,1,1,1,1,1,1,1,1,1]
[null,null,null,null,null,null,null,null,null,null,null,null,null,null,null,null,null,null,null,null,null,null,null,null,null,null,null,null,null,null,null,null,null,null,null,null,null,null,null,null,null,null,null,null,null,null,null,null,null,null,"N/A","N/A","N/A","N/A","N/A","N/A","N/A","N/A","N/A","N/A",1,1,1,1,1,1,1,1,1,1]
[null,null,null,null,null,null,null,null,null,null,null,null,null,null,null,null,null,null,null,null,null,null,null,null,null,null,null,null,null,null,null,null,null,null,null,null,null,null,null,null,null,null,null,null,null,null,null,null,null,null,"N/A","N/A","N/A","N/A","N/A","N/A","N/A","N/A","N/A","N/A",1,1,1,1,1,1,1,1,1,1]
[null,null,null,null,null,null,null,null,null,null,null,null,null,null,null,null,null,null,null,null,null,null,null,null,null,null,null,null,null,null,null,null,null,null,null,null,null,null,null,null,null,null,null,null,null,null,null,null,null,null,"N/A","N/A","N/A","N/A","N/A","N/A","N/A","N/A","N/A","N/A",1,1,1,1,1,1,1,1,1,1]
[null,null,null,null,null,null,null,null,null,null,null,null,null,null,null,null,null,null,null,null,null,null,null,null,null,null,null,null,null,null,null,null,null,null,null,null,null,null,null,null,null,null,null,null,null,null,null,null,null,null,"N/A","N/A","N/A","N/A","N/A","N/A","N/A","N/A","N/A","N/A",1,1,1,1,1,1,1,1,1,1]
[null,null,null,null,null,null,null,null,null,null,null,null,null,null,null,null,null,null,null,null,null,null,null,null,null,null,null,null,null,null,null,null,null,null,null,null,null,null,null,null,null,null,null,null,null,null,null,null,null,null,"N/A","N/A","N/A","N/A","N/A","N/A","N/A","N/A","N/A","N/A",1,1,1,1,1,1,1,1,1,1]
[null,null,null,null,null,null,null,null,null,null,null,null,null,null,null,null,null,null,null,null,null,null,null,null,null,null,null,null,null,null,null,null,null,null,null,null,null,null,null,null,null,null,null,null,null,null,null,null,null,null,"N/A","N/A","N/A","N/A","N/A","N/A","N/A","N/A","N/A","N/A",1,1,1,1,1,1,1,1,1,1]
[null,null,null,null,null,null,null,null,null,null,null,null,null,null,null,null,null,null,null,null,null,null,null,null,null,null,null,null,null,null,null,null,null,null,null,null,null,null,null,null,null,null,null,null,null,null,null,null,null,null,"N/A","N/A","N/A","N/A","N/A","N/A","N/A","N/A","N/A","N/A",1,1,1,1,1,1,1,1,1,1]
[null,null,null,null,null,null,null,null,null,null,null,null,null,null,null,null,null,null,null,null,null,null,null,null,null,null,null,null,null,null,null,null,null,null,null,null,null,null,null,null,null,null,null,null,null,null,null,null,null,null,"N/A","N/A","N/A","N/A","N/A","N/A","N/A","N/A","N/A","N/A",1,1,1,1,1,1,1,1,1,1]
[null,null,null,null,null,null,null,null,null,null,null,null,null,null,null,null,null,null,null,null,null,null,null,null,null,null,null,null,null,null,null,null,null,null,null,null,null,null,null,null,null,null,null,null,null,null,null,null,null,null,"N/A","N/A","N/A","N/A","N/A","N/A","N/A","N/A","N/A","N/A",1,1,1,1,1,1,1,1,1,1]
[null,null,null,null,null,null,null,null,null,null,null,null,null,null,null,null,null,null,null,null,null,null,null,null,null,null,null,null,null,null,null,null,null,null,null,null,null,null,null,null,null,null,null,null,null,null,null,null,null,null,"N/A","N/A","N/A","N/A","N/A","N/A","N/A","N/A","N/A","N/A",1,1,1,1,1,1,1,1,1,1]
[null,null,null,null,null,null,null,null,null,null,null,null,null,null,null,null,null,null,null,null,null,null,null,null,null,null,null,null,null,null,null,null,null,null,null,null,null,null,null,null,null,null,null,null,null,null,null,null,null,null,"N/A","N/A","N/A","N/A","N/A","N/A","N/A","N/A","N/A","N/A",1,1,1,1,1,1,1,1,1,1]
[null,null,null,null,null,null,null,null,null,null,null,null,null,null,null,null,null,null,null,null,null,null,null,null,null,null,null,null,null,null,null,null,null,null,null,null,null,null,null,null,null,null,null,null,null,null,null,null,null,null,{"$f":"IF(COUNTA(E1134:J1134)>0,(COUNTIF(E1134:J1134,\"=0\")*0+COUNTIF(E1134:J1134,\"=1\")*100+COUNTIF(E1134:J1134,\"=2\")*80+COUNTIF(E1134:J1134,\"=3\")*50+COUNTIF(E1134:J1134,\"=8\")*20+COUNTIF(E1134:J1134,\"=9\")*0)/COUNTA(E1134:J1134)/100,\"N/A\")","v":"N/A"},"N/A",{"$f":"IF(COUNTA(P1134:U1134)>0,(COUNTIF(P1134:U1134,\"=0\")*0+COUNTIF(P1134:U1134,\"=1\")*100+COUNTIF(P1134:U1134,\"=2\")*80+COUNTIF(P1134:U1134,\"=3\")*50+COUNTIF(P1134:U1134,\"=8\")*20+COUNTIF(P1134:U1134,\"=9\")*0)/COUNTA(P1134:U1134)/100,\"N/A\")","v":"N/A"},{"$f":"IF(COUNTA(V1134)<>0,(COUNTIF(V1134,\"=0\")*0+COUNTIF(V1134,\"=1\")*100+COUNTIF(V1134,\"=2\")*80+COUNTIF(V1134,\"=3\")*50+COUNTIF(V1134,\"=8\")*20+COUNTIF(V1134,\"=9\")*0)/COUNTA(V1134)/100,\"N/A\")","v":"N/A"},{"$f":"IF(COUNTA(W1134:X1134)>0,(COUNTIF(W1134:X1134,\"=0\")*0+COUNTIF(W1134:X1134,\"=1\")*100+COUNTIF(W1134:X1134,\"=2\")*80+COUNTIF(W1134:X1134,\"=3\")*50+COUNTIF(W1134:X1134,\"=8\")*20+COUNTIF(W1134:X1134,\"=9\")*0)/COUNTA(W1134:X1134)/100,\"N/A\")","v":"N/A"},{"$f":"IF(COUNTA(Y1134:AJ1134)>0,(COUNTIF(Y1134:AJ1134,\"=0\")*0+COUNTIF(Y1134:AJ1134,\"=1\")*100+COUNTIF(Y1134:AJ1134,\"=2\")*80+COUNTIF(Y1134:AJ1134,\"=3\")*50+COUNTIF(Y1134:AJ1134,\"=8\")*20+COUNTIF(Y1134:AJ1134,\"=9\")*0)/COUNTA(Y1134:AJ1134)/100,\"N/A\")","v":"N/A"},{"$f":"IF(COUNTA(AK1134:AP1134)>0,(COUNTIF(AK1134:AP1134,\"=0\")*0+COUNTIF(AK1134:AP1134,\"=1\")*100+COUNTIF(AK1134:AP1134,\"=2\")*80+COUNTIF(AK1134:AP1134,\"=3\")*50+COUNTIF(AK1134:AP1134,\"=8\")*20+COUNTIF(AK1134:AP1134,\"=9\")*0)/COUNTA(AK1134:AP1134)/100,\"N/A\")","v":"N/A"},{"$f":"IF(COUNTA(AQ1134:AU1134)>0,(COUNTIF(AQ1134:AU1134,\"=0\")*0+COUNTIF(AQ1134:AU1134,\"=1\")*100+COUNTIF(AQ1134:AU1134,\"=2\")*80+COUNTIF(AQ1134:AU1134,\"=3\")*50+COUNTIF(AQ1134:AU1134,\"=8\")*20+COUNTIF(AQ1134:AU1134,\"=9\")*0)/COUNTA(AQ1134:AU1134)/100,\"N/A\")","v":"N/A"},{"$f":"IF(COUNTA(AV1134:AX1134)>0,(COUNTIF(AV1134:AX1134,\"=0\")*0+COUNTIF(AV1134:AX1134,\"=1\")*100+COUNTIF(AV1134:AX1134,\"=2\")*80+COUNTIF(AV1134:AX1134,\"=3\")*50+COUNTIF(AV1134:AX1134,\"=8\")*20+COUNTIF(AV1134:AX1134,\"=9\")*0)/COUNTA(AV1134:AX1134)/100,\"N/A\")","v":"N/A"},{"$f":"IF(AND(COUNTA(E1134:AX1134)<>0,B1134<>\"\"),AVERAGE(BA1134:BG1134),\"N/A\")","v":"N/A"},1,1,1,1,1,1,1,1,1,1]
[null,null,null,null,null,null,null,null,null,null,null,null,null,null,null,null,null,null,null,null,null,null,null,null,null,null,null,null,null,null,null,null,null,null,null,null,null,null,null,null,null,null,null,null,null,null,null,null,null,null,"N/A","N/A","N/A","N/A","N/A","N/A","N/A","N/A","N/A","N/A",1,1,1,1,1,1,1,1,1,1]
[null,null,null,null,null,null,null,null,null,null,null,null,null,null,null,null,null,null,null,null,null,null,null,null,null,null,null,null,null,null,null,null,null,null,null,null,null,null,null,null,null,null,null,null,null,null,null,null,null,null,"N/A","N/A","N/A","N/A","N/A","N/A","N/A","N/A","N/A","N/A",1,1,1,1,1,1,1,1,1,1]
[null,null,null,null,null,null,null,null,null,null,null,null,null,null,null,null,null,null,null,null,null,null,null,null,null,null,null,null,null,null,null,null,null,null,null,null,null,null,null,null,null,null,null,null,null,null,null,null,null,null,"N/A","N/A","N/A","N/A","N/A","N/A","N/A","N/A","N/A","N/A",1,1,1,1,1,1,1,1,1,1]
[null,null,null,null,null,null,null,null,null,null,null,null,null,null,null,null,null,null,null,null,null,null,null,null,null,null,null,null,null,null,null,null,null,null,null,null,null,null,null,null,null,null,null,null,null,null,null,null,null,null,"N/A",{"$f":"IF(COUNTA(K1138:O1138)>0,(COUNTIF(K1138:O1138,\"=0\")*0+COUNTIF(K1138:O1138,\"=1\")*100+COUNTIF(K1138:O1138,\"=2\")*80+COUNTIF(K1138:O1138,\"=3\")*50+COUNTIF(K1138:O1138,\"=8\")*20+COUNTIF(K1138:O1138,\"=9\")*0)/COUNTA(K1138:O1138)/100,\"N/A\")","v":"N/A"},"N/A","N/A","N/A","N/A","N/A","N/A","N/A","N/A",1,1,1,1,1,1,1,1,1,1]
[null,null,null,null,null,null,null,null,null,null,null,null,null,null,null,null,null,null,null,null,null,null,null,null,null,null,null,null,null,null,null,null,null,null,null,null,null,null,null,null,null,null,null,null,null,null,null,null,null,null,"N/A","N/A","N/A","N/A","N/A","N/A","N/A","N/A","N/A","N/A",1,1,1,1,1,1,1,1,1,1]
[null,null,null,null,null,null,null,null,null,null,null,null,null,null,null,null,null,null,null,null,null,null,null,null,null,null,null,null,null,null,null,null,null,null,null,null,null,null,null,null,null,null,null,null,null,null,null,null,null,null,"N/A","N/A","N/A","N/A","N/A","N/A","N/A","N/A","N/A","N/A",1,1,1,1,1,1,1,1,1,1]
[null,null,null,null,null,null,null,null,null,null,null,null,null,null,null,null,null,null,null,null,null,null,null,null,null,null,null,null,null,null,null,null,null,null,null,null,null,null,null,null,null,null,null,null,null,null,null,null,null,null,"N/A","N/A","N/A","N/A","N/A","N/A","N/A","N/A","N/A","N/A",1,1,1,1,1,1,1,1,1,1]
[null,null,null,null,null,null,null,null,null,null,null,null,null,null,null,null,null,null,null,null,null,null,null,null,null,null,null,null,null,null,null,null,null,null,null,null,null,null,null,null,null,null,null,null,null,null,null,null,null,null,"N/A","N/A","N/A","N/A","N/A","N/A","N/A","N/A","N/A","N/A",1,1,1,1,1,1,1,1,1,1]
[null,null,null,null,null,null,null,null,null,null,null,null,null,null,null,null,null,null,null,null,null,null,null,null,null,null,null,null,null,null,null,null,null,null,null,null,null,null,null,null,null,null,null,null,null,null,null,null,null,null,"N/A","N/A","N/A","N/A","N/A","N/A","N/A","N/A","N/A","N/A",1,1,1,1,1,1,1,1,1,1]
[null,null,null,null,null,null,null,null,null,null,null,null,null,null,null,null,null,null,null,null,null,null,null,null,null,null,null,null,null,null,null,null,null,null,null,null,null,null,null,null,null,null,null,null,null,null,null,null,null,null,"N/A","N/A","N/A","N/A","N/A","N/A","N/A","N/A","N/A","N/A",1,1,1,1,1,1,1,1,1,1]
[null,null,null,null,null,null,null,null,null,null,null,null,null,null,null,null,null,null,null,null,null,null,null,null,null,null,null,null,null,null,null,null,null,null,null,null,null,null,null,null,null,null,null,null,null,null,null,null,null,null,"N/A","N/A","N/A","N/A","N/A","N/A","N/A","N/A","N/A","N/A",1,1,1,1,1,1,1,1,1,{"$f":"IF(BH1145=\"N/A\",1,\"\")","v":1}]
[null,null,null,null,null,null,null,null,null,null,null,null,null,null,null,null,null,null,null,null,null,null,null,null,null,null,null,null,null,null,null,null,null,null,null,null,null,null,null,null,null,null,null,null,null,null,null,null,null,null,"N/A","N/A","N/A","N/A","N/A","N/A","N/A","N/A","N/A","N/A",{"$f":"IF(AY1146=\"N/A\",1,\"\")","v":1},{"$f":"IF(AZ1146=\"N/A\",1,\"\")","v":1},{"$f":"IF(BA1146=\"N/A\",1,\"\")","v":1},{"$f":"IF(BB1146=\"N/A\",1,\"\")","v":1},{"$f":"IF(BC1146=\"N/A\",1,\"\")","v":1},{"$f":"IF(BD1146=\"N/A\",1,\"\")","v":1},{"$f":"IF(BE1146=\"N/A\",1,\"\")","v":1},1,1,1]
[null,null,null,null,null,null,null,null,null,null,null,null,null,null,null,null,null,null,null,null,null,null,null,null,null,null,null,null,null,null,null,null,null,null,null,null,null,null,null,null,null,null,null,null,null,null,null,null,null,null,"N/A","N/A","N/A","N/A","N/A","N/A","N/A","N/A","N/A","N/A",1,1,1,1,1,1,1,1,1,1]
[null,null,null,null,null,null,null,null,null,null,null,null,null,null,null,null,null,null,null,null,null,null,null,null,null,null,null,null,null,null,null,null,null,null,null,null,null,null,null,null,null,null,null,null,null,null,null,null,null,null,"N/A","N/A","N/A","N/A","N/A","N/A","N/A","N/A","N/A","N/A",1,1,1,1,1,1,1,1,1,1]
[null,null,null,null,null,null,null,null,null,null,null,null,null,null,null,null,null,null,null,null,null,null,null,null,null,null,null,null,null,null,null,null,null,null,null,null,null,null,null,null,null,null,null,null,null,null,null,null,null,null,"N/A","N/A","N/A","N/A","N/A","N/A","N/A","N/A","N/A","N/A",1,1,1,1,1,1,1,1,1,1]
[null,null,null,null,null,null,null,null,null,null,null,null,null,null,null,null,null,null,null,null,null,null,null,null,null,null,null,null,null,null,null,null,null,null,null,null,null,null,null,null,null,null,null,null,null,null,null,null,null,null,"N/A","N/A","N/A","N/A","N/A","N/A","N/A","N/A","N/A","N/A",1,1,1,1,1,1,1,1,1,1]
[null,null,null,null,null,null,null,null,null,null,null,null,null,null,null,null,null,null,null,null,null,null,null,null,null,null,null,null,null,null,null,null,null,null,null,null,null,null,null,null,null,null,null,null,null,null,null,null,null,null,"N/A","N/A","N/A","N/A","N/A","N/A","N/A","N/A","N/A","N/A",1,1,1,1,1,1,1,1,1,1]
[null,null,null,null,null,null,null,null,null,null,null,null,null,null,null,null,null,null,null,null,null,null,null,null,null,null,null,null,null,null,null,null,null,null,null,null,null,null,null,null,null,null,null,null,null,null,null,null,null,null,"N/A","N/A","N/A","N/A","N/A","N/A","N/A","N/A","N/A","N/A",1,1,1,1,1,1,1,1,1,1]
[null,null,null,null,null,null,null,null,null,null,null,null,null,null,null,null,null,null,null,null,null,null,null,null,null,null,null,null,null,null,null,null,null,null,null,null,null,null,null,null,null,null,null,null,null,null,null,null,null,null,"N/A","N/A","N/A","N/A","N/A","N/A","N/A","N/A","N/A","N/A",1,1,1,1,1,1,1,1,1,1]
[null,null,null,null,null,null,null,null,null,null,null,null,null,null,null,null,null,null,null,null,null,null,null,null,null,null,null,null,null,null,null,null,null,null,null,null,null,null,null,null,null,null,null,null,null,null,null,null,null,null,"N/A","N/A","N/A","N/A","N/A","N/A","N/A","N/A","N/A","N/A",1,1,1,1,1,1,1,1,1,1]
[null,null,null,null,null,null,null,null,null,null,null,null,null,null,null,null,null,null,null,null,null,null,null,null,null,null,null,null,null,null,null,null,null,null,null,null,null,null,null,null,null,null,null,null,null,null,null,null,null,null,"N/A","N/A","N/A","N/A","N/A","N/A","N/A","N/A","N/A","N/A",1,1,1,1,1,1,1,1,1,1]
[null,null,null,null,null,null,null,null,null,null,null,null,null,null,null,null,null,null,null,null,null,null,null,null,null,null,null,null,null,null,null,null,null,null,null,null,null,null,null,null,null,null,null,null,null,null,null,null,null,null,"N/A","N/A","N/A","N/A","N/A","N/A","N/A","N/A","N/A","N/A",1,1,1,1,1,1,1,1,1,1]
[null,null,null,null,null,null,null,null,null,null,null,null,null,null,null,null,null,null,null,null,null,null,null,null,null,null,null,null,null,null,null,null,null,null,null,null,null,null,null,null,null,null,null,null,null,null,null,null,null,null,"N/A","N/A","N/A","N/A","N/A","N/A","N/A","N/A","N/A","N/A",1,1,1,1,1,1,1,1,1,1]
[null,null,null,null,null,null,null,null,null,null,null,null,null,null,null,null,null,null,null,null,null,null,null,null,null,null,null,null,null,null,null,null,null,null,null,null,null,null,null,null,null,null,null,null,null,null,null,null,null,null,"N/A","N/A","N/A","N/A","N/A","N/A","N/A","N/A","N/A","N/A",1,1,1,1,1,1,1,1,1,1]
[null,null,null,null,null,null,null,null,null,null,null,null,null,null,null,null,null,null,null,null,null,null,null,null,null,null,null,null,null,null,null,null,null,null,null,null,null,null,null,null,null,null,null,null,null,null,null,null,null,null,"N/A","N/A","N/A","N/A","N/A","N/A","N/A","N/A","N/A","N/A",1,1,1,1,1,1,1,1,1,1]
[null,null,null,null,null,null,null,null,null,null,null,null,null,null,null,null,null,null,null,null,null,null,null,null,null,null,null,null,null,null,null,null,null,null,null,null,null,null,null,null,null,null,null,null,null,null,null,null,null,null,"N/A","N/A","N/A","N/A","N/A","N/A","N/A","N/A","N/A","N/A",1,1,1,1,1,1,1,1,1,1]
[null,null,null,null,null,null,null,null,null,null,null,null,null,null,null,null,null,null,null,null,null,null,null,null,null,null,null,null,null,null,null,null,null,null,null,null,null,null,null,null,null,null,null,null,null,null,null,null,null,null,"N/A","N/A","N/A","N/A","N/A","N/A","N/A","N/A","N/A","N/A",1,1,1,1,1,1,1,1,1,1]
[null,null,null,null,null,null,null,null,null,null,null,null,null,null,null,null,null,null,null,null,null,null,null,null,null,null,null,null,null,null,null,null,null,null,null,null,null,null,null,null,null,null,null,null,null,null,null,null,null,null,"N/A","N/A","N/A","N/A","N/A","N/A","N/A","N/A","N/A","N/A",1,1,1,1,1,1,1,1,1,1]
[null,null,null,null,null,null,null,null,null,null,null,null,null,null,null,null,null,null,null,null,null,null,null,null,null,null,null,null,null,null,null,null,null,null,null,null,null,null,null,null,null,null,null,null,null,null,null,null,null,null,"N/A","N/A","N/A","N/A","N/A","N/A","N/A","N/A","N/A","N/A",1,1,1,1,1,1,1,1,1,1]
[null,null,null,null,null,null,null,null,null,null,null,null,null,null,null,null,null,null,null,null,null,null,null,null,null,null,null,null,null,null,null,null,null,null,null,null,null,null,null,null,null,null,null,null,null,null,null,null,null,null,"N/A","N/A","N/A","N/A","N/A","N/A","N/A","N/A","N/A","N/A",1,1,1,1,1,1,1,1,1,1]
[null,null,null,null,null,null,null,null,null,null,null,null,null,null,null,null,null,null,null,null,null,null,null,null,null,null,null,null,null,null,null,null,null,null,null,null,null,null,null,null,null,null,null,null,null,null,null,null,null,null,"N/A","N/A","N/A","N/A","N/A","N/A","N/A","N/A","N/A","N/A",1,1,1,1,1,1,1,1,1,1]
[null,null,null,null,null,null,null,null,null,null,null,null,null,null,null,null,null,null,null,null,null,null,null,null,null,null,null,null,null,null,null,null,null,null,null,null,null,null,null,null,null,null,null,null,null,null,null,null,null,null,"N/A","N/A","N/A","N/A","N/A","N/A","N/A","N/A","N/A","N/A",1,1,1,1,1,1,1,1,1,1]
[null,null,null,null,null,null,null,null,null,null,null,null,null,null,null,null,null,null,null,null,null,null,null,null,null,null,null,null,null,null,null,null,null,null,null,null,null,null,null,null,null,null,null,null,null,null,null,null,null,null,"N/A","N/A","N/A","N/A","N/A","N/A","N/A","N/A","N/A","N/A",1,1,1,1,1,1,1,1,1,1]
[null,null,null,null,null,null,null,null,null,null,null,null,null,null,null,null,null,null,null,null,null,null,null,null,null,null,null,null,null,null,null,null,null,null,null,null,null,null,null,null,null,null,null,null,null,null,null,null,null,null,"N/A","N/A","N/A","N/A","N/A","N/A","N/A","N/A","N/A","N/A",1,1,1,1,1,1,1,{"$f":"IF(BF1168=\"N/A\",1,\"\")","v":1},{"$f":"IF(BG1168=\"N/A\",1,\"\")","v":1},1]
[null,null,null,null,null,null,null,null,null,null,null,null,null,null,null,null,null,null,null,null,null,null,null,null,null,null,null,null,null,null,null,null,null,null,null,null,null,null,null,null,null,null,null,null,null,null,null,null,null,null,"N/A","N/A","N/A","N/A","N/A","N/A","N/A","N/A","N/A","N/A",1,1,1,1,1,1,1,1,1,1]
[null,null,null,null,null,null,null,null,null,null,null,null,null,null,null,null,null,null,null,null,null,null,null,null,null,null,null,null,null,null,null,null,null,null,null,null,null,null,null,null,null,null,null,null,null,null,null,null,null,null,"N/A","N/A","N/A","N/A","N/A","N/A","N/A","N/A","N/A","N/A",1,1,1,1,1,1,1,1,1,1]
[null,null,null,null,null,null,null,null,null,null,null,null,null,null,null,null,null,null,null,null,null,null,null,null,null,null,null,null,null,null,null,null,null,null,null,null,null,null,null,null,null,null,null,null,null,null,null,null,null,null,"N/A","N/A","N/A","N/A","N/A","N/A","N/A","N/A","N/A","N/A",1,1,1,1,1,1,1,1,1,1]
[null,null,null,null,null,null,null,null,null,null,null,null,null,null,null,null,null,null,null,null,null,null,null,null,null,null,null,null,null,null,null,null,null,null,null,null,null,null,null,null,null,null,null,null,null,null,null,null,null,null,"N/A","N/A","N/A","N/A","N/A","N/A","N/A","N/A","N/A","N/A",1,1,1,1,1,1,1,1,1,1]
[null,null,null,null,null,null,null,null,null,null,null,null,null,null,null,null,null,null,null,null,null,null,null,null,null,null,null,null,null,null,null,null,null,null,null,null,null,null,null,null,null,null,null,null,null,null,null,null,null,null,"N/A","N/A","N/A","N/A","N/A","N/A","N/A","N/A","N/A","N/A",1,1,1,1,1,1,1,1,1,1]
[null,null,null,null,null,null,null,null,null,null,null,null,null,null,null,null,null,null,null,null,null,null,null,null,null,null,null,null,null,null,null,null,null,null,null,null,null,null,null,null,null,null,null,null,null,null,null,null,null,null,"N/A","N/A","N/A","N/A","N/A","N/A","N/A","N/A","N/A","N/A",1,1,1,1,1,1,1,1,1,1]
[null,null,null,null,null,null,null,null,null,null,null,null,null,null,null,null,null,null,null,null,null,null,null,null,null,null,null,null,null,null,null,null,null,null,null,null,null,null,null,null,null,null,null,null,null,null,null,null,null,null,"N/A","N/A","N/A","N/A","N/A","N/A","N/A","N/A","N/A","N/A",1,1,1,1,1,1,1,1,1,1]
[null,null,null,null,null,null,null,null,null,null,null,null,null,null,null,null,null,null,null,null,null,null,null,null,null,null,null,null,null,null,null,null,null,null,null,null,null,null,null,null,null,null,null,null,null,null,null,null,null,null,"N/A","N/A","N/A","N/A","N/A","N/A","N/A","N/A","N/A","N/A",1,1,1,1,1,1,1,1,1,1]
[null,null,null,null,null,null,null,null,null,null,null,null,null,null,null,null,null,null,null,null,null,null,null,null,null,null,null,null,null,null,null,null,null,null,null,null,null,null,null,null,null,null,null,null,null,null,null,null,null,null,"N/A","N/A","N/A","N/A","N/A","N/A","N/A","N/A","N/A","N/A",1,1,1,1,1,1,1,1,1,1]
[null,null,null,null,null,null,null,null,null,null,null,null,null,null,null,null,null,null,null,null,null,null,null,null,null,null,null,null,null,null,null,null,null,null,null,null,null,null,null,null,null,null,null,null,null,null,null,null,null,null,"N/A","N/A","N/A","N/A","N/A","N/A","N/A","N/A","N/A","N/A",1,1,1,1,1,1,1,1,1,1]
[null,null,null,null,null,null,null,null,null,null,null,null,null,null,null,null,null,null,null,null,null,null,null,null,null,null,null,null,null,null,null,null,null,null,null,null,null,null,null,null,null,null,null,null,null,null,null,null,null,null,"N/A","N/A","N/A","N/A","N/A","N/A","N/A","N/A","N/A","N/A",1,1,1,1,1,1,1,1,1,1]
[null,null,null,null,null,null,null,null,null,null,null,null,null,null,null,null,null,null,null,null,null,null,null,null,null,null,null,null,null,null,null,null,null,null,null,null,null,null,null,null,null,null,null,null,null,null,null,null,null,null,"N/A","N/A","N/A","N/A","N/A","N/A","N/A","N/A","N/A","N/A",1,1,1,1,1,1,1,1,1,1]
[null,null,null,null,null,null,null,null,null,null,null,null,null,null,null,null,null,null,null,null,null,null,null,null,null,null,null,null,null,null,null,null,null,null,null,null,null,null,null,null,null,null,null,null,null,null,null,null,null,null,"N/A","N/A","N/A","N/A","N/A","N/A","N/A","N/A","N/A","N/A",1,1,1,1,1,1,1,1,1,1]
[null,null,null,null,null,null,null,null,null,null,null,null,null,null,null,null,null,null,null,null,null,null,null,null,null,null,null,null,null,null,null,null,null,null,null,null,null,null,null,null,null,null,null,null,null,null,null,null,null,null,"N/A","N/A","N/A","N/A","N/A","N/A","N/A","N/A","N/A","N/A",1,1,1,1,1,1,1,1,1,1]
[null,null,null,null,null,null,null,null,null,null,null,null,null,null,null,null,null,null,null,null,null,null,null,null,null,null,null,null,null,null,null,null,null,null,null,null,null,null,null,null,null,null,null,null,null,null,null,null,null,null,"N/A","N/A","N/A","N/A","N/A","N/A","N/A","N/A","N/A","N/A",1,1,1,1,1,1,1,1,1,1]
[null,null,null,null,null,null,null,null,null,null,null,null,null,null,null,null,null,null,null,null,null,null,null,null,null,null,null,null,null,null,null,null,null,null,null,null,null,null,null,null,null,null,null,null,null,null,null,null,null,null,"N/A","N/A","N/A","N/A","N/A","N/A","N/A","N/A","N/A","N/A",1,1,1,1,1,1,1,1,1,1]
[null,null,null,null,null,null,null,null,null,null,null,null,null,null,null,null,null,null,null,null,null,null,null,null,null,null,null,null,null,null,null,null,null,null,null,null,null,null,null,null,null,null,null,null,null,null,null,null,null,null,"N/A","N/A","N/A","N/A","N/A","N/A","N/A","N/A","N/A","N/A",1,1,1,1,1,1,1,1,1,1]
[null,null,null,null,null,null,null,null,null,null,null,null,null,null,null,null,null,null,null,null,null,null,null,null,null,null,null,null,null,null,null,null,null,null,null,null,null,null,null,null,null,null,null,null,null,null,null,null,null,null,"N/A","N/A","N/A","N/A","N/A","N/A","N/A","N/A","N/A","N/A",1,1,1,1,1,1,1,1,1,1]
[null,null,null,null,null,null,null,null,null,null,null,null,null,null,null,null,null,null,null,null,null,null,null,null,null,null,null,null,null,null,null,null,null,null,null,null,null,null,null,null,null,null,null,null,null,null,null,null,null,null,"N/A","N/A","N/A","N/A","N/A","N/A","N/A","N/A","N/A","N/A",1,1,1,1,1,1,1,1,1,1]
[null,null,null,null,null,null,null,null,null,null,null,null,null,null,null,null,null,null,null,null,null,null,null,null,null,null,null,null,null,null,null,null,null,null,null,null,null,null,null,null,null,null,null,null,null,null,null,null,null,null,"N/A","N/A","N/A","N/A","N/A","N/A","N/A","N/A","N/A","N/A",1,1,1,1,1,1,1,1,1,1]
[null,null,null,null,null,null,null,null,null,null,null,null,null,null,null,null,null,null,null,null,null,null,null,null,null,null,null,null,null,null,null,null,null,null,null,null,null,null,null,null,null,null,null,null,null,null,null,null,null,null,"N/A","N/A","N/A","N/A","N/A","N/A","N/A","N/A","N/A","N/A",1,1,1,1,1,1,1,1,1,1]
[null,null,null,null,null,null,null,null,null,null,null,null,null,null,null,null,null,null,null,null,null,null,null,null,null,null,null,null,null,null,null,null,null,null,null,null,null,null,null,null,null,null,null,null,null,null,null,null,null,null,"N/A","N/A","N/A","N/A","N/A","N/A","N/A","N/A","N/A","N/A",1,1,1,1,1,1,1,1,1,1]
[null,null,null,null,null,null,null,null,null,null,null,null,null,null,null,null,null,null,null,null,null,null,null,null,null,null,null,null,null,null,null,null,null,null,null,null,null,null,null,null,null,null,null,null,null,null,null,null,null,null,"N/A","N/A","N/A","N/A","N/A","N/A","N/A","N/A","N/A","N/A",1,1,1,1,1,1,1,1,1,1]
[null,null,null,null,null,null,null,null,null,null,null,null,null,null,null,null,null,null,null,null,null,null,null,null,null,null,null,null,null,null,null,null,null,null,null,null,null,null,null,null,null,null,null,null,null,null,null,null,null,null,"N/A","N/A","N/A","N/A","N/A","N/A","N/A","N/A","N/A","N/A",1,1,1,1,1,1,1,1,1,1]
[null,null,null,null,null,null,null,null,null,null,null,null,null,null,null,null,null,null,null,null,null,null,null,null,null,null,null,null,null,null,null,null,null,null,null,null,null,null,null,null,null,null,null,null,null,null,null,null,null,null,"N/A","N/A","N/A","N/A","N/A","N/A","N/A","N/A","N/A","N/A",1,1,1,1,1,1,1,1,1,1]
[null,null,null,null,null,null,null,null,null,null,null,null,null,null,null,null,null,null,null,null,null,null,null,null,null,null,null,null,null,null,null,null,null,null,null,null,null,null,null,null,null,null,null,null,null,null,null,null,null,null,"N/A","N/A","N/A","N/A","N/A","N/A","N/A","N/A","N/A","N/A",1,1,1,1,1,1,1,1,1,1]
[null,null,null,null,null,null,null,null,null,null,null,null,null,null,null,null,null,null,null,null,null,null,null,null,null,null,null,null,null,null,null,null,null,null,null,null,null,null,null,null,null,null,null,null,null,null,null,null,null,null,"N/A","N/A","N/A","N/A","N/A","N/A","N/A","N/A","N/A","N/A",1,1,1,1,1,1,1,1,1,1]
[null,null,null,null,null,null,null,null,null,null,null,null,null,null,null,null,null,null,null,null,null,null,null,null,null,null,null,null,null,null,null,null,null,null,null,null,null,null,null,null,null,null,null,null,null,null,null,null,null,null,"N/A","N/A","N/A","N/A","N/A","N/A","N/A","N/A","N/A","N/A",1,1,1,1,1,1,1,1,1,1]
[null,null,null,null,null,null,null,null,null,null,null,null,null,null,null,null,null,null,null,null,null,null,null,null,null,null,null,null,null,null,null,null,null,null,null,null,null,null,null,null,null,null,null,null,null,null,null,null,null,null,"N/A","N/A","N/A","N/A","N/A","N/A","N/A","N/A","N/A","N/A",1,1,1,1,1,1,1,1,1,1]
[null,null,null,null,null,null,null,null,null,null,null,null,null,null,null,null,null,null,null,null,null,null,null,null,null,null,null,null,null,null,null,null,null,null,null,null,null,null,null,null,null,null,null,null,null,null,null,null,null,null,{"$f":"IF(COUNTA(E1198:J1198)>0,(COUNTIF(E1198:J1198,\"=0\")*0+COUNTIF(E1198:J1198,\"=1\")*100+COUNTIF(E1198:J1198,\"=2\")*80+COUNTIF(E1198:J1198,\"=3\")*50+COUNTIF(E1198:J1198,\"=8\")*20+COUNTIF(E1198:J1198,\"=9\")*0)/COUNTA(E1198:J1198)/100,\"N/A\")","v":"N/A"},"N/A",{"$f":"IF(COUNTA(P1198:U1198)>0,(COUNTIF(P1198:U1198,\"=0\")*0+COUNTIF(P1198:U1198,\"=1\")*100+COUNTIF(P1198:U1198,\"=2\")*80+COUNTIF(P1198:U1198,\"=3\")*50+COUNTIF(P1198:U1198,\"=8\")*20+COUNTIF(P1198:U1198,\"=9\")*0)/COUNTA(P1198:U1198)/100,\"N/A\")","v":"N/A"},{"$f":"IF(COUNTA(V1198)<>0,(COUNTIF(V1198,\"=0\")*0+COUNTIF(V1198,\"=1\")*100+COUNTIF(V1198,\"=2\")*80+COUNTIF(V1198,\"=3\")*50+COUNTIF(V1198,\"=8\")*20+COUNTIF(V1198,\"=9\")*0)/COUNTA(V1198)/100,\"N/A\")","v":"N/A"},{"$f":"IF(COUNTA(W1198:X1198)>0,(COUNTIF(W1198:X1198,\"=0\")*0+COUNTIF(W1198:X1198,\"=1\")*100+COUNTIF(W1198:X1198,\"=2\")*80+COUNTIF(W1198:X1198,\"=3\")*50+COUNTIF(W1198:X1198,\"=8\")*20+COUNTIF(W1198:X1198,\"=9\")*0)/COUNTA(W1198:X1198)/100,\"N/A\")","v":"N/A"},{"$f":"IF(COUNTA(Y1198:AJ1198)>0,(COUNTIF(Y1198:AJ1198,\"=0\")*0+COUNTIF(Y1198:AJ1198,\"=1\")*100+COUNTIF(Y1198:AJ1198,\"=2\")*80+COUNTIF(Y1198:AJ1198,\"=3\")*50+COUNTIF(Y1198:AJ1198,\"=8\")*20+COUNTIF(Y1198:AJ1198,\"=9\")*0)/COUNTA(Y1198:AJ1198)/100,\"N/A\")","v":"N/A"},{"$f":"IF(COUNTA(AK1198:AP1198)>0,(COUNTIF(AK1198:AP1198,\"=0\")*0+COUNTIF(AK1198:AP1198,\"=1\")*100+COUNTIF(AK1198:AP1198,\"=2\")*80+COUNTIF(AK1198:AP1198,\"=3\")*50+COUNTIF(AK1198:AP1198,\"=8\")*20+COUNTIF(AK1198:AP1198,\"=9\")*0)/COUNTA(AK1198:AP1198)/100,\"N/A\")","v":"N/A"},{"$f":"IF(COUNTA(AQ1198:AU1198)>0,(COUNTIF(AQ1198:AU1198,\"=0\")*0+COUNTIF(AQ1198:AU1198,\"=1\")*100+COUNTIF(AQ1198:AU1198,\"=2\")*80+COUNTIF(AQ1198:AU1198,\"=3\")*50+COUNTIF(AQ1198:AU1198,\"=8\")*20+COUNTIF(AQ1198:AU1198,\"=9\")*0)/COUNTA(AQ1198:AU1198)/100,\"N/A\")","v":"N/A"},{"$f":"IF(COUNTA(AV1198:AX1198)>0,(COUNTIF(AV1198:AX1198,\"=0\")*0+COUNTIF(AV1198:AX1198,\"=1\")*100+COUNTIF(AV1198:AX1198,\"=2\")*80+COUNTIF(AV1198:AX1198,\"=3\")*50+COUNTIF(AV1198:AX1198,\"=8\")*20+COUNTIF(AV1198:AX1198,\"=9\")*0)/COUNTA(AV1198:AX1198)/100,\"N/A\")","v":"N/A"},{"$f":"IF(AND(COUNTA(E1198:AX1198)<>0,B1198<>\"\"),AVERAGE(BA1198:BG1198),\"N/A\")","v":"N/A"},1,1,1,1,1,1,1,1,1,1]
[null,null,null,null,null,null,null,null,null,null,null,null,null,null,null,null,null,null,null,null,null,null,null,null,null,null,null,null,null,null,null,null,null,null,null,null,null,null,null,null,null,null,null,null,null,null,null,null,null,null,"N/A","N/A","N/A","N/A","N/A","N/A","N/A","N/A","N/A","N/A",1,1,1,1,1,1,1,1,1,1]
[null,null,null,null,null,null,null,null,null,null,null,null,null,null,null,null,null,null,null,null,null,null,null,null,null,null,null,null,null,null,null,null,null,null,null,null,null,null,null,null,null,null,null,null,null,null,null,null,null,null,"N/A","N/A","N/A","N/A","N/A","N/A","N/A","N/A","N/A","N/A",1,1,1,1,1,1,1,1,1,1]
[null,null,null,null,null,null,null,null,null,null,null,null,null,null,null,null,null,null,null,null,null,null,null,null,null,null,null,null,null,null,null,null,null,null,null,null,null,null,null,null,null,null,null,null,null,null,null,null,null,null,"N/A","N/A","N/A","N/A","N/A","N/A","N/A","N/A","N/A","N/A",1,1,1,1,1,1,1,1,1,1]
[null,null,null,null,null,null,null,null,null,null,null,null,null,null,null,null,null,null,null,null,null,null,null,null,null,null,null,null,null,null,null,null,null,null,null,null,null,null,null,null,null,null,null,null,null,null,null,null,null,null,"N/A",{"$f":"IF(COUNTA(K1202:O1202)>0,(COUNTIF(K1202:O1202,\"=0\")*0+COUNTIF(K1202:O1202,\"=1\")*100+COUNTIF(K1202:O1202,\"=2\")*80+COUNTIF(K1202:O1202,\"=3\")*50+COUNTIF(K1202:O1202,\"=8\")*20+COUNTIF(K1202:O1202,\"=9\")*0)/COUNTA(K1202:O1202)/100,\"N/A\")","v":"N/A"},"N/A","N/A","N/A","N/A","N/A","N/A","N/A","N/A",1,1,1,1,1,1,1,1,1,1]
[null,null,null,null,null,null,null,null,null,null,null,null,null,null,null,null,null,null,null,null,null,null,null,null,null,null,null,null,null,null,null,null,null,null,null,null,null,null,null,null,null,null,null,null,null,null,null,null,null,null,"N/A","N/A","N/A","N/A","N/A","N/A","N/A","N/A","N/A","N/A",1,1,1,1,1,1,1,1,1,1]
[null,null,null,null,null,null,null,null,null,null,null,null,null,null,null,null,null,null,null,null,null,null,null,null,null,null,null,null,null,null,null,null,null,null,null,null,null,null,null,null,null,null,null,null,null,null,null,null,null,null,"N/A","N/A","N/A","N/A","N/A","N/A","N/A","N/A","N/A","N/A",1,1,1,1,1,1,1,1,1,1]
[null,null,null,null,null,null,null,null,null,null,null,null,null,null,null,null,null,null,null,null,null,null,null,null,null,null,null,null,null,null,null,null,null,null,null,null,null,null,null,null,null,null,null,null,null,null,null,null,null,null,"N/A","N/A","N/A","N/A","N/A","N/A","N/A","N/A","N/A","N/A",1,1,1,1,1,1,1,1,1,1]
[null,null,null,null,null,null,null,null,null,null,null,null,null,null,null,null,null,null,null,null,null,null,null,null,null,null,null,null,null,null,null,null,null,null,null,null,null,null,null,null,null,null,null,null,null,null,null,null,null,null,"N/A","N/A","N/A","N/A","N/A","N/A","N/A","N/A","N/A","N/A",1,1,1,1,1,1,1,1,1,1]
[null,null,null,null,null,null,null,null,null,null,null,null,null,null,null,null,null,null,null,null,null,null,null,null,null,null,null,null,null,null,null,null,null,null,null,null,null,null,null,null,null,null,null,null,null,null,null,null,null,null,"N/A","N/A","N/A","N/A","N/A","N/A","N/A","N/A","N/A","N/A",1,1,1,1,1,1,1,1,1,1]
[null,null,null,null,null,null,null,null,null,null,null,null,null,null,null,null,null,null,null,null,null,null,null,null,null,null,null,null,null,null,null,null,null,null,null,null,null,null,null,null,null,null,null,null,null,null,null,null,null,null,"N/A","N/A","N/A","N/A","N/A","N/A","N/A","N/A","N/A","N/A",1,1,1,1,1,1,1,1,1,1]
[null,null,null,null,null,null,null,null,null,null,null,null,null,null,null,null,null,null,null,null,null,null,null,null,null,null,null,null,null,null,null,null,null,null,null,null,null,null,null,null,null,null,null,null,null,null,null,null,null,null,"N/A","N/A","N/A","N/A","N/A","N/A","N/A","N/A","N/A","N/A",1,1,1,1,1,1,1,1,1,{"$f":"IF(BH1209=\"N/A\",1,\"\")","v":1}]
[null,null,null,null,null,null,null,null,null,null,null,null,null,null,null,null,null,null,null,null,null,null,null,null,null,null,null,null,null,null,null,null,null,null,null,null,null,null,null,null,null,null,null,null,null,null,null,null,null,null,"N/A","N/A","N/A","N/A","N/A","N/A","N/A","N/A","N/A","N/A",{"$f":"IF(AY1210=\"N/A\",1,\"\")","v":1},{"$f":"IF(AZ1210=\"N/A\",1,\"\")","v":1},{"$f":"IF(BA1210=\"N/A\",1,\"\")","v":1},{"$f":"IF(BB1210=\"N/A\",1,\"\")","v":1},{"$f":"IF(BC1210=\"N/A\",1,\"\")","v":1},{"$f":"IF(BD1210=\"N/A\",1,\"\")","v":1},{"$f":"IF(BE1210=\"N/A\",1,\"\")","v":1},1,1,1]
[null,null,null,null,null,null,null,null,null,null,null,null,null,null,null,null,null,null,null,null,null,null,null,null,null,null,null,null,null,null,null,null,null,null,null,null,null,null,null,null,null,null,null,null,null,null,null,null,null,null,"N/A","N/A","N/A","N/A","N/A","N/A","N/A","N/A","N/A","N/A",1,1,1,1,1,1,1,1,1,1]
[null,null,null,null,null,null,null,null,null,null,null,null,null,null,null,null,null,null,null,null,null,null,null,null,null,null,null,null,null,null,null,null,null,null,null,null,null,null,null,null,null,null,null,null,null,null,null,null,null,null,"N/A","N/A","N/A","N/A","N/A","N/A","N/A","N/A","N/A","N/A",1,1,1,1,1,1,1,1,1,1]
[null,null,null,null,null,null,null,null,null,null,null,null,null,null,null,null,null,null,null,null,null,null,null,null,null,null,null,null,null,null,null,null,null,null,null,null,null,null,null,null,null,null,null,null,null,null,null,null,null,null,"N/A","N/A","N/A","N/A","N/A","N/A","N/A","N/A","N/A","N/A",1,1,1,1,1,1,1,1,1,1]
[null,null,null,null,null,null,null,null,null,null,null,null,null,null,null,null,null,null,null,null,null,null,null,null,null,null,null,null,null,null,null,null,null,null,null,null,null,null,null,null,null,null,null,null,null,null,null,null,null,null,"N/A","N/A","N/A","N/A","N/A","N/A","N/A","N/A","N/A","N/A",1,1,1,1,1,1,1,1,1,1]
[null,null,null,null,null,null,null,null,null,null,null,null,null,null,null,null,null,null,null,null,null,null,null,null,null,null,null,null,null,null,null,null,null,null,null,null,null,null,null,null,null,null,null,null,null,null,null,null,null,null,"N/A","N/A","N/A","N/A","N/A","N/A","N/A","N/A","N/A","N/A",1,1,1,1,1,1,1,1,1,1]
[null,null,null,null,null,null,null,null,null,null,null,null,null,null,null,null,null,null,null,null,null,null,null,null,null,null,null,null,null,null,null,null,null,null,null,null,null,null,null,null,null,null,null,null,null,null,null,null,null,null,"N/A","N/A","N/A","N/A","N/A","N/A","N/A","N/A","N/A","N/A",1,1,1,1,1,1,1,1,1,1]
[null,null,null,null,null,null,null,null,null,null,null,null,null,null,null,null,null,null,null,null,null,null,null,null,null,null,null,null,null,null,null,null,null,null,null,null,null,null,null,null,null,null,null,null,null,null,null,null,null,null,"N/A","N/A","N/A","N/A","N/A","N/A","N/A","N/A","N/A","N/A",1,1,1,1,1,1,1,1,1,1]
[null,null,null,null,null,null,null,null,null,null,null,null,null,null,null,null,null,null,null,null,null,null,null,null,null,null,null,null,null,null,null,null,null,null,null,null,null,null,null,null,null,null,null,null,null,null,null,null,null,null,"N/A","N/A","N/A","N/A","N/A","N/A","N/A","N/A","N/A","N/A",1,1,1,1,1,1,1,1,1,1]
[null,null,null,null,null,null,null,null,null,null,null,null,null,null,null,null,null,null,null,null,null,null,null,null,null,null,null,null,null,null,null,null,null,null,null,null,null,null,null,null,null,null,null,null,null,null,null,null,null,null,"N/A","N/A","N/A","N/A","N/A","N/A","N/A","N/A","N/A","N/A",1,1,1,1,1,1,1,1,1,1]
[null,null,null,null,null,null,null,null,null,null,null,null,null,null,null,null,null,null,null,null,null,null,null,null,null,null,null,null,null,null,null,null,null,null,null,null,null,null,null,null,null,null,null,null,null,null,null,null,null,null,"N/A","N/A","N/A","N/A","N/A","N/A","N/A","N/A","N/A","N/A",1,1,1,1,1,1,1,1,1,1]
[null,null,null,null,null,null,null,null,null,null,null,null,null,null,null,null,null,null,null,null,null,null,null,null,null,null,null,null,null,null,null,null,null,null,null,null,null,null,null,null,null,null,null,null,null,null,null,null,null,null,"N/A","N/A","N/A","N/A","N/A","N/A","N/A","N/A","N/A","N/A",1,1,1,1,1,1,1,1,1,1]
[null,null,null,null,null,null,null,null,null,null,null,null,null,null,null,null,null,null,null,null,null,null,null,null,null,null,null,null,null,null,null,null,null,null,null,null,null,null,null,null,null,null,null,null,null,null,null,null,null,null,"N/A","N/A","N/A","N/A","N/A","N/A","N/A","N/A","N/A","N/A",1,1,1,1,1,1,1,1,1,1]
[null,null,null,null,null,null,null,null,null,null,null,null,null,null,null,null,null,null,null,null,null,null,null,null,null,null,null,null,null,null,null,null,null,null,null,null,null,null,null,null,null,null,null,null,null,null,null,null,null,null,"N/A","N/A","N/A","N/A","N/A","N/A","N/A","N/A","N/A","N/A",1,1,1,1,1,1,1,1,1,1]
[null,null,null,null,null,null,null,null,null,null,null,null,null,null,null,null,null,null,null,null,null,null,null,null,null,null,null,null,null,null,null,null,null,null,null,null,null,null,null,null,null,null,null,null,null,null,null,null,null,null,"N/A","N/A","N/A","N/A","N/A","N/A","N/A","N/A","N/A","N/A",1,1,1,1,1,1,1,1,1,1]
[null,null,null,null,null,null,null,null,null,null,null,null,null,null,null,null,null,null,null,null,null,null,null,null,null,null,null,null,null,null,null,null,null,null,null,null,null,null,null,null,null,null,null,null,null,null,null,null,null,null,"N/A","N/A","N/A","N/A","N/A","N/A","N/A","N/A","N/A","N/A",1,1,1,1,1,1,1,1,1,1]
[null,null,null,null,null,null,null,null,null,null,null,null,null,null,null,null,null,null,null,null,null,null,null,null,null,null,null,null,null,null,null,null,null,null,null,null,null,null,null,null,null,null,null,null,null,null,null,null,null,null,"N/A","N/A","N/A","N/A","N/A","N/A","N/A","N/A","N/A","N/A",1,1,1,1,1,1,1,1,1,1]
[null,null,null,null,null,null,null,null,null,null,null,null,null,null,null,null,null,null,null,null,null,null,null,null,null,null,null,null,null,null,null,null,null,null,null,null,null,null,null,null,null,null,null,null,null,null,null,null,null,null,"N/A","N/A","N/A","N/A","N/A","N/A","N/A","N/A","N/A","N/A",1,1,1,1,1,1,1,1,1,1]
[null,null,null,null,null,null,null,null,null,null,null,null,null,null,null,null,null,null,null,null,null,null,null,null,null,null,null,null,null,null,null,null,null,null,null,null,null,null,null,null,null,null,null,null,null,null,null,null,null,null,"N/A","N/A","N/A","N/A","N/A","N/A","N/A","N/A","N/A","N/A",1,1,1,1,1,1,1,1,1,1]
[null,null,null,null,null,null,null,null,null,null,null,null,null,null,null,null,null,null,null,null,null,null,null,null,null,null,null,null,null,null,null,null,null,null,null,null,null,null,null,null,null,null,null,null,null,null,null,null,null,null,"N/A","N/A","N/A","N/A","N/A","N/A","N/A","N/A","N/A","N/A",1,1,1,1,1,1,1,1,1,1]
[null,null,null,null,null,null,null,null,null,null,null,null,null,null,null,null,null,null,null,null,null,null,null,null,null,null,null,null,null,null,null,null,null,null,null,null,null,null,null,null,null,null,null,null,null,null,null,null,null,null,"N/A","N/A","N/A","N/A","N/A","N/A","N/A","N/A","N/A","N/A",1,1,1,1,1,1,1,1,1,1]
[null,null,null,null,null,null,null,null,null,null,null,null,null,null,null,null,null,null,null,null,null,null,null,null,null,null,null,null,null,null,null,null,null,null,null,null,null,null,null,null,null,null,null,null,null,null,null,null,null,null,"N/A","N/A","N/A","N/A","N/A","N/A","N/A","N/A","N/A","N/A",1,1,1,1,1,1,1,1,1,1]
[null,null,null,null,null,null,null,null,null,null,null,null,null,null,null,null,null,null,null,null,null,null,null,null,null,null,null,null,null,null,null,null,null,null,null,null,null,null,null,null,null,null,null,null,null,null,null,null,null,null,"N/A","N/A","N/A","N/A","N/A","N/A","N/A","N/A","N/A","N/A",1,1,1,1,1,1,1,{"$f":"IF(BF1232=\"N/A\",1,\"\")","v":1},{"$f":"IF(BG1232=\"N/A\",1,\"\")","v":1},1]
[null,null,null,null,null,null,null,null,null,null,null,null,null,null,null,null,null,null,null,null,null,null,null,null,null,null,null,null,null,null,null,null,null,null,null,null,null,null,null,null,null,null,null,null,null,null,null,null,null,null,"N/A","N/A","N/A","N/A","N/A","N/A","N/A","N/A","N/A","N/A",1,1,1,1,1,1,1,1,1,1]
[null,null,null,null,null,null,null,null,null,null,null,null,null,null,null,null,null,null,null,null,null,null,null,null,null,null,null,null,null,null,null,null,null,null,null,null,null,null,null,null,null,null,null,null,null,null,null,null,null,null,"N/A","N/A","N/A","N/A","N/A","N/A","N/A","N/A","N/A","N/A",1,1,1,1,1,1,1,1,1,1]
[null,null,null,null,null,null,null,null,null,null,null,null,null,null,null,null,null,null,null,null,null,null,null,null,null,null,null,null,null,null,null,null,null,null,null,null,null,null,null,null,null,null,null,null,null,null,null,null,null,null,"N/A","N/A","N/A","N/A","N/A","N/A","N/A","N/A","N/A","N/A",1,1,1,1,1,1,1,1,1,1]
[null,null,null,null,null,null,null,null,null,null,null,null,null,null,null,null,null,null,null,null,null,null,null,null,null,null,null,null,null,null,null,null,null,null,null,null,null,null,null,null,null,null,null,null,null,null,null,null,null,null,"N/A","N/A","N/A","N/A","N/A","N/A","N/A","N/A","N/A","N/A",1,1,1,1,1,1,1,1,1,1]
[null,null,null,null,null,null,null,null,null,null,null,null,null,null,null,null,null,null,null,null,null,null,null,null,null,null,null,null,null,null,null,null,null,null,null,null,null,null,null,null,null,null,null,null,null,null,null,null,null,null,"N/A","N/A","N/A","N/A","N/A","N/A","N/A","N/A","N/A","N/A",1,1,1,1,1,1,1,1,1,1]
[null,null,null,null,null,null,null,null,null,null,null,null,null,null,null,null,null,null,null,null,null,null,null,null,null,null,null,null,null,null,null,null,null,null,null,null,null,null,null,null,null,null,null,null,null,null,null,null,null,null,"N/A","N/A","N/A","N/A","N/A","N/A","N/A","N/A","N/A","N/A",1,1,1,1,1,1,1,1,1,1]
[null,null,null,null,null,null,null,null,null,null,null,null,null,null,null,null,null,null,null,null,null,null,null,null,null,null,null,null,null,null,null,null,null,null,null,null,null,null,null,null,null,null,null,null,null,null,null,null,null,null,"N/A","N/A","N/A","N/A","N/A","N/A","N/A","N/A","N/A","N/A",1,1,1,1,1,1,1,1,1,1]
[null,null,null,null,null,null,null,null,null,null,null,null,null,null,null,null,null,null,null,null,null,null,null,null,null,null,null,null,null,null,null,null,null,null,null,null,null,null,null,null,null,null,null,null,null,null,null,null,null,null,"N/A","N/A","N/A","N/A","N/A","N/A","N/A","N/A","N/A","N/A",1,1,1,1,1,1,1,1,1,1]
[null,null,null,null,null,null,null,null,null,null,null,null,null,null,null,null,null,null,null,null,null,null,null,null,null,null,null,null,null,null,null,null,null,null,null,null,null,null,null,null,null,null,null,null,null,null,null,null,null,null,"N/A","N/A","N/A","N/A","N/A","N/A","N/A","N/A","N/A","N/A",1,1,1,1,1,1,1,1,1,1]
[null,null,null,null,null,null,null,null,null,null,null,null,null,null,null,null,null,null,null,null,null,null,null,null,null,null,null,null,null,null,null,null,null,null,null,null,null,null,null,null,null,null,null,null,null,null,null,null,null,null,"N/A","N/A","N/A","N/A","N/A","N/A","N/A","N/A","N/A","N/A",1,1,1,1,1,1,1,1,1,1]
[null,null,null,null,null,null,null,null,null,null,null,null,null,null,null,null,null,null,null,null,null,null,null,null,null,null,null,null,null,null,null,null,null,null,null,null,null,null,null,null,null,null,null,null,null,null,null,null,null,null,"N/A","N/A","N/A","N/A","N/A","N/A","N/A","N/A","N/A","N/A",1,1,1,1,1,1,1,1,1,1]
[null,null,null,null,null,null,null,null,null,null,null,null,null,null,null,null,null,null,null,null,null,null,null,null,null,null,null,null,null,null,null,null,null,null,null,null,null,null,null,null,null,null,null,null,null,null,null,null,null,null,"N/A","N/A","N/A","N/A","N/A","N/A","N/A","N/A","N/A","N/A",1,1,1,1,1,1,1,1,1,1]
[null,null,null,null,null,null,null,null,null,null,null,null,null,null,null,null,null,null,null,null,null,null,null,null,null,null,null,null,null,null,null,null,null,null,null,null,null,null,null,null,null,null,null,null,null,null,null,null,null,null,"N/A","N/A","N/A","N/A","N/A","N/A","N/A","N/A","N/A","N/A",1,1,1,1,1,1,1,1,1,1]
[null,null,null,null,null,null,null,null,null,null,null,null,null,null,null,null,null,null,null,null,null,null,null,null,null,null,null,null,null,null,null,null,null,null,null,null,null,null,null,null,null,null,null,null,null,null,null,null,null,null,"N/A","N/A","N/A","N/A","N/A","N/A","N/A","N/A","N/A","N/A",1,1,1,1,1,1,1,1,1,1]
[null,null,null,null,null,null,null,null,null,null,null,null,null,null,null,null,null,null,null,null,null,null,null,null,null,null,null,null,null,null,null,null,null,null,null,null,null,null,null,null,null,null,null,null,null,null,null,null,null,null,"N/A","N/A","N/A","N/A","N/A","N/A","N/A","N/A","N/A","N/A",1,1,1,1,1,1,1,1,1,1]
[null,null,null,null,null,null,null,null,null,null,null,null,null,null,null,null,null,null,null,null,null,null,null,null,null,null,null,null,null,null,null,null,null,null,null,null,null,null,null,null,null,null,null,null,null,null,null,null,null,null,"N/A","N/A","N/A","N/A","N/A","N/A","N/A","N/A","N/A","N/A",1,1,1,1,1,1,1,1,1,1]
[null,null,null,null,null,null,null,null,null,null,null,null,null,null,null,null,null,null,null,null,null,null,null,null,null,null,null,null,null,null,null,null,null,null,null,null,null,null,null,null,null,null,null,null,null,null,null,null,null,null,"N/A","N/A","N/A","N/A","N/A","N/A","N/A","N/A","N/A","N/A",1,1,1,1,1,1,1,1,1,1]
[null,null,null,null,null,null,null,null,null,null,null,null,null,null,null,null,null,null,null,null,null,null,null,null,null,null,null,null,null,null,null,null,null,null,null,null,null,null,null,null,null,null,null,null,null,null,null,null,null,null,"N/A","N/A","N/A","N/A","N/A","N/A","N/A","N/A","N/A","N/A",1,1,1,1,1,1,1,1,1,1]
[null,null,null,null,null,null,null,null,null,null,null,null,null,null,null,null,null,null,null,null,null,null,null,null,null,null,null,null,null,null,null,null,null,null,null,null,null,null,null,null,null,null,null,null,null,null,null,null,null,null,"N/A","N/A","N/A","N/A","N/A","N/A","N/A","N/A","N/A","N/A",1,1,1,1,1,1,1,1,1,1]
[null,null,null,null,null,null,null,null,null,null,null,null,null,null,null,null,null,null,null,null,null,null,null,null,null,null,null,null,null,null,null,null,null,null,null,null,null,null,null,null,null,null,null,null,null,null,null,null,null,null,"N/A","N/A","N/A","N/A","N/A","N/A","N/A","N/A","N/A","N/A",1,1,1,1,1,1,1,1,1,1]
[null,null,null,null,null,null,null,null,null,null,null,null,null,null,null,null,null,null,null,null,null,null,null,null,null,null,null,null,null,null,null,null,null,null,null,null,null,null,null,null,null,null,null,null,null,null,null,null,null,null,"N/A","N/A","N/A","N/A","N/A","N/A","N/A","N/A","N/A","N/A",1,1,1,1,1,1,1,1,1,1]
[null,null,null,null,null,null,null,null,null,null,null,null,null,null,null,null,null,null,null,null,null,null,null,null,null,null,null,null,null,null,null,null,null,null,null,null,null,null,null,null,null,null,null,null,null,null,null,null,null,null,"N/A","N/A","N/A","N/A","N/A","N/A","N/A","N/A","N/A","N/A",1,1,1,1,1,1,1,1,1,1]
[null,null,null,null,null,null,null,null,null,null,null,null,null,null,null,null,null,null,null,null,null,null,null,null,null,null,null,null,null,null,null,null,null,null,null,null,null,null,null,null,null,null,null,null,null,null,null,null,null,null,"N/A","N/A","N/A","N/A","N/A","N/A","N/A","N/A","N/A","N/A",1,1,1,1,1,1,1,1,1,1]
[null,null,null,null,null,null,null,null,null,null,null,null,null,null,null,null,null,null,null,null,null,null,null,null,null,null,null,null,null,null,null,null,null,null,null,null,null,null,null,null,null,null,null,null,null,null,null,null,null,null,"N/A","N/A","N/A","N/A","N/A","N/A","N/A","N/A","N/A","N/A",1,1,1,1,1,1,1,1,1,1]
[null,null,null,null,null,null,null,null,null,null,null,null,null,null,null,null,null,null,null,null,null,null,null,null,null,null,null,null,null,null,null,null,null,null,null,null,null,null,null,null,null,null,null,null,null,null,null,null,null,null,"N/A","N/A","N/A","N/A","N/A","N/A","N/A","N/A","N/A","N/A",1,1,1,1,1,1,1,1,1,1]
[null,null,null,null,null,null,null,null,null,null,null,null,null,null,null,null,null,null,null,null,null,null,null,null,null,null,null,null,null,null,null,null,null,null,null,null,null,null,null,null,null,null,null,null,null,null,null,null,null,null,"N/A","N/A","N/A","N/A","N/A","N/A","N/A","N/A","N/A","N/A",1,1,1,1,1,1,1,1,1,1]
[null,null,null,null,null,null,null,null,null,null,null,null,null,null,null,null,null,null,null,null,null,null,null,null,null,null,null,null,null,null,null,null,null,null,null,null,null,null,null,null,null,null,null,null,null,null,null,null,null,null,"N/A","N/A","N/A","N/A","N/A","N/A","N/A","N/A","N/A","N/A",1,1,1,1,1,1,1,1,1,1]
[null,null,null,null,null,null,null,null,null,null,null,null,null,null,null,null,null,null,null,null,null,null,null,null,null,null,null,null,null,null,null,null,null,null,null,null,null,null,null,null,null,null,null,null,null,null,null,null,null,null,"N/A","N/A","N/A","N/A","N/A","N/A","N/A","N/A","N/A","N/A",1,1,1,1,1,1,1,1,1,1]
[null,null,null,null,null,null,null,null,null,null,null,null,null,null,null,null,null,null,null,null,null,null,null,null,null,null,null,null,null,null,null,null,null,null,null,null,null,null,null,null,null,null,null,null,null,null,null,null,null,null,"N/A","N/A","N/A","N/A","N/A","N/A","N/A","N/A","N/A","N/A",1,1,1,1,1,1,1,1,1,1]
[null,null,null,null,null,null,null,null,null,null,null,null,null,null,null,null,null,null,null,null,null,null,null,null,null,null,null,null,null,null,null,null,null,null,null,null,null,null,null,null,null,null,null,null,null,null,null,null,null,null,{"$f":"IF(COUNTA(E1262:J1262)>0,(COUNTIF(E1262:J1262,\"=0\")*0+COUNTIF(E1262:J1262,\"=1\")*100+COUNTIF(E1262:J1262,\"=2\")*80+COUNTIF(E1262:J1262,\"=3\")*50+COUNTIF(E1262:J1262,\"=8\")*20+COUNTIF(E1262:J1262,\"=9\")*0)/COUNTA(E1262:J1262)/100,\"N/A\")","v":"N/A"},"N/A",{"$f":"IF(COUNTA(P1262:U1262)>0,(COUNTIF(P1262:U1262,\"=0\")*0+COUNTIF(P1262:U1262,\"=1\")*100+COUNTIF(P1262:U1262,\"=2\")*80+COUNTIF(P1262:U1262,\"=3\")*50+COUNTIF(P1262:U1262,\"=8\")*20+COUNTIF(P1262:U1262,\"=9\")*0)/COUNTA(P1262:U1262)/100,\"N/A\")","v":"N/A"},{"$f":"IF(COUNTA(V1262)<>0,(COUNTIF(V1262,\"=0\")*0+COUNTIF(V1262,\"=1\")*100+COUNTIF(V1262,\"=2\")*80+COUNTIF(V1262,\"=3\")*50+COUNTIF(V1262,\"=8\")*20+COUNTIF(V1262,\"=9\")*0)/COUNTA(V1262)/100,\"N/A\")","v":"N/A"},{"$f":"IF(COUNTA(W1262:X1262)>0,(COUNTIF(W1262:X1262,\"=0\")*0+COUNTIF(W1262:X1262,\"=1\")*100+COUNTIF(W1262:X1262,\"=2\")*80+COUNTIF(W1262:X1262,\"=3\")*50+COUNTIF(W1262:X1262,\"=8\")*20+COUNTIF(W1262:X1262,\"=9\")*0)/COUNTA(W1262:X1262)/100,\"N/A\")","v":"N/A"},{"$f":"IF(COUNTA(Y1262:AJ1262)>0,(COUNTIF(Y1262:AJ1262,\"=0\")*0+COUNTIF(Y1262:AJ1262,\"=1\")*100+COUNTIF(Y1262:AJ1262,\"=2\")*80+COUNTIF(Y1262:AJ1262,\"=3\")*50+COUNTIF(Y1262:AJ1262,\"=8\")*20+COUNTIF(Y1262:AJ1262,\"=9\")*0)/COUNTA(Y1262:AJ1262)/100,\"N/A\")","v":"N/A"},{"$f":"IF(COUNTA(AK1262:AP1262)>0,(COUNTIF(AK1262:AP1262,\"=0\")*0+COUNTIF(AK1262:AP1262,\"=1\")*100+COUNTIF(AK1262:AP1262,\"=2\")*80+COUNTIF(AK1262:AP1262,\"=3\")*50+COUNTIF(AK1262:AP1262,\"=8\")*20+COUNTIF(AK1262:AP1262,\"=9\")*0)/COUNTA(AK1262:AP1262)/100,\"N/A\")","v":"N/A"},{"$f":"IF(COUNTA(AQ1262:AU1262)>0,(COUNTIF(AQ1262:AU1262,\"=0\")*0+COUNTIF(AQ1262:AU1262,\"=1\")*100+COUNTIF(AQ1262:AU1262,\"=2\")*80+COUNTIF(AQ1262:AU1262,\"=3\")*50+COUNTIF(AQ1262:AU1262,\"=8\")*20+COUNTIF(AQ1262:AU1262,\"=9\")*0)/COUNTA(AQ1262:AU1262)/100,\"N/A\")","v":"N/A"},{"$f":"IF(COUNTA(AV1262:AX1262)>0,(COUNTIF(AV1262:AX1262,\"=0\")*0+COUNTIF(AV1262:AX1262,\"=1\")*100+COUNTIF(AV1262:AX1262,\"=2\")*80+COUNTIF(AV1262:AX1262,\"=3\")*50+COUNTIF(AV1262:AX1262,\"=8\")*20+COUNTIF(AV1262:AX1262,\"=9\")*0)/COUNTA(AV1262:AX1262)/100,\"N/A\")","v":"N/A"},{"$f":"IF(AND(COUNTA(E1262:AX1262)<>0,B1262<>\"\"),AVERAGE(BA1262:BG1262),\"N/A\")","v":"N/A"},1,1,1,1,1,1,1,1,1,1]
[null,null,null,null,null,null,null,null,null,null,null,null,null,null,null,null,null,null,null,null,null,null,null,null,null,null,null,null,null,null,null,null,null,null,null,null,null,null,null,null,null,null,null,null,null,null,null,null,null,null,"N/A","N/A","N/A","N/A","N/A","N/A","N/A","N/A","N/A","N/A",1,1,1,1,1,1,1,1,1,1]
[null,null,null,null,null,null,null,null,null,null,null,null,null,null,null,null,null,null,null,null,null,null,null,null,null,null,null,null,null,null,null,null,null,null,null,null,null,null,null,null,null,null,null,null,null,null,null,null,null,null,"N/A","N/A","N/A","N/A","N/A","N/A","N/A","N/A","N/A","N/A",1,1,1,1,1,1,1,1,1,1]
[null,null,null,null,null,null,null,null,null,null,null,null,null,null,null,null,null,null,null,null,null,null,null,null,null,null,null,null,null,null,null,null,null,null,null,null,null,null,null,null,null,null,null,null,null,null,null,null,null,null,"N/A","N/A","N/A","N/A","N/A","N/A","N/A","N/A","N/A","N/A",1,1,1,1,1,1,1,1,1,1]
[null,null,null,null,null,null,null,null,null,null,null,null,null,null,null,null,null,null,null,null,null,null,null,null,null,null,null,null,null,null,null,null,null,null,null,null,null,null,null,null,null,null,null,null,null,null,null,null,null,null,"N/A",{"$f":"IF(COUNTA(K1266:O1266)>0,(COUNTIF(K1266:O1266,\"=0\")*0+COUNTIF(K1266:O1266,\"=1\")*100+COUNTIF(K1266:O1266,\"=2\")*80+COUNTIF(K1266:O1266,\"=3\")*50+COUNTIF(K1266:O1266,\"=8\")*20+COUNTIF(K1266:O1266,\"=9\")*0)/COUNTA(K1266:O1266)/100,\"N/A\")","v":"N/A"},"N/A","N/A","N/A","N/A","N/A","N/A","N/A","N/A",1,1,1,1,1,1,1,1,1,1]
[null,null,null,null,null,null,null,null,null,null,null,null,null,null,null,null,null,null,null,null,null,null,null,null,null,null,null,null,null,null,null,null,null,null,null,null,null,null,null,null,null,null,null,null,null,null,null,null,null,null,"N/A","N/A","N/A","N/A","N/A","N/A","N/A","N/A","N/A","N/A",1,1,1,1,1,1,1,1,1,1]
[null,null,null,null,null,null,null,null,null,null,null,null,null,null,null,null,null,null,null,null,null,null,null,null,null,null,null,null,null,null,null,null,null,null,null,null,null,null,null,null,null,null,null,null,null,null,null,null,null,null,"N/A","N/A","N/A","N/A","N/A","N/A","N/A","N/A","N/A","N/A",1,1,1,1,1,1,1,1,1,1]
[null,null,null,null,null,null,null,null,null,null,null,null,null,null,null,null,null,null,null,null,null,null,null,null,null,null,null,null,null,null,null,null,null,null,null,null,null,null,null,null,null,null,null,null,null,null,null,null,null,null,"N/A","N/A","N/A","N/A","N/A","N/A","N/A","N/A","N/A","N/A",1,1,1,1,1,1,1,1,1,1]
[null,null,null,null,null,null,null,null,null,null,null,null,null,null,null,null,null,null,null,null,null,null,null,null,null,null,null,null,null,null,null,null,null,null,null,null,null,null,null,null,null,null,null,null,null,null,null,null,null,null,"N/A","N/A","N/A","N/A","N/A","N/A","N/A","N/A","N/A","N/A",1,1,1,1,1,1,1,1,1,1]
[null,null,null,null,null,null,null,null,null,null,null,null,null,null,null,null,null,null,null,null,null,null,null,null,null,null,null,null,null,null,null,null,null,null,null,null,null,null,null,null,null,null,null,null,null,null,null,null,null,null,"N/A","N/A","N/A","N/A","N/A","N/A","N/A","N/A","N/A","N/A",1,1,1,1,1,1,1,1,1,1]
[null,null,null,null,null,null,null,null,null,null,null,null,null,null,null,null,null,null,null,null,null,null,null,null,null,null,null,null,null,null,null,null,null,null,null,null,null,null,null,null,null,null,null,null,null,null,null,null,null,null,"N/A","N/A","N/A","N/A","N/A","N/A","N/A","N/A","N/A","N/A",1,1,1,1,1,1,1,1,1,1]
[null,null,null,null,null,null,null,null,null,null,null,null,null,null,null,null,null,null,null,null,null,null,null,null,null,null,null,null,null,null,null,null,null,null,null,null,null,null,null,null,null,null,null,null,null,null,null,null,null,null,"N/A","N/A","N/A","N/A","N/A","N/A","N/A","N/A","N/A","N/A",1,1,1,1,1,1,1,1,1,{"$f":"IF(BH1273=\"N/A\",1,\"\")","v":1}]
[null,null,null,null,null,null,null,null,null,null,null,null,null,null,null,null,null,null,null,null,null,null,null,null,null,null,null,null,null,null,null,null,null,null,null,null,null,null,null,null,null,null,null,null,null,null,null,null,null,null,"N/A","N/A","N/A","N/A","N/A","N/A","N/A","N/A","N/A","N/A",{"$f":"IF(AY1274=\"N/A\",1,\"\")","v":1},{"$f":"IF(AZ1274=\"N/A\",1,\"\")","v":1},{"$f":"IF(BA1274=\"N/A\",1,\"\")","v":1},{"$f":"IF(BB1274=\"N/A\",1,\"\")","v":1},{"$f":"IF(BC1274=\"N/A\",1,\"\")","v":1},{"$f":"IF(BD1274=\"N/A\",1,\"\")","v":1},{"$f":"IF(BE1274=\"N/A\",1,\"\")","v":1},1,1,1]
[null,null,null,null,null,null,null,null,null,null,null,null,null,null,null,null,null,null,null,null,null,null,null,null,null,null,null,null,null,null,null,null,null,null,null,null,null,null,null,null,null,null,null,null,null,null,null,null,null,null,"N/A","N/A","N/A","N/A","N/A","N/A","N/A","N/A","N/A","N/A",1,1,1,1,1,1,1,1,1,1]
[null,null,null,null,null,null,null,null,null,null,null,null,null,null,null,null,null,null,null,null,null,null,null,null,null,null,null,null,null,null,null,null,null,null,null,null,null,null,null,null,null,null,null,null,null,null,null,null,null,null,"N/A","N/A","N/A","N/A","N/A","N/A","N/A","N/A","N/A","N/A",1,1,1,1,1,1,1,1,1,1]
[null,null,null,null,null,null,null,null,null,null,null,null,null,null,null,null,null,null,null,null,null,null,null,null,null,null,null,null,null,null,null,null,null,null,null,null,null,null,null,null,null,null,null,null,null,null,null,null,null,null,"N/A","N/A","N/A","N/A","N/A","N/A","N/A","N/A","N/A","N/A",1,1,1,1,1,1,1,1,1,1]
[null,null,null,null,null,null,null,null,null,null,null,null,null,null,null,null,null,null,null,null,null,null,null,null,null,null,null,null,null,null,null,null,null,null,null,null,null,null,null,null,null,null,null,null,null,null,null,null,null,null,"N/A","N/A","N/A","N/A","N/A","N/A","N/A","N/A","N/A","N/A",1,1,1,1,1,1,1,1,1,1]
[null,null,null,null,null,null,null,null,null,null,null,null,null,null,null,null,null,null,null,null,null,null,null,null,null,null,null,null,null,null,null,null,null,null,null,null,null,null,null,null,null,null,null,null,null,null,null,null,null,null,"N/A","N/A","N/A","N/A","N/A","N/A","N/A","N/A","N/A","N/A",1,1,1,1,1,1,1,1,1,1]
[null,null,null,null,null,null,null,null,null,null,null,null,null,null,null,null,null,null,null,null,null,null,null,null,null,null,null,null,null,null,null,null,null,null,null,null,null,null,null,null,null,null,null,null,null,null,null,null,null,null,"N/A","N/A","N/A","N/A","N/A","N/A","N/A","N/A","N/A","N/A",1,1,1,1,1,1,1,1,1,1]
[null,null,null,null,null,null,null,null,null,null,null,null,null,null,null,null,null,null,null,null,null,null,null,null,null,null,null,null,null,null,null,null,null,null,null,null,null,null,null,null,null,null,null,null,null,null,null,null,null,null,"N/A","N/A","N/A","N/A","N/A","N/A","N/A","N/A","N/A","N/A",1,1,1,1,1,1,1,1,1,1]
[null,null,null,null,null,null,null,null,null,null,null,null,null,null,null,null,null,null,null,null,null,null,null,null,null,null,null,null,null,null,null,null,null,null,null,null,null,null,null,null,null,null,null,null,null,null,null,null,null,null,"N/A","N/A","N/A","N/A","N/A","N/A","N/A","N/A","N/A","N/A",1,1,1,1,1,1,1,1,1,1]
[null,null,null,null,null,null,null,null,null,null,null,null,null,null,null,null,null,null,null,null,null,null,null,null,null,null,null,null,null,null,null,null,null,null,null,null,null,null,null,null,null,null,null,null,null,null,null,null,null,null,"N/A","N/A","N/A","N/A","N/A","N/A","N/A","N/A","N/A","N/A",1,1,1,1,1,1,1,1,1,1]
[null,null,null,null,null,null,null,null,null,null,null,null,null,null,null,null,null,null,null,null,null,null,null,null,null,null,null,null,null,null,null,null,null,null,null,null,null,null,null,null,null,null,null,null,null,null,null,null,null,null,"N/A","N/A","N/A","N/A","N/A","N/A","N/A","N/A","N/A","N/A",1,1,1,1,1,1,1,1,1,1]
[null,null,null,null,null,null,null,null,null,null,null,null,null,null,null,null,null,null,null,null,null,null,null,null,null,null,null,null,null,null,null,null,null,null,null,null,null,null,null,null,null,null,null,null,null,null,null,null,null,null,"N/A","N/A","N/A","N/A","N/A","N/A","N/A","N/A","N/A","N/A",1,1,1,1,1,1,1,1,1,1]
[null,null,null,null,null,null,null,null,null,null,null,null,null,null,null,null,null,null,null,null,null,null,null,null,null,null,null,null,null,null,null,null,null,null,null,null,null,null,null,null,null,null,null,null,null,null,null,null,null,null,"N/A","N/A","N/A","N/A","N/A","N/A","N/A","N/A","N/A","N/A",1,1,1,1,1,1,1,1,1,1]
[null,null,null,null,null,null,null,null,null,null,null,null,null,null,null,null,null,null,null,null,null,null,null,null,null,null,null,null,null,null,null,null,null,null,null,null,null,null,null,null,null,null,null,null,null,null,null,null,null,null,"N/A","N/A","N/A","N/A","N/A","N/A","N/A","N/A","N/A","N/A",1,1,1,1,1,1,1,1,1,1]
[null,null,null,null,null,null,null,null,null,null,null,null,null,null,null,null,null,null,null,null,null,null,null,null,null,null,null,null,null,null,null,null,null,null,null,null,null,null,null,null,null,null,null,null,null,null,null,null,null,null,"N/A","N/A","N/A","N/A","N/A","N/A","N/A","N/A","N/A","N/A",1,1,1,1,1,1,1,1,1,1]
[null,null,null,null,null,null,null,null,null,null,null,null,null,null,null,null,null,null,null,null,null,null,null,null,null,null,null,null,null,null,null,null,null,null,null,null,null,null,null,null,null,null,null,null,null,null,null,null,null,null,"N/A","N/A","N/A","N/A","N/A","N/A","N/A","N/A","N/A","N/A",1,1,1,1,1,1,1,1,1,1]
[null,null,null,null,null,null,null,null,null,null,null,null,null,null,null,null,null,null,null,null,null,null,null,null,null,null,null,null,null,null,null,null,null,null,null,null,null,null,null,null,null,null,null,null,null,null,null,null,null,null,"N/A","N/A","N/A","N/A","N/A","N/A","N/A","N/A","N/A","N/A",1,1,1,1,1,1,1,1,1,1]
[null,null,null,null,null,null,null,null,null,null,null,null,null,null,null,null,null,null,null,null,null,null,null,null,null,null,null,null,null,null,null,null,null,null,null,null,null,null,null,null,null,null,null,null,null,null,null,null,null,null,"N/A","N/A","N/A","N/A","N/A","N/A","N/A","N/A","N/A","N/A",1,1,1,1,1,1,1,1,1,1]
[null,null,null,null,null,null,null,null,null,null,null,null,null,null,null,null,null,null,null,null,null,null,null,null,null,null,null,null,null,null,null,null,null,null,null,null,null,null,null,null,null,null,null,null,null,null,null,null,null,null,"N/A","N/A","N/A","N/A","N/A","N/A","N/A","N/A","N/A","N/A",1,1,1,1,1,1,1,1,1,1]
[null,null,null,null,null,null,null,null,null,null,null,null,null,null,null,null,null,null,null,null,null,null,null,null,null,null,null,null,null,null,null,null,null,null,null,null,null,null,null,null,null,null,null,null,null,null,null,null,null,null,"N/A","N/A","N/A","N/A","N/A","N/A","N/A","N/A","N/A","N/A",1,1,1,1,1,1,1,1,1,1]
[null,null,null,null,null,null,null,null,null,null,null,null,null,null,null,null,null,null,null,null,null,null,null,null,null,null,null,null,null,null,null,null,null,null,null,null,null,null,null,null,null,null,null,null,null,null,null,null,null,null,"N/A","N/A","N/A","N/A","N/A","N/A","N/A","N/A","N/A","N/A",1,1,1,1,1,1,1,1,1,1]
[null,null,null,null,null,null,null,null,null,null,null,null,null,null,null,null,null,null,null,null,null,null,null,null,null,null,null,null,null,null,null,null,null,null,null,null,null,null,null,null,null,null,null,null,null,null,null,null,null,null,"N/A","N/A","N/A","N/A","N/A","N/A","N/A","N/A","N/A","N/A",1,1,1,1,1,1,1,1,1,1]
[null,null,null,null,null,null,null,null,null,null,null,null,null,null,null,null,null,null,null,null,null,null,null,null,null,null,null,null,null,null,null,null,null,null,null,null,null,null,null,null,null,null,null,null,null,null,null,null,null,null,"N/A","N/A","N/A","N/A","N/A","N/A","N/A","N/A","N/A","N/A",1,1,1,1,1,1,1,{"$f":"IF(BF1296=\"N/A\",1,\"\")","v":1},{"$f":"IF(BG1296=\"N/A\",1,\"\")","v":1},1]
[null,null,null,null,null,null,null,null,null,null,null,null,null,null,null,null,null,null,null,null,null,null,null,null,null,null,null,null,null,null,null,null,null,null,null,null,null,null,null,null,null,null,null,null,null,null,null,null,null,null,"N/A","N/A","N/A","N/A","N/A","N/A","N/A","N/A","N/A","N/A",1,1,1,1,1,1,1,1,1,1]
[null,null,null,null,null,null,null,null,null,null,null,null,null,null,null,null,null,null,null,null,null,null,null,null,null,null,null,null,null,null,null,null,null,null,null,null,null,null,null,null,null,null,null,null,null,null,null,null,null,null,"N/A","N/A","N/A","N/A","N/A","N/A","N/A","N/A","N/A","N/A",1,1,1,1,1,1,1,1,1,1]
[null,null,null,null,null,null,null,null,null,null,null,null,null,null,null,null,null,null,null,null,null,null,null,null,null,null,null,null,null,null,null,null,null,null,null,null,null,null,null,null,null,null,null,null,null,null,null,null,null,null,"N/A","N/A","N/A","N/A","N/A","N/A","N/A","N/A","N/A","N/A",1,1,1,1,1,1,1,1,1,1]
[null,null,null,null,null,null,null,null,null,null,null,null,null,null,null,null,null,null,null,null,null,null,null,null,null,null,null,null,null,null,null,null,null,null,null,null,null,null,null,null,null,null,null,null,null,null,null,null,null,null,"N/A","N/A","N/A","N/A","N/A","N/A","N/A","N/A","N/A","N/A",1,1,1,1,1,1,1,1,1,1]
[null,null,null,null,null,null,null,null,null,null,null,null,null,null,null,null,null,null,null,null,null,null,null,null,null,null,null,null,null,null,null,null,null,null,null,null,null,null,null,null,null,null,null,null,null,null,null,null,null,null,"N/A","N/A","N/A","N/A","N/A","N/A","N/A","N/A","N/A","N/A",1,1,1,1,1,1,1,1,1,1]
[null,null,null,null,null,null,null,null,null,null,null,null,null,null,null,null,null,null,null,null,null,null,null,null,null,null,null,null,null,null,null,null,null,null,null,null,null,null,null,null,null,null,null,null,null,null,null,null,null,null,"N/A","N/A","N/A","N/A","N/A","N/A","N/A","N/A","N/A","N/A",1,1,1,1,1,1,1,1,1,1]
[null,null,null,null,null,null,null,null,null,null,null,null,null,null,null,null,null,null,null,null,null,null,null,null,null,null,null,null,null,null,null,null,null,null,null,null,null,null,null,null,null,null,null,null,null,null,null,null,null,null,"N/A","N/A","N/A","N/A","N/A","N/A","N/A","N/A","N/A","N/A",1,1,1,1,1,1,1,1,1,1]
[null,null,null,null,null,null,null,null,null,null,null,null,null,null,null,null,null,null,null,null,null,null,null,null,null,null,null,null,null,null,null,null,null,null,null,null,null,null,null,null,null,null,null,null,null,null,null,null,null,null,"N/A","N/A","N/A","N/A","N/A","N/A","N/A","N/A","N/A","N/A",1,1,1,1,1,1,1,1,1,1]
[null,null,null,null,null,null,null,null,null,null,null,null,null,null,null,null,null,null,null,null,null,null,null,null,null,null,null,null,null,null,null,null,null,null,null,null,null,null,null,null,null,null,null,null,null,null,null,null,null,null,"N/A","N/A","N/A","N/A","N/A","N/A","N/A","N/A","N/A","N/A",1,1,1,1,1,1,1,1,1,1]
[null,null,null,null,null,null,null,null,null,null,null,null,null,null,null,null,null,null,null,null,null,null,null,null,null,null,null,null,null,null,null,null,null,null,null,null,null,null,null,null,null,null,null,null,null,null,null,null,null,null,"N/A","N/A","N/A","N/A","N/A","N/A","N/A","N/A","N/A","N/A",1,1,1,1,1,1,1,1,1,1]
[null,null,null,null,null,null,null,null,null,null,null,null,null,null,null,null,null,null,null,null,null,null,null,null,null,null,null,null,null,null,null,null,null,null,null,null,null,null,null,null,null,null,null,null,null,null,null,null,null,null,"N/A","N/A","N/A","N/A","N/A","N/A","N/A","N/A","N/A","N/A",1,1,1,1,1,1,1,1,1,1]
[null,null,null,null,null,null,null,null,null,null,null,null,null,null,null,null,null,null,null,null,null,null,null,null,null,null,null,null,null,null,null,null,null,null,null,null,null,null,null,null,null,null,null,null,null,null,null,null,null,null,"N/A","N/A","N/A","N/A","N/A","N/A","N/A","N/A","N/A","N/A",1,1,1,1,1,1,1,1,1,1]
[null,null,null,null,null,null,null,null,null,null,null,null,null,null,null,null,null,null,null,null,null,null,null,null,null,null,null,null,null,null,null,null,null,null,null,null,null,null,null,null,null,null,null,null,null,null,null,null,null,null,"N/A","N/A","N/A","N/A","N/A","N/A","N/A","N/A","N/A","N/A",1,1,1,1,1,1,1,1,1,1]
[null,null,null,null,null,null,null,null,null,null,null,null,null,null,null,null,null,null,null,null,null,null,null,null,null,null,null,null,null,null,null,null,null,null,null,null,null,null,null,null,null,null,null,null,null,null,null,null,null,null,"N/A","N/A","N/A","N/A","N/A","N/A","N/A","N/A","N/A","N/A",1,1,1,1,1,1,1,1,1,1]
[null,null,null,null,null,null,null,null,null,null,null,null,null,null,null,null,null,null,null,null,null,null,null,null,null,null,null,null,null,null,null,null,null,null,null,null,null,null,null,null,null,null,null,null,null,null,null,null,null,null,"N/A","N/A","N/A","N/A","N/A","N/A","N/A","N/A","N/A","N/A",1,1,1,1,1,1,1,1,1,1]
[null,null,null,null,null,null,null,null,null,null,null,null,null,null,null,null,null,null,null,null,null,null,null,null,null,null,null,null,null,null,null,null,null,null,null,null,null,null,null,null,null,null,null,null,null,null,null,null,null,null,"N/A","N/A","N/A","N/A","N/A","N/A","N/A","N/A","N/A","N/A",1,1,1,1,1,1,1,1,1,1]
[null,null,null,null,null,null,null,null,null,null,null,null,null,null,null,null,null,null,null,null,null,null,null,null,null,null,null,null,null,null,null,null,null,null,null,null,null,null,null,null,null,null,null,null,null,null,null,null,null,null,"N/A","N/A","N/A","N/A","N/A","N/A","N/A","N/A","N/A","N/A",1,1,1,1,1,1,1,1,1,1]
[null,null,null,null,null,null,null,null,null,null,null,null,null,null,null,null,null,null,null,null,null,null,null,null,null,null,null,null,null,null,null,null,null,null,null,null,null,null,null,null,null,null,null,null,null,null,null,null,null,null,"N/A","N/A","N/A","N/A","N/A","N/A","N/A","N/A","N/A","N/A",1,1,1,1,1,1,1,1,1,1]
[null,null,null,null,null,null,null,null,null,null,null,null,null,null,null,null,null,null,null,null,null,null,null,null,null,null,null,null,null,null,null,null,null,null,null,null,null,null,null,null,null,null,null,null,null,null,null,null,null,null,"N/A","N/A","N/A","N/A","N/A","N/A","N/A","N/A","N/A","N/A",1,1,1,1,1,1,1,1,1,1]
[null,null,null,null,null,null,null,null,null,null,null,null,null,null,null,null,null,null,null,null,null,null,null,null,null,null,null,null,null,null,null,null,null,null,null,null,null,null,null,null,null,null,null,null,null,null,null,null,null,null,"N/A","N/A","N/A","N/A","N/A","N/A","N/A","N/A","N/A","N/A",1,1,1,1,1,1,1,1,1,1]
[null,null,null,null,null,null,null,null,null,null,null,null,null,null,null,null,null,null,null,null,null,null,null,null,null,null,null,null,null,null,null,null,null,null,null,null,null,null,null,null,null,null,null,null,null,null,null,null,null,null,"N/A","N/A","N/A","N/A","N/A","N/A","N/A","N/A","N/A","N/A",1,1,1,1,1,1,1,1,1,1]
[null,null,null,null,null,null,null,null,null,null,null,null,null,null,null,null,null,null,null,null,null,null,null,null,null,null,null,null,null,null,null,null,null,null,null,null,null,null,null,null,null,null,null,null,null,null,null,null,null,null,"N/A","N/A","N/A","N/A","N/A","N/A","N/A","N/A","N/A","N/A",1,1,1,1,1,1,1,1,1,1]
[null,null,null,null,null,null,null,null,null,null,null,null,null,null,null,null,null,null,null,null,null,null,null,null,null,null,null,null,null,null,null,null,null,null,null,null,null,null,null,null,null,null,null,null,null,null,null,null,null,null,"N/A","N/A","N/A","N/A","N/A","N/A","N/A","N/A","N/A","N/A",1,1,1,1,1,1,1,1,1,1]
[null,null,null,null,null,null,null,null,null,null,null,null,null,null,null,null,null,null,null,null,null,null,null,null,null,null,null,null,null,null,null,null,null,null,null,null,null,null,null,null,null,null,null,null,null,null,null,null,null,null,"N/A","N/A","N/A","N/A","N/A","N/A","N/A","N/A","N/A","N/A",1,1,1,1,1,1,1,1,1,1]
[null,null,null,null,null,null,null,null,null,null,null,null,null,null,null,null,null,null,null,null,null,null,null,null,null,null,null,null,null,null,null,null,null,null,null,null,null,null,null,null,null,null,null,null,null,null,null,null,null,null,"N/A","N/A","N/A","N/A","N/A","N/A","N/A","N/A","N/A","N/A",1,1,1,1,1,1,1,1,1,1]
[null,null,null,null,null,null,null,null,null,null,null,null,null,null,null,null,null,null,null,null,null,null,null,null,null,null,null,null,null,null,null,null,null,null,null,null,null,null,null,null,null,null,null,null,null,null,null,null,null,null,"N/A","N/A","N/A","N/A","N/A","N/A","N/A","N/A","N/A","N/A",1,1,1,1,1,1,1,1,1,1]
[null,null,null,null,null,null,null,null,null,null,null,null,null,null,null,null,null,null,null,null,null,null,null,null,null,null,null,null,null,null,null,null,null,null,null,null,null,null,null,null,null,null,null,null,null,null,null,null,null,null,"N/A","N/A","N/A","N/A","N/A","N/A","N/A","N/A","N/A","N/A",1,1,1,1,1,1,1,1,1,1]
[null,null,null,null,null,null,null,null,null,null,null,null,null,null,null,null,null,null,null,null,null,null,null,null,null,null,null,null,null,null,null,null,null,null,null,null,null,null,null,null,null,null,null,null,null,null,null,null,null,null,"N/A","N/A","N/A","N/A","N/A","N/A","N/A","N/A","N/A","N/A",1,1,1,1,1,1,1,1,1,1]
[null,null,null,null,null,null,null,null,null,null,null,null,null,null,null,null,null,null,null,null,null,null,null,null,null,null,null,null,null,null,null,null,null,null,null,null,null,null,null,null,null,null,null,null,null,null,null,null,null,null,"N/A","N/A","N/A","N/A","N/A","N/A","N/A","N/A","N/A","N/A",1,1,1,1,1,1,1,1,1,1]
[null,null,null,null,null,null,null,null,null,null,null,null,null,null,null,null,null,null,null,null,null,null,null,null,null,null,null,null,null,null,null,null,null,null,null,null,null,null,null,null,null,null,null,null,null,null,null,null,null,null,{"$f":"IF(COUNTA(E1326:J1326)>0,(COUNTIF(E1326:J1326,\"=0\")*0+COUNTIF(E1326:J1326,\"=1\")*100+COUNTIF(E1326:J1326,\"=2\")*80+COUNTIF(E1326:J1326,\"=3\")*50+COUNTIF(E1326:J1326,\"=8\")*20+COUNTIF(E1326:J1326,\"=9\")*0)/COUNTA(E1326:J1326)/100,\"N/A\")","v":"N/A"},"N/A",{"$f":"IF(COUNTA(P1326:U1326)>0,(COUNTIF(P1326:U1326,\"=0\")*0+COUNTIF(P1326:U1326,\"=1\")*100+COUNTIF(P1326:U1326,\"=2\")*80+COUNTIF(P1326:U1326,\"=3\")*50+COUNTIF(P1326:U1326,\"=8\")*20+COUNTIF(P1326:U1326,\"=9\")*0)/COUNTA(P1326:U1326)/100,\"N/A\")","v":"N/A"},{"$f":"IF(COUNTA(V1326)<>0,(COUNTIF(V1326,\"=0\")*0+COUNTIF(V1326,\"=1\")*100+COUNTIF(V1326,\"=2\")*80+COUNTIF(V1326,\"=3\")*50+COUNTIF(V1326,\"=8\")*20+COUNTIF(V1326,\"=9\")*0)/COUNTA(V1326)/100,\"N/A\")","v":"N/A"},{"$f":"IF(COUNTA(W1326:X1326)>0,(COUNTIF(W1326:X1326,\"=0\")*0+COUNTIF(W1326:X1326,\"=1\")*100+COUNTIF(W1326:X1326,\"=2\")*80+COUNTIF(W1326:X1326,\"=3\")*50+COUNTIF(W1326:X1326,\"=8\")*20+COUNTIF(W1326:X1326,\"=9\")*0)/COUNTA(W1326:X1326)/100,\"N/A\")","v":"N/A"},{"$f":"IF(COUNTA(Y1326:AJ1326)>0,(COUNTIF(Y1326:AJ1326,\"=0\")*0+COUNTIF(Y1326:AJ1326,\"=1\")*100+COUNTIF(Y1326:AJ1326,\"=2\")*80+COUNTIF(Y1326:AJ1326,\"=3\")*50+COUNTIF(Y1326:AJ1326,\"=8\")*20+COUNTIF(Y1326:AJ1326,\"=9\")*0)/COUNTA(Y1326:AJ1326)/100,\"N/A\")","v":"N/A"},{"$f":"IF(COUNTA(AK1326:AP1326)>0,(COUNTIF(AK1326:AP1326,\"=0\")*0+COUNTIF(AK1326:AP1326,\"=1\")*100+COUNTIF(AK1326:AP1326,\"=2\")*80+COUNTIF(AK1326:AP1326,\"=3\")*50+COUNTIF(AK1326:AP1326,\"=8\")*20+COUNTIF(AK1326:AP1326,\"=9\")*0)/COUNTA(AK1326:AP1326)/100,\"N/A\")","v":"N/A"},{"$f":"IF(COUNTA(AQ1326:AU1326)>0,(COUNTIF(AQ1326:AU1326,\"=0\")*0+COUNTIF(AQ1326:AU1326,\"=1\")*100+COUNTIF(AQ1326:AU1326,\"=2\")*80+COUNTIF(AQ1326:AU1326,\"=3\")*50+COUNTIF(AQ1326:AU1326,\"=8\")*20+COUNTIF(AQ1326:AU1326,\"=9\")*0)/COUNTA(AQ1326:AU1326)/100,\"N/A\")","v":"N/A"},{"$f":"IF(COUNTA(AV1326:AX1326)>0,(COUNTIF(AV1326:AX1326,\"=0\")*0+COUNTIF(AV1326:AX1326,\"=1\")*100+COUNTIF(AV1326:AX1326,\"=2\")*80+COUNTIF(AV1326:AX1326,\"=3\")*50+COUNTIF(AV1326:AX1326,\"=8\")*20+COUNTIF(AV1326:AX1326,\"=9\")*0)/COUNTA(AV1326:AX1326)/100,\"N/A\")","v":"N/A"},{"$f":"IF(AND(COUNTA(E1326:AX1326)<>0,B1326<>\"\"),AVERAGE(BA1326:BG1326),\"N/A\")","v":"N/A"},1,1,1,1,1,1,1,1,1,1]
[null,null,null,null,null,null,null,null,null,null,null,null,null,null,null,null,null,null,null,null,null,null,null,null,null,null,null,null,null,null,null,null,null,null,null,null,null,null,null,null,null,null,null,null,null,null,null,null,null,null,"N/A","N/A","N/A","N/A","N/A","N/A","N/A","N/A","N/A","N/A",1,1,1,1,1,1,1,1,1,1]
[null,null,null,null,null,null,null,null,null,null,null,null,null,null,null,null,null,null,null,null,null,null,null,null,null,null,null,null,null,null,null,null,null,null,null,null,null,null,null,null,null,null,null,null,null,null,null,null,null,null,"N/A","N/A","N/A","N/A","N/A","N/A","N/A","N/A","N/A","N/A",1,1,1,1,1,1,1,1,1,1]
[null,null,null,null,null,null,null,null,null,null,null,null,null,null,null,null,null,null,null,null,null,null,null,null,null,null,null,null,null,null,null,null,null,null,null,null,null,null,null,null,null,null,null,null,null,null,null,null,null,null,"N/A","N/A","N/A","N/A","N/A","N/A","N/A","N/A","N/A","N/A",1,1,1,1,1,1,1,1,1,1]
[null,null,null,null,null,null,null,null,null,null,null,null,null,null,null,null,null,null,null,null,null,null,null,null,null,null,null,null,null,null,null,null,null,null,null,null,null,null,null,null,null,null,null,null,null,null,null,null,null,null,"N/A",{"$f":"IF(COUNTA(K1330:O1330)>0,(COUNTIF(K1330:O1330,\"=0\")*0+COUNTIF(K1330:O1330,\"=1\")*100+COUNTIF(K1330:O1330,\"=2\")*80+COUNTIF(K1330:O1330,\"=3\")*50+COUNTIF(K1330:O1330,\"=8\")*20+COUNTIF(K1330:O1330,\"=9\")*0)/COUNTA(K1330:O1330)/100,\"N/A\")","v":"N/A"},"N/A","N/A","N/A","N/A","N/A","N/A","N/A","N/A",1,1,1,1,1,1,1,1,1,1]
[null,null,null,null,null,null,null,null,null,null,null,null,null,null,null,null,null,null,null,null,null,null,null,null,null,null,null,null,null,null,null,null,null,null,null,null,null,null,null,null,null,null,null,null,null,null,null,null,null,null,"N/A","N/A","N/A","N/A","N/A","N/A","N/A","N/A","N/A","N/A",1,1,1,1,1,1,1,1,1,1]
[null,null,null,null,null,null,null,null,null,null,null,null,null,null,null,null,null,null,null,null,null,null,null,null,null,null,null,null,null,null,null,null,null,null,null,null,null,null,null,null,null,null,null,null,null,null,null,null,null,null,"N/A","N/A","N/A","N/A","N/A","N/A","N/A","N/A","N/A","N/A",1,1,1,1,1,1,1,1,1,1]
[null,null,null,null,null,null,null,null,null,null,null,null,null,null,null,null,null,null,null,null,null,null,null,null,null,null,null,null,null,null,null,null,null,null,null,null,null,null,null,null,null,null,null,null,null,null,null,null,null,null,"N/A","N/A","N/A","N/A","N/A","N/A","N/A","N/A","N/A","N/A",1,1,1,1,1,1,1,1,1,1]
[null,null,null,null,null,null,null,null,null,null,null,null,null,null,null,null,null,null,null,null,null,null,null,null,null,null,null,null,null,null,null,null,null,null,null,null,null,null,null,null,null,null,null,null,null,null,null,null,null,null,"N/A","N/A","N/A","N/A","N/A","N/A","N/A","N/A","N/A","N/A",1,1,1,1,1,1,1,1,1,1]

{"sheet":"Synthèse","index":2,"n_rows":5,"n_cols":12,"rows_kept":5,"cut":false,"hidden":false,"merged":[[0,2,0,11]]}
[null,null,"Seuls les élèves ayant obtenu des scores inférieurs à 50 % aux évaluations de janvier 2014 sont concernés par les champs surlignés en jaune.\nCes nouveaux résultats ne sont pas pris en compte pour le calcul du score global."]
[null,null,"Filtre\nIdentification des mots","Filtre\nCompréhension","Filtre\nMots outils","Filtre\nLecture à haute voix","Filtre\nGrammaire : Phrases","Filtre\nGrammaire : accords","Filtre\nVocabulaire","Filtre\nOrthographe","Filtre\nÉcrire","Filtre\nIdentification des mots"]
["Étiquettes de lignes","Nombre\nd'élèves","Moyenne de Lire :\nidentification des\nmots","Moyenne de Lire :\ncompréhension","Moyenne de Lire :\nmots outils","Moyenne de Lire :\nLecture à haute\nvoix","Moyenne de\nGrammaire :\nphrases","Moyenne de\nGrammaire :\naccords","Moyenne de\nVocabulaire","Moyenne de\nOrthographe","Moyenne de\nÉcrire","Score Global\nItems communs à tous les élèves"]
["(vide)",null,"...","...","...","...","...","...","...","...","...","..."]
["Total général",null,"...","...","...","...","...","...","...","...","...","..."]